{"text_format":"1","workbook":"xlsx","n_sheets":3,"sheets":["Ark1","Ark2","Ark3"],"not_rendered":{"charts":0,"images":0,"macros":1,"external_links":1,"defined_names":7,"comments":0,"pivot_tables":0},"unopened":[],"bounds":{"document_bytes":16777216,"sheet_cells":100000,"rows_first":2000,"rows_last":500,"rows_between":2000,"halvings":0,"cell_chars":16384,"cell_head_chars":4096},"cells_cut":0,"cells_raw":0,"read":"whole","date_system":"1900"}

{"sheet":"Ark1","index":0,"n_rows":86,"n_cols":26,"rows_kept":86,"cut":false,"hidden":false,"merged":[]}
[null,null,null,"Det samlede kampprogram for Harboøre Cup 2011 ",null,null,null,null,null,"7 min pr. kamp",null,null,null,null,null,null,null,null,null,null,null,null,"Gruppernes kampprogram"]
[null,"Kamp nr.","Tid","Hjemmehold","Mål","Mål","Udehold","Dommer",null,"Puljestillingerne skal opfattes som vejledende, da reglerne omkring indbyrdes",null,null,null,null,null,null,null,null,null,null,"KAMPPROGRAM - GRUPPE 1"]
[null,1,"09:30:00",{"$f":"W4","v":"Harboøre 1"},2,2,{"$f":"Z4","v":"De fodboldinvalide boldspassere"},{"$f":"J13","v":"Sdr. Felding"},null,"kampe ikke er indbygget i systemet.",null,null,null,null,null,null,null,null,null,null,"Kamp nr.","Tid","Hjemmehold","Mål","Mål","Udehold"]
[null,2,"09:38:00",{"$f":"W16","v":"Sdr. Felding"},1,3,{"$f":"Z16","v":"Dem fra Herning"},{"$f":"J6","v":"Harboøre 1"},null,null,null,null,null,null,null,null,null,null,null,null,1,"09.30",{"$f":"J6","v":"Harboøre 1"},{"$f":"IF(E3=\"\",\"\",E3)","v":2},{"$f":"IF(F3=\"\",\"\",F3)","v":2},{"$f":"J7","v":"De fodboldinvalide boldspassere"}]
[null,3,"09:46:00",{"$f":"W28","v":"Leeds United"},1,0,{"$f":"Z28","v":"Sjakket"},{"$f":"J27","v":"Palermo"},null,"Gruppe 1","K","S","U","N",null,"MS",null,"MF","P",null,5,"10.02",{"$f":"J8","v":"Videbæk Young Boys"},{"$f":"IF(E7=\"\",\"\",E7)","v":7},{"$f":"IF(F7=\"\",\"\",F7)","v":2},{"$f":"J9","v":"Skjern"}]
[null,4,"09:54:00",{"$f":"W40","v":"Palermo"},4,1,{"$f":"Z40","v":"Jylland Junited"},{"$f":"J20","v":"Leeds United"},null,"Harboøre 1",{"$f":"L6+M6+N6","v":4},{"$f":"IF(X4>Y4,\"1\",\"0\")+IF(Y6>X6,\"1\",\"0\")+IF(X9>Y9,\"1\",\"0\")+IF(Y12>X12,\"1\",\"0\")","v":1},{"$f":"IF(X4=\"\",0,IF(X4=Y4,1))+IF(Y6=\"\",0,IF(X6=Y6,1))+IF(X9=\"\",0,IF(X9=Y9,1))+IF(Y12=\"\",0,IF(X12=Y12,1))","v":2},{"$f":"IF(X4<Y4,\"1\",\"0\")+IF(X6>Y6,\"1\",\"0\")+IF(Y9<X9,\"1\",\"0\")++IF(X12>Y12,\"1\",\"0\")","v":1},{"$f":"IF(X4=\"\",0,X4)+IF(Y6=\"\",0,Y6)+IF(X9=\"\",0,X9)+IF(Y12=\"\",0,Y12)","v":8},"-",{"$f":"IF(Y4=\"\",0,Y4)+IF(X6=\"\",0,X6)+IF(Y9=\"\",0,Y9)+IF(X12=\"\",0,X12)","v":10},{"$f":"O6-Q6","v":-2},{"$f":"L6*3+M6","v":5},null,11,"10.50",{"$f":"J10","v":"Expectro Patronum"},{"$f":"IF(E13=\"\",\"\",E13)","v":4},{"$f":"IF(F13=\"\",\"\",F13)","v":1},{"$f":"J6","v":"Harboøre 1"}]
[null,5,"10:02:00",{"$f":"W5","v":"Videbæk Young Boys"},7,2,{"$f":"Z5","v":"Skjern"},{"$f":"J14","v":"Dem fra Herning"},null,"De fodboldinvalide boldspassere",{"$f":"L7+M7+N7","v":4},{"$f":"IF(Y4>X4,\"1\",\"0\")+IF(Y7>X7,\"1\",\"0\")+IF(X10>Y10,\"1\",\"0\")+IF(X13>Y13,\"1\",\"0\")","v":1},{"$f":"IF(Y4=\"\",0,IF(X4=Y4,1))+IF(Y7=\"\",0,IF(X7=Y7,1))+IF(X10=\"\",0,IF(X10=Y10,1))+IF(X13=\"\",0,IF(X13=Y13,1))","v":2},{"$f":"IF(Y4<X4,\"1\",\"0\")+IF(X7>Y7,\"1\",\"0\")+IF(X10<Y10,\"1\",\"0\")+IF(X13<Y13,\"1\",\"0\")","v":1},{"$f":"IF(Y4=\"\",0,Y4)+IF(Y7=\"\",0,Y7)+IF(X10=\"\",0,X10)+IF(X13=\"\",0,X13)","v":3},"-",{"$f":"IF(X4=\"\",0,X4)+IF(X7=\"\",0,X7)+IF(Y10=\"\",0,Y10)+IF(Y13=\"\",0,Y13)","v":3},{"$f":"O7-Q7","v":0},{"$f":"L7*3+M7","v":5},null,15,"11.22",{"$f":"J8","v":"Videbæk Young Boys"},{"$f":"IF(E17=\"\",\"\",E17)","v":0},{"$f":"IF(F17=\"\",\"\",F17)","v":1},{"$f":"J7","v":"De fodboldinvalide boldspassere"}]
[null,6,"10:10:00",{"$f":"W17","v":"Vorter på stemmebåndet"},3,4,{"$f":"Z17","v":"Æ Aw'r Crew"},"De fodboldinvalide boldspassere",null,"Videbæk Young Boys",{"$f":"L8+M8+N8","v":4},{"$f":"IF(X5>Y5,\"1\",\"0\")+IF(X7>Y7,\"1\",\"0\")+IF(Y9>X9,\"1\",\"0\")+IF(Y11>X11,\"1\",\"0\")","v":1},{"$f":"IF(X5=\"\",0,IF(X5=Y5,1))+IF(X7=\"\",0,IF(X7=Y7,1))+IF(Y9=\"\",0,IF(X9=Y9,1))+IF(Y11=\"\",0,IF(X11=Y11,1))","v":2},{"$f":"IF(X5<Y5,\"1\",\"0\")+IF(X7<Y7,\"1\",\"0\")+IF(X9>Y9,\"1\",\"0\")+IF(X11>Y11,\"1\",\"0\")","v":1},{"$f":"IF(X5=\"\",0,X5)+IF(X7=\"\",0,X7)+IF(Y9=\"\",0,Y9)+IF(Y11=\"\",0,Y11)","v":12},"-",{"$f":"IF(Y5=\"\",0,Y5)+IF(Y7=\"\",0,Y7)+IF(X9=\"\",0,X9)+IF(X11=\"\",0,X11)","v":8},4,{"$f":"L8*3+M8","v":5},null,21,"12.10",{"$f":"J9","v":"Skjern"},{"$f":"IF(E23=\"\",\"\",E23)","v":5},{"$f":"IF(F23=\"\",\"\",F23)","v":1},{"$f":"J10","v":"Expectro Patronum"}]
[null,7,"10:18:00",{"$f":"W29","v":"Salamidrengene"},5,6,{"$f":"Z29","v":"Lige omkring de index 100"},{"$f":"J28","v":"Jylland Junited"},null,"Skjern",{"$f":"L9+M9+N9","v":4},{"$f":"IF(Y5>X5,\"1\",\"0\")+IF(X8>Y8,\"1\",\"0\")+IF(Y10>X10,\"1\",\"0\")+IF(X12>Y12,\"1\",\"0\")","v":1},{"$f":"IF(Y5=\"\",0,IF(X5=Y5,1))+IF(X8=\"\",0,IF(X8=Y8,1))+IF(Y10=\"\",0,IF(X10=Y10,1))+IF(X12=\"\",0,IF(X12=Y12,1))","v":1},{"$f":"IF(Y5<X5,\"1\",\"0\")+IF(X8<Y8,\"1\",\"0\")+IF(X10>Y10,\"1\",\"0\")+IF(X12<Y12,\"1\",\"0\")","v":2},{"$f":"IF(Y5=\"\",0,Y5)+IF(X8=\"\",0,X8)+IF(Y10=\"\",0,Y10)+IF(X12=\"\",0,X12)","v":9},"-",{"$f":"IF(X5=\"\",0,X5)+IF(Y8=\"\",0,Y8)+IF(X10=\"\",0,X10)+IF(Y12=\"\",0,Y12)","v":11},-2,{"$f":"L9*3+M9","v":4},null,25,"12.42",{"$f":"J6","v":"Harboøre 1"},{"$f":"IF(E27=\"\",\"\",E27)","v":2},{"$f":"IF(F27=\"\",\"\",F27)","v":2},{"$f":"J8","v":"Videbæk Young Boys"}]
[null,8,"10:26:00",{"$f":"W41","v":"Æ Spezials"},7,0,{"$f":"Z41","v":"Poohs venner"},{"$f":"J21","v":"Sjakket"},null,"Expectro Patronum",{"$f":"L10+M10+N10","v":4},{"$f":"IF(X6>Y6,\"1\",\"0\")+IF(Y8>X8,\"1\",\"0\")+IF(X11>Y11,\"1\",\"0\")+IF(Y13>X13,\"1\",\"0\")","v":2},{"$f":"IF(X6=\"\",0,IF(X6=Y6,1))+IF(Y8=\"\",0,IF(X8=Y8,1))+IF(X11=\"\",0,IF(X11=Y11,1))+IF(Y13=\"\",0,IF(X13=Y13,1))","v":1},{"$f":"IF(X6<Y6,\"1\",\"0\")+IF(Y8<X8,\"1\",\"0\")+IF(X11<Y11,\"1\",\"0\")+IF(Y13<X13,\"1\",\"0\")","v":1},{"$f":"IF(X6=\"\",0,X6)+IF(Y8=\"\",0,Y8)+IF(X11=\"\",0,X11)+IF(Y13=\"\",0,Y13)","v":9},"-",{"$f":"IF(Y6=\"\",0,Y6)+IF(X8=\"\",0,X8)+IF(Y11=\"\",0,Y11)+IF(X13=\"\",0,X13)","v":9},{"$f":"O10-Q10","v":0},{"$f":"L10*3+M10","v":7},null,31,"13.30",{"$f":"J7","v":"De fodboldinvalide boldspassere"},{"$f":"IF(E33=\"\",\"\",E33)","v":0},{"$f":"IF(F33=\"\",\"\",F33)","v":0},{"$f":"J9","v":"Skjern"}]
[null,9,"10:34:00",{"$f":"LEFT(J41,15)","v":"Må vi godt tyre"},2,1,{"$f":"RIGHT(J41,7)","v":"Genialt"},"Palermo",null,null,null,null,null,null,null,null,null,null,null,null,35,"14.02",{"$f":"J10","v":"Expectro Patronum"},{"$f":"IF(E37=\"\",\"\",E37)","v":3},{"$f":"IF(F37=\"\",\"\",F37)","v":3},{"$f":"J8","v":"Videbæk Young Boys"}]
[null,10,"10:42:00",{"$f":"LEFT(J42,13)","v":"Haahrs sutter"},3,4,{"$f":"RIGHT(J42,10)","v":"Stjernemix"},"Harboøre 2",null,"Gruppe 2","K","S","U","N",null,"MS",null,"MF","P",null,41,"14.50",{"$f":"J9","v":"Skjern"},{"$f":"IF(E43=\"\",\"\",E43)","v":2},{"$f":"IF(F43=\"\",\"\",F43)","v":3},{"$f":"J6","v":"Harboøre 1"}]
[null,11,"10:50:00",{"$f":"W6","v":"Expectro Patronum"},4,1,{"$f":"Z6","v":"Harboøre 1"},{"$f":"J15","v":"Vorter på stemmebåndet"},null,"Sdr. Felding",{"$f":"L13+M13+N13","v":4},{"$f":"IF(X16>Y16,\"1\",\"0\")+IF(Y18>X18,\"1\",\"0\")+IF(X21>Y21,\"1\",\"0\")+IF(Y24>X24,\"1\",\"0\")","v":0},{"$f":"IF(X16=\"\",0,IF(X16=Y16,1))+IF(Y18=\"\",0,IF(X18=Y18,1))+IF(X21=\"\",0,IF(X21=Y21,1))+IF(Y24=\"\",0,IF(Y24=X24,1))","v":0},{"$f":"IF(X16<Y16,\"1\",\"0\")+IF(Y18<X18,\"1\",\"0\")+IF(X21<Y21,\"1\",\"0\")+IF(Y24<X24,\"1\",\"0\")","v":4},{"$f":"IF(X16=\"\",0,X16)+IF(Y18=\"\",0,Y18)+IF(X21=\"\",0,X21)+IF(Y24=\"\",0,Y24)","v":4},"-",{"$f":"IF(Y16=\"\",0,Y16)+IF(X18=\"\",0,X18)+IF(Y21=\"\",0,Y21)+IF(X24=\"\",0,X24)","v":12},{"$f":"O13-Q13","v":-8},{"$f":"L13*3+M13","v":0},null,45,"15.22",{"$f":"J7","v":"De fodboldinvalide boldspassere"},{"$f":"IF(E47=\"\",\"\",E47)","v":0},{"$f":"IF(F47=\"\",\"\",F47)","v":1},{"$f":"J10","v":"Expectro Patronum"}]
[null,12,"10:58:00",{"$f":"W18","v":"Harboøre 2"},4,3,{"$f":"Z18","v":"Sdr. Felding"},{"$f":"J8","v":"Videbæk Young Boys"},null,"Dem fra Herning",{"$f":"L14+M14+N14","v":4},{"$f":"IF(Y16>X16,\"1\",\"0\")+IF(Y19>X19,\"1\",\"0\")+IF(X22>Y22,\"1\",\"0\")+IF(X25>Y25,\"1\",\"0\")","v":2},{"$f":"IF(Y16=\"\",0,IF(X16=Y16,1))+IF(Y19=\"\",0,IF(X19=Y19,1))+IF(X22=\"\",0,IF(X22=Y22,1))+IF(X25=\"\",0,IF(X25=Y25,1))","v":1},{"$f":"IF(Y16<X16,\"1\",\"0\")+IF(Y19<X19,\"1\",\"0\")+IF(X22<Y22,\"1\",\"0\")+IF(X25<Y25,\"1\",\"0\")","v":1},{"$f":"IF(Y16=\"\",0,Y16)+IF(Y19=\"\",0,Y19)+IF(X22=\"\",0,X22)+IF(X25=\"\",0,X25)","v":9},"-",{"$f":"IF(X16=\"\",0,X16)+IF(X19=\"\",0,X19)+IF(Y22=\"\",0,Y22)+IF(Y25=\"\",0,Y25)","v":4},{"$f":"O14-Q14","v":5},{"$f":"L14*3+M14","v":7},null,"KAMPPROGRAM - GRUPPE 2"]
[null,13,"11:06:00",{"$f":"W30","v":"Team Dong"},2,2,{"$f":"Z30","v":"Leeds United"},{"$f":"J29","v":"Æ Spezials"},null,"Vorter på stemmebåndet",{"$f":"L15+M15+N15","v":4},{"$f":"IF(X17>Y17,\"1\",\"0\")+IF(X19>Y19,\"1\",\"0\")+IF(Y21>X21,\"1\",\"0\")+IF(Y23>X23,\"1\",\"0\")","v":1},{"$f":"IF(X17=\"\",0,IF(X17=Y17,1))+IF(X19=\"\",0,IF(X19=Y19,1))+IF(Y21=\"\",0,IF(X21=Y21,1))+IF(Y23=\"\",0,IF(X23=Y23,1))","v":0},{"$f":"IF(X17<Y17,\"1\",\"0\")+IF(X19<Y19,\"1\",\"0\")+IF(Y21<X21,\"1\",\"0\")+IF(Y23<X23,\"1\",\"0\")","v":3},{"$f":"IF(X17=\"\",0,X17)+IF(X19=\"\",0,X19)+IF(Y21=\"\",0,Y21)+IF(Y23=\"\",0,Y23)","v":7},"-",{"$f":"IF(Y17=\"\",0,Y17)+IF(Y19=\"\",0,Y19)+IF(X21=\"\",0,X21)+IF(X23=\"\",0,X23)","v":13},-6,{"$f":"L15*3+M15","v":3},null,"Kamp nr.","Tid","Hjemmehold","Mål","Mål","Udehold"]
[null,14,"11:14:00",{"$f":"W42","v":"Veni Vidi Vici"},1,1,{"$f":"Z42","v":"Palermo"},{"$f":"J22","v":"Salamidrengene"},null,"Æ Aw'r Crew",{"$f":"L16+M16+N16","v":4},{"$f":"IF(Y17>X17,\"1\",\"0\")+IF(X20>Y20,\"1\",\"0\")+IF(Y22>X22,\"1\",\"0\")+IF(X24>Y24,\"1\",\"0\")","v":3},{"$f":"IF(Y17=\"\",0,IF(X17=Y17,1))+IF(X20=\"\",0,IF(X20=Y20,1))+IF(Y22=\"\",0,IF(X22=Y22,1))+IF(X24=\"\",0,IF(X24=Y24,1))","v":0},{"$f":"IF(Y17<X17,\"1\",\"0\")+IF(X20<Y20,\"1\",\"0\")+IF(Y22<X22,\"1\",\"0\")+IF(X24<Y24,\"1\",\"0\")","v":1},{"$f":"IF(Y17=\"\",0,Y17)+IF(X20=\"\",0,X20)+IF(Y22=\"\",0,Y22)+IF(X24=\"\",0,X24)","v":12},"-",{"$f":"IF(X17=\"\",0,X17)+IF(Y20=\"\",0,Y20)+IF(X22=\"\",0,X22)+IF(Y24=\"\",0,Y24)","v":8},4,{"$f":"L16*3+M16","v":9},null,2,"09.38",{"$f":"J13","v":"Sdr. Felding"},{"$f":"IF(E4=\"\",\"\",E4)","v":1},{"$f":"IF(F4=\"\",\"\",F4)","v":3},{"$f":"J14","v":"Dem fra Herning"}]
[null,15,"11:22:00",{"$f":"W7","v":"Videbæk Young Boys"},0,1,{"$f":"Z7","v":"De fodboldinvalide boldspassere"},{"$f":"J16","v":"Æ Aw'r Crew"},null,"Harboøre 2",{"$f":"L17+M17+N17","v":4},{"$f":"IF(X18>Y18,\"1\",\"0\")+IF(Y20>X20,\"1\",\"0\")+IF(X23>Y23,\"1\",\"0\")+IF(Y25>X25,\"1\",\"0\")","v":3},{"$f":"IF(X18=\"\",0,IF(X18=Y18,1))+IF(Y20=\"\",0,IF(X20=Y20,1))+IF(X23=\"\",0,IF(X23=Y23,1))+IF(Y25=\"\",0,IF(X25=Y25,1))","v":1},{"$f":"IF(X18<Y18,\"1\",\"0\")+IF(Y20<X20,\"1\",\"0\")+IF(X23<Y23,\"1\",\"0\")+IF(Y25<X25,\"1\",\"0\")","v":0},{"$f":"IF(X18=\"\",0,X18)+IF(Y20=\"\",0,Y20)+IF(X23=\"\",0,X23)+IF(Y25=\"\",0,Y25)","v":14},"-",{"$f":"IF(Y18=\"\",0,Y18)+IF(X20=\"\",0,X20)+IF(Y23=\"\",0,Y23)+IF(X25=\"\",0,X25)","v":9},5,{"$f":"L17*3+M17","v":10},null,6,"10.10",{"$f":"J15","v":"Vorter på stemmebåndet"},{"$f":"IF(E8=\"\",\"\",E8)","v":3},{"$f":"IF(F8=\"\",\"\",F8)","v":4},{"$f":"J16","v":"Æ Aw'r Crew"}]
[null,16,"11:30:00",{"$f":"W19","v":"Vorter på stemmebåndet"},0,5,{"$f":"Z19","v":"Dem fra Herning"},{"$f":"J9","v":"Skjern"},null,null,null,null,null,null,null,null,null,null,null,null,12,"10.58",{"$f":"J17","v":"Harboøre 2"},{"$f":"IF(E14=\"\",\"\",E14)","v":4},{"$f":"IF(F14=\"\",\"\",F14)","v":3},{"$f":"J13","v":"Sdr. Felding"}]
[null,17,"11:38:00",{"$f":"W31","v":"Salamidrengene"},2,3,{"$f":"Z31","v":"Sjakket"},{"$f":"J30","v":"Poohs venner"},null,"Gruppe 3","K","S","U","N",null,"MS",null,"MF","P",null,16,"11.30",{"$f":"J15","v":"Vorter på stemmebåndet"},{"$f":"IF(E18=\"\",\"\",E18)","v":0},{"$f":"IF(F18=\"\",\"\",F18)","v":5},{"$f":"J14","v":"Dem fra Herning"}]
[null,18,"11:46:00",{"$f":"W43","v":"Æ Spezials"},2,4,{"$f":"Z43","v":"Jylland Junited"},{"$f":"J23","v":"Lige omkring de index 100"},null,"Leeds United",{"$f":"L20+M20+N20","v":4},{"$f":"IF(X28>Y28,\"1\",\"0\")+IF(Y30>X30,\"1\",\"0\")+IF(X33>Y33,\"1\",\"0\")+IF(Y36>X36,\"1\",\"0\")","v":1},{"$f":"IF(X28=\"\",0,IF(X28=Y28,1))+IF(Y30=\"\",0,IF(X30=Y30,1))+IF(X33=\"\",0,IF(X33=Y33,1))+IF(Y36=\"\",0,IF(Y36=X36,1))","v":1},{"$f":"IF(X28<Y28,\"1\",\"0\")+IF(Y30<X30,\"1\",\"0\")+IF(X33<Y33,\"1\",\"0\")+IF(Y36<X36,\"1\",\"0\")","v":2},{"$f":"IF(X28=\"\",0,X28)+IF(Y30=\"\",0,Y30)+IF(X33=\"\",0,X33)+IF(Y36=\"\",0,Y36)","v":5},"-",{"$f":"IF(Y28=\"\",0,Y28)+IF(X30=\"\",0,X30)+IF(Y33=\"\",0,Y33)+IF(X36=\"\",0,X36)","v":6},{"$f":"O20-Q20","v":-1},{"$f":"L20*3+M20","v":4},null,22,"12.18",{"$f":"J16","v":"Æ Aw'r Crew"},{"$f":"IF(E24=\"\",\"\",E24)","v":2},{"$f":"IF(F24=\"\",\"\",F24)","v":5},{"$f":"J17","v":"Harboøre 2"}]
[null,19,"11:54:00",{"$f":"LEFT(J43,4)","v":"Ota "},1,1,{"$f":"RIGHT(J43,15)","v":"Må vi godt tyre"},"Harboøre 1",null,"Sjakket",{"$f":"L21+M21+N21","v":4},{"$f":"IF(Y28>X28,\"1\",\"0\")+IF(Y31>X31,\"1\",\"0\")+IF(X34>Y34,\"1\",\"0\")+IF(X37>Y37,\"1\",\"0\")","v":2},{"$f":"IF(Y28=\"\",0,IF(X28=Y28,1))+IF(Y31=\"\",0,IF(X31=Y31,1))+IF(X34=\"\",0,IF(X34=Y34,1))+IF(X37=\"\",0,IF(X37=Y37,1))","v":1},{"$f":"IF(Y28<X28,\"1\",\"0\")+IF(Y31<X31,\"1\",\"0\")+IF(X34<Y34,\"1\",\"0\")+IF(X37<Y37,\"1\",\"0\")","v":1},{"$f":"IF(Y28=\"\",0,Y28)+IF(Y31=\"\",0,Y31)+IF(X34=\"\",0,X34)+IF(X37=\"\",0,X37)","v":7},"-",{"$f":"IF(X28=\"\",0,X28)+IF(X31=\"\",0,X31)+IF(Y34=\"\",0,Y34)+IF(Y37=\"\",0,Y37)","v":6},{"$f":"O21-Q21","v":1},{"$f":"L21*3+M21","v":7},null,26,"12.50",{"$f":"J13","v":"Sdr. Felding"},{"$f":"IF(E28=\"\",\"\",E28)","v":0},{"$f":"IF(F28=\"\",\"\",F28)","v":1},{"$f":"J15","v":"Vorter på stemmebåndet"}]
[null,20,"12:02:00",{"$f":"LEFT(J44,7)","v":"Genialt"},0,1,{"$f":"RIGHT(J44,14)","v":" Haahrs sutter"},"Dem fra Herning",null,"Salamidrengene",{"$f":"L22+M22+N22","v":4},{"$f":"IF(X29>Y29,\"1\",\"0\")+IF(X31>Y31,\"1\",\"0\")+IF(Y33>X33,\"1\",\"0\")+IF(Y35>X35,\"1\",\"0\")","v":1},{"$f":"IF(X29=\"\",0,IF(X29=Y29,1))+IF(X31=\"\",0,IF(X31=Y31,1))+IF(Y33=\"\",0,IF(X33=Y33,1))+IF(Y35=\"\",0,IF(X35=Y35,1))","v":0},{"$f":"IF(X29<Y29,\"1\",\"0\")+IF(X31<Y31,\"1\",\"0\")+IF(Y33<X33,\"1\",\"0\")+IF(Y35<X35,\"1\",\"0\")","v":3},{"$f":"IF(X29=\"\",0,X29)+IF(X31=\"\",0,X31)+IF(Y33=\"\",0,Y33)+IF(Y35=\"\",0,Y35)","v":10},"-",{"$f":"IF(Y29=\"\",0,Y29)+IF(Y31=\"\",0,Y31)+IF(X33=\"\",0,X33)+IF(X35=\"\",0,X35)","v":12},-2,{"$f":"L22*3+M22","v":3},null,32,"13.38",{"$f":"J14","v":"Dem fra Herning"},{"$f":"IF(E34=\"\",\"\",E34)","v":0},{"$f":"IF(F34=\"\",\"\",F34)","v":2},{"$f":"J16","v":"Æ Aw'r Crew"}]
[null,21,"12:10:00",{"$f":"W8","v":"Skjern"},5,1,{"$f":"Z8","v":"Expectro Patronum"},{"$f":"J17","v":"Harboøre 2"},null,"Lige omkring de index 100",{"$f":"L23+M23+N23","v":4},{"$f":"IF(Y29>X29,\"1\",\"0\")+IF(X32>Y32,\"1\",\"0\")+IF(Y34>X34,\"1\",\"0\")+IF(X36>Y36,\"1\",\"0\")","v":2},{"$f":"IF(Y29=\"\",0,IF(X29=Y29,1))+IF(X32=\"\",0,IF(X32=Y32,1))+IF(Y34=\"\",0,IF(X34=Y34,1))+IF(X36=\"\",0,IF(X36=Y36,1))","v":1},{"$f":"IF(Y29<X29,\"1\",\"0\")+IF(X32<Y32,\"1\",\"0\")+IF(Y34<X34,\"1\",\"0\")+IF(X36<Y36,\"1\",\"0\")","v":1},{"$f":"IF(Y29=\"\",0,Y29)+IF(X32=\"\",0,X32)+IF(Y34=\"\",0,Y34)+IF(X36=\"\",0,X36)","v":13},"-",{"$f":"IF(X29=\"\",0,X29)+IF(Y32=\"\",0,Y32)+IF(X34=\"\",0,X34)+IF(Y36=\"\",0,Y36)","v":12},1,{"$f":"L23*3+M23","v":7},null,36,"14.10",{"$f":"J17","v":"Harboøre 2"},{"$f":"IF(E38=\"\",\"\",E38)","v":4},{"$f":"IF(F38=\"\",\"\",F38)","v":3},{"$f":"J15","v":"Vorter på stemmebåndet"}]
[null,22,"12:18:00",{"$f":"W20","v":"Æ Aw'r Crew"},2,5,{"$f":"Z20","v":"Harboøre 2"},{"$f":"J10","v":"Expectro Patronum"},null,"Team Dong",{"$f":"L24+M24+N24","v":4},{"$f":"IF(X30>Y30,\"1\",\"0\")+IF(Y32>X32,\"1\",\"0\")+IF(X35>Y35,\"1\",\"0\")+IF(Y37>X37,\"1\",\"0\")","v":1},{"$f":"IF(X30=\"\",0,IF(X30=Y30,1))+IF(Y32=\"\",0,IF(X32=Y32,1))+IF(X35=\"\",0,IF(X35=Y35,1))+IF(Y37=\"\",0,IF(X37=Y37,1))","v":3},{"$f":"IF(X30<Y30,\"1\",\"0\")+IF(Y32<X32,\"1\",\"0\")+IF(X35<Y35,\"1\",\"0\")+IF(Y37<X37,\"1\",\"0\")","v":0},{"$f":"IF(X30=\"\",0,X30)+IF(Y32=\"\",0,Y32)+IF(X35=\"\",0,X35)+IF(Y37=\"\",0,Y37)","v":10},"-",{"$f":"IF(Y30=\"\",0,Y30)+IF(X32=\"\",0,X32)+IF(Y35=\"\",0,Y35)+IF(X37=\"\",0,X37)","v":9},1,{"$f":"L24*3+M24","v":6},null,42,"14.58",{"$f":"J16","v":"Æ Aw'r Crew"},{"$f":"IF(E44=\"\",\"\",E44)","v":4},{"$f":"IF(F44=\"\",\"\",F44)","v":0},{"$f":"J13","v":"Sdr. Felding"}]
[null,23,"12:26:00",{"$f":"W32","v":"Lige omkring de index 100"},4,4,{"$f":"Z32","v":"Team Dong"},{"$f":"J31","v":"Veni Vidi Vici"},null,null,null,null,null,null,null,null,null,null,null,null,46,"15.30",{"$f":"J14","v":"Dem fra Herning"},{"$f":"IF(E48=\"\",\"\",E48)","v":1},{"$f":"IF(F48=\"\",\"\",F48)","v":1},{"$f":"J17","v":"Harboøre 2"}]
[null,24,"12:34:00",{"$f":"W44","v":"Poohs venner"},1,1,{"$f":"Z44","v":"Veni Vidi Vici"},{"$f":"J24","v":"Team Dong"},null,"Gruppe 4","K","S","U","N",null,"MS",null,"MF","P",null,"KAMPPROGRAM - GRUPPE 3"]
[null,25,"12:42:00",{"$f":"W9","v":"Harboøre 1"},2,2,{"$f":"Z9","v":"Videbæk Young Boys"},{"$f":"J13","v":"Sdr. Felding"},null,"Palermo",{"$f":"L27+M27+N27","v":4},{"$f":"IF(X40>Y40,\"1\",\"0\")+IF(Y42>X42,\"1\",\"0\")+IF(X45>Y45,\"1\",\"0\")+IF(Y48>X48,\"1\",\"0\")","v":1},{"$f":"IF(X40=\"\",0,IF(X40=Y40,1))+IF(Y42=\"\",0,IF(X42=Y42,1))+IF(X45=\"\",0,IF(X45=Y45,1))+IF(Y48=\"\",0,IF(Y48=X48,1))","v":3},{"$f":"IF(X40<Y40,\"1\",\"0\")+IF(Y42<X42,\"1\",\"0\")+IF(X45<Y45,\"1\",\"0\")+IF(Y48<X48,\"1\",\"0\")","v":0},{"$f":"IF(X40=\"\",0,X40)+IF(Y42=\"\",0,Y42)+IF(X45=\"\",0,X45)+IF(Y48=\"\",0,Y48)","v":9},"-",{"$f":"IF(Y40=\"\",0,Y40)+IF(X42=\"\",0,X42)+IF(Y45=\"\",0,Y45)+IF(X48=\"\",0,X48)","v":6},{"$f":"O27-Q27","v":3},{"$f":"L27*3+M27","v":6},null,"Kamp nr.","Tid","Hjemmehold","Mål","Mål","Udehold"]
[null,26,"12:50:00",{"$f":"W21","v":"Sdr. Felding"},0,1,{"$f":"Z21","v":"Vorter på stemmebåndet"},{"$f":"J6","v":"Harboøre 1"},null,"Jylland Junited",{"$f":"L28+M28+N28","v":4},{"$f":"IF(Y40>X40,\"1\",\"0\")+IF(Y43>X43,\"1\",\"0\")+IF(X46>Y46,\"1\",\"0\")+IF(X49>Y49,\"1\",\"0\")","v":2},{"$f":"IF(Y40=\"\",0,IF(X40=Y40,1))+IF(Y43=\"\",0,IF(X43=Y43,1))+IF(X46=\"\",0,IF(X46=Y46,1))+IF(X49=\"\",0,IF(X49=Y49,1))","v":0},{"$f":"IF(Y40<X40,\"1\",\"0\")+IF(Y43<X43,\"1\",\"0\")+IF(X46<Y46,\"1\",\"0\")+IF(X49<Y49,\"1\",\"0\")","v":2},{"$f":"IF(Y40=\"\",0,Y40)+IF(Y43=\"\",0,Y43)+IF(X46=\"\",0,X46)+IF(X49=\"\",0,X49)","v":13},"-",{"$f":"IF(X40=\"\",0,X40)+IF(X43=\"\",0,X43)+IF(Y46=\"\",0,Y46)+IF(Y49=\"\",0,Y49)","v":12},{"$f":"O28-Q28","v":1},{"$f":"L28*3+M28","v":6},null,3,"09.46",{"$f":"J20","v":"Leeds United"},{"$f":"IF(E5=\"\",\"\",E5)","v":1},{"$f":"IF(F5=\"\",\"\",F5)","v":0},{"$f":"J21","v":"Sjakket"}]
[null,27,"12:58:00",{"$f":"W33","v":"Leeds United"},1,2,{"$f":"Z33","v":"Salamidrengene"},{"$f":"J27","v":"Palermo"},null,"Æ Spezials",{"$f":"L29+M29+N29","v":4},{"$f":"IF(X41>Y41,\"1\",\"0\")+IF(X43>Y43,\"1\",\"0\")+IF(Y45>X45,\"1\",\"0\")+IF(Y47>X47,\"1\",\"0\")","v":2},{"$f":"IF(X41=\"\",0,IF(X41=Y41,1))+IF(X43=\"\",0,IF(X43=Y43,1))+IF(Y45=\"\",0,IF(X45=Y45,1))+IF(Y47=\"\",0,IF(X47=Y47,1))","v":1},{"$f":"IF(X41<Y41,\"1\",\"0\")+IF(X43<Y43,\"1\",\"0\")+IF(Y45<X45,\"1\",\"0\")+IF(Y47<X47,\"1\",\"0\")","v":1},{"$f":"IF(X41=\"\",0,X41)+IF(X43=\"\",0,X43)+IF(Y45=\"\",0,Y45)+IF(Y47=\"\",0,Y47)","v":13},"-",{"$f":"IF(Y41=\"\",0,Y41)+IF(Y43=\"\",0,Y43)+IF(X45=\"\",0,X45)+IF(X47=\"\",0,X47)","v":6},7,{"$f":"L29*3+M29","v":7},null,7,"10.18",{"$f":"J22","v":"Salamidrengene"},{"$f":"IF(E9=\"\",\"\",E9)","v":5},{"$f":"IF(F9=\"\",\"\",F9)","v":6},{"$f":"J23","v":"Lige omkring de index 100"}]
[null,28,"13:06:00",{"$f":"W45","v":"Palermo"},2,2,{"$f":"Z45","v":"Æ Spezials"},{"$f":"J20","v":"Leeds United"},null,"Poohs venner",{"$f":"L30+M30+N30","v":4},{"$f":"IF(Y41>X41,\"1\",\"0\")+IF(X44>Y44,\"1\",\"0\")+IF(Y46>X46,\"1\",\"0\")+IF(X48>Y48,\"1\",\"0\")","v":1},{"$f":"IF(Y41=\"\",0,IF(X41=Y41,1))+IF(X44=\"\",0,IF(X44=Y44,1))+IF(Y46=\"\",0,IF(X46=Y46,1))+IF(X48=\"\",0,IF(X48=Y48,1))","v":2},{"$f":"IF(Y41<X41,\"1\",\"0\")+IF(X44<Y44,\"1\",\"0\")+IF(Y46<X46,\"1\",\"0\")+IF(X48<Y48,\"1\",\"0\")","v":1},{"$f":"IF(Y41=\"\",0,Y41)+IF(X44=\"\",0,X44)+IF(Y46=\"\",0,Y46)+IF(X48=\"\",0,X48)","v":8},"-",{"$f":"IF(X41=\"\",0,X41)+IF(Y44=\"\",0,Y44)+IF(X46=\"\",0,X46)+IF(Y48=\"\",0,Y48)","v":14},-6,{"$f":"L30*3+M30","v":5},null,13,"11.06",{"$f":"J24","v":"Team Dong"},{"$f":"IF(E15=\"\",\"\",E15)","v":2},{"$f":"IF(F15=\"\",\"\",F15)","v":2},{"$f":"J20","v":"Leeds United"}]
[null,29,"13:14:00",{"$f":"LEFT(J45,10)","v":"Stjernemix"},0,0,{"$f":"RIGHT(J45,4)","v":" Ota"},"Æ Aw'r Crew",null,"Veni Vidi Vici",{"$f":"L31+M31+N31","v":4},{"$f":"IF(X42>Y42,\"1\",\"0\")+IF(Y44>X44,\"1\",\"0\")+IF(X47>Y47,\"1\",\"0\")+IF(Y49>X49,\"1\",\"0\")","v":0},{"$f":"IF(X42=\"\",0,IF(X42=Y42,1))+IF(Y44=\"\",0,IF(X44=Y44,1))+IF(X47=\"\",0,IF(X47=Y47,1))+IF(Y49=\"\",0,IF(X49=Y49,1))","v":2},{"$f":"IF(X42<Y42,\"1\",\"0\")+IF(Y44<X44,\"1\",\"0\")+IF(X47<Y47,\"1\",\"0\")+IF(Y49<X49,\"1\",\"0\")","v":2},{"$f":"IF(X42=\"\",0,X42)+IF(Y44=\"\",0,Y44)+IF(X47=\"\",0,X47)+IF(Y49=\"\",0,Y49)","v":3},"-",{"$f":"IF(Y42=\"\",0,Y42)+IF(X44=\"\",0,X44)+IF(Y47=\"\",0,Y47)+IF(X49=\"\",0,X49)","v":8},-5,{"$f":"L31*3+M31","v":2},null,17,"11.38",{"$f":"J22","v":"Salamidrengene"},{"$f":"IF(E19=\"\",\"\",E19)","v":2},{"$f":"IF(F19=\"\",\"\",F19)","v":3},{"$f":"J21","v":"Sjakket"}]
[null,30,"13:22:00",{"$f":"LEFT(J46,14)","v":"Haahrs sutter "},4,1,{"$f":"RIGHT(J46,15)","v":"Må vi godt tyre"},"Team Dong",null,null,null,null,null,null,null,null,null,null,null,null,23,"12.26",{"$f":"J23","v":"Lige omkring de index 100"},{"$f":"IF(E25=\"\",\"\",E25)","v":4},{"$f":"IF(F25=\"\",\"\",F25)","v":4},{"$f":"J24","v":"Team Dong"}]
[null,31,"13:30:00",{"$f":"W10","v":"De fodboldinvalide boldspassere"},0,0,{"$f":"Z10","v":"Skjern"},{"$f":"J14","v":"Dem fra Herning"},null,"Pigegruppen","K","S","U","N",null,"MS",null,"MF","P",null,27,"12.58",{"$f":"J20","v":"Leeds United"},{"$f":"IF(E29=\"\",\"\",E29)","v":1},{"$f":"IF(F29=\"\",\"\",F29)","v":2},{"$f":"J22","v":"Salamidrengene"}]
[null,32,"13:38:00",{"$f":"W22","v":"Dem fra Herning"},0,2,{"$f":"Z22","v":"Æ Aw'r Crew"},"De fodboldinvalide boldspassere",null,"Må vi godt tyre",{"$f":"L34+M34+N34","v":4},{"$f":"IF(K41>L41,\"1\",\"0\")+IF(L43>K43,\"1\",\"0\")+IF(L46>K46,\"1\",\"0\")+IF(K49>L49,\"1\",\"0\")","v":1},{"$f":"IF(K41=\"\",0,IF(K41=L41,1))+IF(L43=\"\",0,IF(L43=K43,1))+IF(L46=\"\",0,IF(L46=K46,1))+IF(K49=\"\",0,IF(K49=L49,1))","v":1},{"$f":"IF(K41<L41,\"1\",\"0\")+IF(L43<K43,\"1\",\"0\")+IF(L46<K46,\"1\",\"0\")+IF(K49<L49,\"1\",\"0\")","v":2},{"$f":"IF(K41=\"\",0,K41)+IF(L43=\"\",0,L43)+IF(L46=\"\",0,L46)+IF(K49=\"\",0,K49)","v":7},"-",{"$f":"IF(L41=\"\",0,L41)+IF(K43=\"\",0,K43)+IF(K46=\"\",0,K46)+IF(L49=\"\",0,L49)","v":10},{"$f":"O34-Q34","v":-3},{"$f":"L34*3+M34","v":4},null,33,"13.46",{"$f":"J21","v":"Sjakket"},{"$f":"IF(E35=\"\",\"\",E35)","v":2},{"$f":"IF(F35=\"\",\"\",F35)","v":1},{"$f":"J23","v":"Lige omkring de index 100"}]
[null,33,"13:46:00",{"$f":"W34","v":"Sjakket"},2,1,{"$f":"Z34","v":"Lige omkring de index 100"},{"$f":"J28","v":"Jylland Junited"},null,"Genialt",{"$f":"L35+M35+N35","v":4},{"$f":"IF(L41>K41,\"1\",\"0\")+IF(K44>L44,\"1\",\"0\")+IF(L47>K47,\"1\",\"0\")+IF(K50>L50,\"1\",\"0\")","v":0},{"$f":"IF(L41=\"\",0,IF(K41=L41,1))+IF(K44=\"\",0,IF(L44=K44,1))+IF(L47=\"\",0,IF(L47=K47,1))+IF(K50=\"\",0,IF(K50=L50,1))","v":0},{"$f":"IF(L41<K41,\"1\",\"0\")+IF(K44<L44,\"1\",\"0\")+IF(L47<K47,\"1\",\"0\")+IF(K50<L50,\"1\",\"0\")","v":4},{"$f":"IF(L41=\"\",0,L41)+IF(K44=\"\",0,K44)+IF(L47=\"\",0,L47)+IF(K50=\"\",0,K50)","v":1},"-",{"$f":"IF(K41=\"\",0,K41)+IF(L44=\"\",0,L44)+IF(K47=\"\",0,K47)+IF(L50=\"\",0,L50)","v":8},{"$f":"O35-Q35","v":-7},{"$f":"L35*3+M35","v":0},null,37,"14.18",{"$f":"J24","v":"Team Dong"},{"$f":"IF(E39=\"\",\"\",E39)","v":2},{"$f":"IF(F39=\"\",\"\",F39)","v":1},{"$f":"J22","v":"Salamidrengene"}]
[null,34,"13:54:00",{"$f":"W46","v":"Jylland Junited"},4,5,{"$f":"Z46","v":"Poohs venner"},{"$f":"J21","v":"Sjakket"},null,"Haahrs sutter",{"$f":"L36+M36+N36","v":4},{"$f":"IF(K42>L42,\"1\",\"0\")+IF(L44>K44,\"1\",\"0\")+IF(K46>L46,\"1\",\"0\")+IF(L48>K48,\"1\",\"0\")","v":2},{"$f":"IF(K42=\"\",0,IF(K42=L42,1))+IF(L44=\"\",0,IF(L44=K44,1))+IF(K46=\"\",0,IF(L46=K46,1))+IF(L48=\"\",0,IF(K48=L48,1))","v":1},{"$f":"IF(K42<L42,\"1\",\"0\")+IF(L44<K44,\"1\",\"0\")+IF(K46<L46,\"1\",\"0\")+IF(L48<K48,\"1\",\"0\")","v":1},{"$f":"IF(K42=\"\",0,K42)+IF(L44=\"\",0,L44)+IF(K46=\"\",0,K46)+IF(L48=\"\",0,L48)","v":10},"-",{"$f":"IF(L42=\"\",0,L42)+IF(K44=\"\",0,K44)+IF(L46=\"\",0,L46)+IF(K48=\"\",0,K48)","v":7},3,{"$f":"L36*3+M36","v":7},null,43,"15.06",{"$f":"J23","v":"Lige omkring de index 100"},{"$f":"IF(E45=\"\",\"\",E45)","v":2},{"$f":"IF(F45=\"\",\"\",F45)","v":1},{"$f":"J20","v":"Leeds United"}]
[null,35,"14:02:00",{"$f":"W11","v":"Expectro Patronum"},3,3,{"$f":"Z11","v":"Videbæk Young Boys"},"Vorter på stemmebåndet",null,"Stjernemix",{"$f":"L37+M37+N37","v":4},{"$f":"IF(L42>K42,\"1\",\"0\")+IF(K45>L45,\"1\",\"0\")+IF(K47>L47,\"1\",\"0\")+IF(L49>K49,\"1\",\"0\")","v":3},{"$f":"IF(L42=\"\",0,IF(K42=L42,1))+IF(K45=\"\",0,IF(L45=K45,1))+IF(K47=\"\",0,IF(L47=K47,1))+IF(L49=\"\",0,IF(K49=L49,1))","v":1},{"$f":"IF(L42<K42,\"1\",\"0\")+IF(K45<L45,\"1\",\"0\")+IF(K47<L47,\"1\",\"0\")+IF(L49<K49,\"1\",\"0\")","v":0},{"$f":"IF(L42=\"\",0,L42)+IF(K45=\"\",0,K45)+IF(K47=\"\",0,K47)+IF(L49=\"\",0,L49)","v":12},"-",{"$f":"IF(K42=\"\",0,K42)+IF(L45=\"\",0,L45)+IF(L47=\"\",0,L47)+IF(K49=\"\",0,K49)","v":6},6,{"$f":"L37*3+M37","v":10},null,47,"15.38",{"$f":"J21","v":"Sjakket"},{"$f":"IF(E49=\"\",\"\",E49)","v":2},{"$f":"IF(F49=\"\",\"\",F49)","v":2},{"$f":"J24","v":"Team Dong"}]
[null,36,"14:10:00",{"$f":"W23","v":"Harboøre 2"},4,3,{"$f":"Z23","v":"Vorter på stemmebåndet"},{"$f":"J8","v":"Videbæk Young Boys"},null,"Ota",{"$f":"L38+M38+N38","v":4},{"$f":"IF(K43>L43,\"1\",\"0\")+IF(L45>K45,\"1\",\"0\")+IF(K48>L48,\"1\",\"0\")+IF(L50>K50,\"1\",\"0\")","v":1},{"$f":"IF(K43=\"\",0,IF(K43=L43,1))+IF(L45=\"\",0,IF(L45=K45,1))+IF(K48=\"\",0,IF(L48=K48,1))+IF(L50=\"\",0,IF(K50=L50,1))","v":3},{"$f":"IF(K43<L43,\"1\",\"0\")+IF(L45<K45,\"1\",\"0\")+IF(K48<L48,\"1\",\"0\")+IF(L50<K50,\"1\",\"0\")","v":0},{"$f":"IF(K43=\"\",0,K43)+IF(L45=\"\",0,L45)+IF(K48=\"\",0,K48)+IF(L50=\"\",0,L50)","v":4},"-",{"$f":"IF(L43=\"\",0,L43)+IF(K45=\"\",0,K45)+IF(L48=\"\",0,L48)+IF(K50=\"\",0,K50)","v":3},1,{"$f":"L38*3+M38","v":6},null,"KAMPPROGRAM - GRUPPE 4"]
[null,37,"14:18:00",{"$f":"W35","v":"Team Dong"},2,1,{"$f":"Z35","v":"Salamidrengene"},{"$f":"J29","v":"Æ Spezials"},null,null,null,null,null,null,null,null,null,null,null,null,"Kamp nr.","Tid","Hjemmehold","Mål","Mål","Udehold"]
[null,38,"14:26:00",{"$f":"W47","v":"Veni Vidi Vici"},0,2,{"$f":"Z47","v":"Æ Spezials"},{"$f":"J22","v":"Salamidrengene"},null,"Kampprogram for Pigegruppen","Mål","Mål","Tid","Nr.",null,null,null,null,null,null,4,"09.54",{"$f":"J27","v":"Palermo"},{"$f":"IF(E6=\"\",\"\",E6)","v":4},{"$f":"IF(F6=\"\",\"\",F6)","v":1},{"$f":"J28","v":"Jylland Junited"}]
[null,39,"14:34:00",{"$f":"LEFT(J47,10)","v":"Stjernemix"},4,0,{"$f":"RIGHT(J47,7)","v":"Genialt"},"Poohs venner",null,{"$f":"J34&\" - \"&J35","v":"Må vi godt tyre - Genialt"},{"$f":"IF(E11=\"\",\"\",E11)","v":2},{"$f":"IF(F11=\"\",\"\",F11)","v":1},"10.34",9,null,null,null,null,null,null,8,"10.26",{"$f":"J29","v":"Æ Spezials"},{"$f":"IF(E10=\"\",\"\",E10)","v":7},{"$f":"IF(F10=\"\",\"\",F10)","v":0},{"$f":"J30","v":"Poohs venner"}]
[null,40,"14:42:00",{"$f":"LEFT(J48,4)","v":"Ota "},2,2,{"$f":"RIGHT(J48,14)","v":" Haahrs sutter"},"Harboøre 2",null,{"$f":"J36&\" - \"&J37","v":"Haahrs sutter - Stjernemix"},{"$f":"IF(E12=\"\",\"\",E12)","v":3},{"$f":"IF(F12=\"\",\"\",F12)","v":4},"10.42",10,null,null,null,null,null,null,14,"11.14",{"$f":"J31","v":"Veni Vidi Vici"},{"$f":"IF(E16=\"\",\"\",E16)","v":1},{"$f":"IF(F16=\"\",\"\",F16)","v":1},{"$f":"J27","v":"Palermo"}]
[null,41,"14:50:00",{"$f":"W12","v":"Skjern"},2,3,{"$f":"Z12","v":"Harboøre 1"},{"$f":"J16","v":"Æ Aw'r Crew"},null,{"$f":"J38&\" - \"&J34","v":"Ota - Må vi godt tyre"},{"$f":"IF(E21=\"\",\"\",E21)","v":1},{"$f":"IF(F21=\"\",\"\",F21)","v":1},"11.54",19,null,null,null,null,null,null,18,"11.46",{"$f":"J29","v":"Æ Spezials"},{"$f":"IF(E20=\"\",\"\",E20)","v":2},{"$f":"IF(F20=\"\",\"\",F20)","v":4},{"$f":"J28","v":"Jylland Junited"}]
[null,42,"14:58:00",{"$f":"W24","v":"Æ Aw'r Crew"},4,0,{"$f":"Z24","v":"Sdr. Felding"},{"$f":"J9","v":"Skjern"},null,{"$f":"J35&\" - \"&J36","v":"Genialt - Haahrs sutter"},{"$f":"IF(E22=\"\",\"\",E22)","v":0},{"$f":"IF(F22=\"\",\"\",F22)","v":1},"12.02",20,null,null,null,null,null,null,24,"12.34",{"$f":"J30","v":"Poohs venner"},{"$f":"IF(E26=\"\",\"\",E26)","v":1},{"$f":"IF(F26=\"\",\"\",F26)","v":1},{"$f":"J31","v":"Veni Vidi Vici"}]
[null,43,"15:06:00",{"$f":"W36","v":"Lige omkring de index 100"},2,1,{"$f":"Z36","v":"Leeds United"},{"$f":"J30","v":"Poohs venner"},null,{"$f":"J37&\" - \"&J38","v":"Stjernemix - Ota"},{"$f":"IF(E31=\"\",\"\",E31)","v":0},{"$f":"IF(F31=\"\",\"\",F31)","v":0},"13.14",29,null,null,null,null,null,null,28,"13.06",{"$f":"J27","v":"Palermo"},{"$f":"IF(E30=\"\",\"\",E30)","v":2},{"$f":"IF(F30=\"\",\"\",F30)","v":2},{"$f":"J29","v":"Æ Spezials"}]
[null,44,"15:14:00",{"$f":"W48","v":"Poohs venner"},2,2,{"$f":"Z48","v":"Palermo"},{"$f":"J23","v":"Lige omkring de index 100"},null,{"$f":"J36&\" - \"&J34","v":"Haahrs sutter - Må vi godt tyre"},{"$f":"IF(E32=\"\",\"\",E32)","v":4},{"$f":"IF(F32=\"\",\"\",F32)","v":1},"13.22",30,null,null,null,null,null,null,34,"13.54",{"$f":"J28","v":"Jylland Junited"},{"$f":"IF(E36=\"\",\"\",E36)","v":4},{"$f":"IF(F36=\"\",\"\",F36)","v":5},{"$f":"J30","v":"Poohs venner"}]
[null,45,"15:22:00",{"$f":"W13","v":"De fodboldinvalide boldspassere"},0,1,{"$f":"Z13","v":"Expectro Patronum"},{"$f":"J17","v":"Harboøre 2"},null,{"$f":"J37&\" - \"&J35","v":"Stjernemix - Genialt"},{"$f":"IF(E41=\"\",\"\",E41)","v":4},{"$f":"IF(F41=\"\",\"\",F41)","v":0},"14.34",39,null,null,null,null,null,null,38,"14.26",{"$f":"J31","v":"Veni Vidi Vici"},{"$f":"IF(E40=\"\",\"\",E40)","v":0},{"$f":"IF(F40=\"\",\"\",F40)","v":2},{"$f":"J29","v":"Æ Spezials"}]
[null,46,"15:30:00",{"$f":"W25","v":"Dem fra Herning"},1,1,{"$f":"Z25","v":"Harboøre 2"},{"$f":"J10","v":"Expectro Patronum"},null,{"$f":"J38&\" - \"&J36","v":"Ota - Haahrs sutter"},{"$f":"IF(E42=\"\",\"\",E42)","v":2},{"$f":"IF(F42=\"\",\"\",F42)","v":2},"14.42",40,null,null,null,null,null,null,44,"15.14",{"$f":"J30","v":"Poohs venner"},{"$f":"IF(E46=\"\",\"\",E46)","v":2},{"$f":"IF(F46=\"\",\"\",F46)","v":2},{"$f":"J27","v":"Palermo"}]
[null,47,"15:38:00",{"$f":"W37","v":"Sjakket"},2,2,{"$f":"Z37","v":"Team Dong"},{"$f":"J31","v":"Veni Vidi Vici"},null,{"$f":"J34&\" - \"&J37","v":"Må vi godt tyre - Stjernemix"},{"$f":"IF(E51=\"\",\"\",E51)","v":3},{"$f":"IF(F51=\"\",\"\",F51)","v":4},"15.54",49,null,null,null,null,null,null,48,"15.46",{"$f":"J28","v":"Jylland Junited"},{"$f":"IF(E50=\"\",\"\",E50)","v":4},{"$f":"IF(F50=\"\",\"\",F50)","v":1},{"$f":"J31","v":"Veni Vidi Vici"}]
[null,48,"15:46:00",{"$f":"W49","v":"Jylland Junited"},4,1,{"$f":"Z49","v":"Veni Vidi Vici"},{"$f":"J24","v":"Team Dong"},null,{"$f":"J35&\" - \"&J38","v":"Genialt - Ota"},{"$f":"IF(E52=\"\",\"\",E52)","v":0},{"$f":"IF(F52=\"\",\"\",F52)","v":1},"16.02",50]
[null,49,"15:54:00",{"$f":"LEFT(J49,15)","v":"Må vi godt tyre"},3,4,{"$f":"RIGHT(J49,10)","v":"Stjernemix"},"Salamidrengene"]
[null,50,"16:02:00",{"$f":"LEFT(J50,7)","v":"Genialt"},0,1,{"$f":"RIGHT(J50,4)","v":" Ota"},"Jylland Junited",null,"PIGEFINALE","Mål","Mål","Tid","Nr"]
[null,51,"16:10:00",{"$f":"IF(D66=\"\",\"Kvartfinale: 1. plads i Gruppe 1\",IF(D66=D66,D66))","v":"Kvartfinale: 1. plads i Gruppe 1"},{"$f":"IF(E66=\"\",\"\",E66)","v":""},{"$f":"IF(F66=\"\",\"\",F66)","v":""},{"$f":"IF(G66=\"\",\"Kvartfinale: 2. plads i Gruppe 2\",IF(G66=G66,G66))","v":"Kvartfinale: 2. plads i Gruppe 2"},"3. plads fra gruppe 4",null,"1. plads - 2. plads pigegruppe",{"$f":"IF(E57=\"\",\"\",E57)","v":""},{"$f":"IF(F57=\"\",\"\",F57)","v":""},"16.42",55]
[null,52,"16:18:00",{"$f":"IF(D68=\"\",\"Kvartfinale: 1. plads i Gruppe 2\",IF(D68=D68,D68))","v":"Kvartfinale: 1. plads i Gruppe 2"},{"$f":"IF(E68=\"\",\"\",E68)","v":""},{"$f":"IF(F68=\"\",\"\",F68)","v":""},{"$f":"IF(G68=\"\",\"Kvartfinale: 2. plads i Gruppe 1\",IF(G68=G68,G68))","v":"Kvartfinale: 2. plads i Gruppe 1"},"3. plads fra gruppe 3"]
[null,53,"16:26:00",{"$f":"IF(D70=\"\",\"Kvartfinale: 1. plads i Gruppe 3\",IF(D70=D70,D70))","v":"Kvartfinale: 1. plads i Gruppe 3"},{"$f":"IF(E70=\"\",\"\",E70)","v":""},{"$f":"IF(F70=\"\",\"\",F70)","v":""},{"$f":"IF(G70=\"\",\"Kvartfinale: 2. plads i Gruppe 4\",IF(G70=G70,G70))","v":"Kvartfinale: 2. plads i Gruppe 4"},"3. plads fra gruppe 2"]
[null,54,"16:34:00",{"$f":"IF(D72=\"\",\"Kvartfinale: 1. plads i Gruppe 4\",IF(D72=D72,D72))","v":"Kvartfinale: 1. plads i Gruppe 4"},{"$f":"IF(E72=\"\",\"\",E72)","v":""},{"$f":"IF(F72=\"\",\"\",F72)","v":""},{"$f":"IF(G72=\"\",\"Kvartfinale: 2. plads i Gruppe 3\",IF(G72=G72,G72))","v":"Kvartfinale: 2. plads i Gruppe 3"},"3. plads fra gruppe 1"]
[null,55,"16:42:00","Pigefinale: Nr. 1 i Pigegruppen",null,null,"Pigefinale: Nr. 2 i Pigegruppen","Taber af kamp 54"]
[null,56,"16:50:00",{"$f":"IF(D75=\"\",\"Semifinale: Vinder af kamp 51\",IF(D75=D75,D75))","v":"Semifinale: Vinder af kamp 51"},{"$f":"IF(E75=\"\",\"\",E75)","v":""},{"$f":"IF(F75=\"\",\"\",F75)","v":""},{"$f":"IF(G75=\"\",\"Semifinale: Vinder af kamp 53\",IF(G75=G75,G75))","v":"Semifinale: Vinder af kamp 53"},"Taber af kamp 51"]
[null,57,"16:58:00",{"$f":"IF(D77=\"\",\"Semifinale: Vinder af kamp 52\",IF(D77=D77,D77))","v":"Semifinale: Vinder af kamp 52"},{"$f":"IF(E77=\"\",\"\",E77)","v":""},{"$f":"IF(F77=\"\",\"\",F77)","v":""},{"$f":"IF(G77=\"\",\"Semifinale: Vinder af kamp 54\",IF(G77=G77,G77))","v":"Semifinale: Vinder af kamp 54"},"Taber af kamp 52"]
[null,58,"17:06:00",{"$f":"IF(D80=\"\",\"Bronzekamp: Taber af kamp 56\",IF(D80=D80,D80))","v":"Bronzekamp: Taber af kamp 56"},{"$f":"IF(E80=\"\",\"\",E80)","v":""},{"$f":"IF(F80=\"\",\"\",F80)","v":""},{"$f":"IF(G80=\"\",\"Bronzekamp: Taber af kamp 57\",IF(G80=G80,G80))","v":"Bronzekamp: Taber af kamp 57"},"Taber af kamp 53"]
[null,59,"17:14:00",{"$f":"IF(D83=\"\",\"Finale: Vinder af kamp 56\",IF(D83=D83,D83))","v":"Finale: Vinder af kamp 56"},{"$f":"IF(E83=\"\",\"\",E83)","v":""},{"$f":"IF(F83=\"\",\"\",F83)","v":""},{"$f":"IF(G83=\"\",\"Finale: Vinder af kamp 57\",IF(G83=G83,G83))","v":"Finale: Vinder af kamp 57"},"Vinder af kamp 58"]
[]
[]
[null,null,null,"SLUTSPIL - DRENGETURNERING"]
[null,"Kamp nr.",null,"KVARTFINALER",null,null,"KVARTFINALER"]
[null,51]
[]
[null,52]
[]
[null,53]
[]
[null,54]
[]
[null,null,null,"SEMIFINALER",null,null,"SEMIFINALER"]
[null,56,null,{"$f":"IF(F66=\"\",\"\",IF(E66>F66,D66,G66))","v":""},null,null,{"$f":"IF(F70=\"\",\"\",IF(E70>F70,D70,G70))","v":""}]
[]
[null,57,null,{"$f":"IF(F68=\"\",\"\",IF(E68>F68,D68,G68))","v":""},null,null,{"$f":"IF(F72=\"\",\"\",IF(E72>F72,D72,G72))","v":""}]
[]
[null,null,null,"BRONZEKAMP",null,null,"BRONZEKAMP"]
[null,58,null,{"$f":"IF(F75=\"\",\"\",IF(E75>F75,G75,D75))","v":""},null,null,{"$f":"IF(F77=\"\",\"\",IF(E77>F77,G77,D77))","v":""}]
[]
[null,null,null,"FINALE",null,null,"FINALE"]
[null,59,null,{"$f":"IF(F75=\"\",\"\",IF(E75>F75,D75,G75))","v":""},null,null,{"$f":"IF(F77=\"\",\"\",IF(E77>F77,D77,G77))","v":""}]
[]
[null,null,null,"VINDER AF HARBOØRE CUP 2011"]
[null,null,null,null,{"$f":"IF(F83=\"\",\"\",IF(E83>F83,D83,G83))","v":""}]

{"sheet":"Ark2","index":1,"n_rows":0,"n_cols":0,"rows_kept":0,"cut":false,"hidden":false,"merged":[]}

{"sheet":"Ark3","index":2,"n_rows":0,"n_cols":0,"rows_kept":0,"cut":false,"hidden":false,"merged":[]}