{"text_format":"1","workbook":"xlsx","n_sheets":3,"sheets":["Log","fejl","Ark1"],"not_rendered":{"charts":0,"images":10,"macros":1,"external_links":0,"defined_names":2,"comments":0,"pivot_tables":0},"unopened":[],"bounds":{"document_bytes":16777216,"sheet_cells":100000,"rows_first":2000,"rows_last":500,"rows_between":2000,"halvings":0,"cell_chars":16384,"cell_head_chars":4096},"cells_cut":0,"cells_raw":0,"read":"whole","date_system":"1900"}

{"sheet":"Log","index":0,"n_rows":102,"n_cols":7,"rows_kept":102,"cut":false,"hidden":false,"merged":[[1,1,1,6]]}
[]
[null,"Drift og Fejl Log"]
[null,"Dato","Tid","Tekst","Fejl nr","Fejl","Bemærkning"]
[null,"2023-06-24","23:00:00","Fejl",25,{"$f":"IF(E4<>\"\",VLOOKUP(E4,fejl!$B$2:$C$6,2),\"\")","v":"Sikkerhedsmotor 1"},{"$f":"IFERROR(VLOOKUP(D4,fejl!$E$2:$F$6,2,),\"\")","v":""}]
[null,"2023-06-25","14:46:00","Opt.",null,{"$f":"IF(E5<>\"\",VLOOKUP(E5,fejl!$B$2:$C$6,2),\"\")","v":""},{"$f":"IFERROR(VLOOKUP(D5,fejl!$E$2:$F$6,2,),\"\")","v":"Genstartet fyret"}]
[null,"2023-06-26","15:12:00","Fejl",4,{"$f":"IF(E6<>\"\",VLOOKUP(E6,fejl!$B$2:$C$6,2),\"\")","v":"Overophedning vand"},{"$f":"IFERROR(VLOOKUP(D6,fejl!$E$2:$F$6,2,),\"\")","v":""}]
[null,"2023-06-27","08:38:00","Opt.",null,{"$f":"IF(E7<>\"\",VLOOKUP(E7,fejl!$B$2:$C$6,2),\"\")","v":""},{"$f":"IFERROR(VLOOKUP(D7,fejl!$E$2:$F$6,2,),\"\")","v":"Genstartet fyret"}]
[null,"2023-06-29","12:51:00","Fejl",4,{"$f":"IF(E8<>\"\",VLOOKUP(E8,fejl!$B$2:$C$6,2),\"\")","v":"Overophedning vand"},{"$f":"IFERROR(VLOOKUP(D8,fejl!$E$2:$F$6,2,),\"\")","v":""}]
[null,"2023-06-30","08:29:00","Opt.",null,{"$f":"IF(E9<>\"\",VLOOKUP(E9,fejl!$B$2:$C$6,2),\"\")","v":""},{"$f":"IFERROR(VLOOKUP(D9,fejl!$E$2:$F$6,2,),\"\")","v":"Genstartet fyret"}]
[null,"2023-07-03","07:38:00","Fejl",25,{"$f":"IF(E10<>\"\",VLOOKUP(E10,fejl!$B$2:$C$6,2),\"\")","v":"Sikkerhedsmotor 1"},{"$f":"IFERROR(VLOOKUP(D10,fejl!$E$2:$F$8,2,),\" \")","v":" "}]
[null,"2023-07-03","17:31:00","Opt.",null,{"$f":"IF(E11<>\"\",VLOOKUP(E11,fejl!$B$2:$C$6,2),\"\")","v":""},{"$f":"IFERROR(VLOOKUP(D11,fejl!$E$2:$F$9,2,),\"\")","v":"Genstartet fyret"}]
[null,"2023-07-09","08:46:00","Sluk.",null,{"$f":"IF(E12<>\"\",VLOOKUP(E12,fejl!$B$2:$C$6,2),\"\")","v":""},{"$f":"IFERROR(VLOOKUP(D12,fejl!$E$2:$F$9,2,),\"\")","v":"Slukket fyret"}]
[null,"2023-07-23","06:44:00","Tændt.",null,{"$f":"IF(E13<>\"\",VLOOKUP(E13,fejl!$B$2:$C$6,2),\"\")","v":""},{"$f":"IFERROR(VLOOKUP(D13,fejl!$E$2:$F$9,2,),\"\")","v":"Tændt fyret"}]
[null,"2023-07-28","18:58:00","Fejl",4,{"$f":"IF(E14<>\"\",VLOOKUP(E14,fejl!$B$2:$C$6,2),\"\")","v":"Overophedning vand"},{"$f":"IFERROR(VLOOKUP(D14,fejl!$E$2:$F$9,2,),\"\")","v":" "}]
[null,"2023-07-29","18:30:00","Opt.",null,{"$f":"IF(E15<>\"\",VLOOKUP(E15,fejl!$B$2:$C$6,2),\"\")","v":""},{"$f":"IFERROR(VLOOKUP(D15,fejl!$E$2:$F$9,2,),\"\")","v":"Genstartet fyret"}]
[null,"2023-09-08","14:50:00","Fejl",4,{"$f":"IF(E16<>\"\",VLOOKUP(E16,fejl!$B$2:$C$6,2),\"\")","v":"Overophedning vand"},{"$f":"IFERROR(VLOOKUP(D16,fejl!$E$2:$F$9,2,),\"\")","v":" "}]
[null,"2023-09-13","18:00:00","Opt.",null,{"$f":"IF(E17<>\"\",VLOOKUP(E17,fejl!$B$2:$C$6,2),\"\")","v":""},{"$f":"IFERROR(VLOOKUP(D17,fejl!$E$2:$F$9,2,),\"\")","v":"Genstartet fyret"}]
[null,"2023-09-13","18:39:00","Fejl",3,{"$f":"IF(E18<>\"\",VLOOKUP(E18,fejl!$B$2:$C$6,2),\"\")","v":"Manglende Flamme"},{"$f":"IFERROR(VLOOKUP(D18,fejl!$E$2:$F$9,2,),\"\")","v":" "}]
[null,"2023-09-13","19:00:00","Opt.",null,{"$f":"IF(E19<>\"\",VLOOKUP(E19,fejl!$B$2:$C$6,2),\"\")","v":""},{"$f":"IFERROR(VLOOKUP(D19,fejl!$E$2:$F$9,2,),\"\")","v":"Genstartet fyret"}]
[null,"2023-09-13","19:45:00","Fejl",3,{"$f":"IF(E20<>\"\",VLOOKUP(E20,fejl!$B$2:$C$6,2),\"\")","v":"Manglende Flamme"},{"$f":"IFERROR(VLOOKUP(D20,fejl!$E$2:$F$9,2,),\"\")","v":" "}]
[null,"2023-09-14","11:17:00","Opt.",null,{"$f":"IF(E21<>\"\",VLOOKUP(E21,fejl!$B$2:$C$6,2),\"\")","v":""},{"$f":"IFERROR(VLOOKUP(D21,fejl!$E$2:$F$9,2,),\"\")","v":"Genstartet fyret"}]
[null,"2023-09-14","11:55:00","Fejl",3,{"$f":"IF(E22<>\"\",VLOOKUP(E22,fejl!$B$2:$C$6,2),\"\")","v":"Manglende Flamme"},{"$f":"IFERROR(VLOOKUP(D22,fejl!$E$2:$F$9,2,),\"\")","v":" "}]
[null,"2023-09-14","12:28:00","Opt.",null,{"$f":"IF(E23<>\"\",VLOOKUP(E23,fejl!$B$2:$C$6,2),\"\")","v":""},{"$f":"IFERROR(VLOOKUP(D23,fejl!$E$2:$F$9,2,),\"\")","v":"Genstartet fyret"}]
[null,"2023-09-14","13:04:00","Fejl",3,{"$f":"IF(E24<>\"\",VLOOKUP(E24,fejl!$B$2:$C$6,2),\"\")","v":"Manglende Flamme"},{"$f":"IFERROR(VLOOKUP(D24,fejl!$E$2:$F$9,2,),\"\")","v":" "}]
[null,"2023-09-14",null,"Opt.",null,{"$f":"IF(E25<>\"\",VLOOKUP(E25,fejl!$B$2:$C$6,2),\"\")","v":""},{"$f":"IFERROR(VLOOKUP(D25,fejl!$E$2:$F$9,2,),\"\")","v":"Genstartet fyret"}]
[null,"2023-09-17","07:26:00","Fejl",15,{"$f":"IF(E26<>\"\",VLOOKUP(E26,fejl!$B$2:$C$6,2),\"\")","v":"Strøm afbrydelse"},{"$f":"IFERROR(VLOOKUP(D26,fejl!$E$2:$F$9,2,),\"\")","v":" "}]
[null,"2023-09-17",null,"Opt.",null,{"$f":"IF(E27<>\"\",VLOOKUP(E27,fejl!$B$2:$C$6,2),\"\")","v":""},{"$f":"IFERROR(VLOOKUP(D27,fejl!$E$2:$F$9,2,),\"\")","v":"Genstartet fyret"}]
[null,"2023-09-17","15:34:00","Fejl",4,{"$f":"IF(E28<>\"\",VLOOKUP(E28,fejl!$B$2:$C$6,2),\"\")","v":"Overophedning vand"},{"$f":"IFERROR(VLOOKUP(D28,fejl!$E$2:$F$9,2,),\"\")","v":" "}]
[null,"2023-09-18",null,"Opt.",null,{"$f":"IF(E29<>\"\",VLOOKUP(E29,fejl!$B$2:$C$6,2),\"\")","v":""},{"$f":"IFERROR(VLOOKUP(D29,fejl!$E$2:$F$9,2,),\"\")","v":"Genstartet fyret"}]
[null,"2023-09-18","08:13:00","Fejl",3,{"$f":"IF(E30<>\"\",VLOOKUP(E30,fejl!$B$2:$C$6,2),\"\")","v":"Manglende Flamme"},{"$f":"IFERROR(VLOOKUP(D30,fejl!$E$2:$F$9,2,),\"\")","v":" "}]
[null,"2023-09-18",null,"Opt.",null,{"$f":"IF(E31<>\"\",VLOOKUP(E31,fejl!$B$2:$C$6,2),\"\")","v":""},{"$f":"IFERROR(VLOOKUP(D31,fejl!$E$2:$F$9,2,),\"\")","v":"Genstartet fyret"}]
[null,"2023-09-18","17:55:00","Fejl",4,{"$f":"IF(E32<>\"\",VLOOKUP(E32,fejl!$B$2:$C$6,2),\"\")","v":"Overophedning vand"},{"$f":"IFERROR(VLOOKUP(D32,fejl!$E$2:$F$9,2,),\"\")","v":" "}]
[null,"2023-09-19","09:08:00","Opt.",null,{"$f":"IF(E33<>\"\",VLOOKUP(E33,fejl!$B$2:$C$6,2),\"\")","v":""},{"$f":"IFERROR(VLOOKUP(D33,fejl!$E$2:$F$9,2,),\"\")","v":"Genstartet fyret"}]
[null,"2023-09-20","11:26:00","Fejl",4,{"$f":"IF(E34<>\"\",VLOOKUP(E34,fejl!$B$2:$C$6,2),\"\")","v":"Overophedning vand"},{"$f":"IFERROR(VLOOKUP(D34,fejl!$E$2:$F$9,2,),\"\")","v":" "}]
[null,"2023-09-21","06:54:00","Opt.",null,{"$f":"IF(E35<>\"\",VLOOKUP(E35,fejl!$B$2:$C$6,2),\"\")","v":""},{"$f":"IFERROR(VLOOKUP(D35,fejl!$E$2:$F$9,2,),\"\")","v":"Genstartet fyret"}]
[null,"2023-09-21","16:05:00","Fejl",4,{"$f":"IF(E36<>\"\",VLOOKUP(E36,fejl!$B$2:$C$6,2),\"\")","v":"Overophedning vand"},{"$f":"IFERROR(VLOOKUP(D36,fejl!$E$2:$F$9,2,),\"\")","v":" "}]
[null,"2023-09-22","08:34:00","Opt.",null,{"$f":"IF(E37<>\"\",VLOOKUP(E37,fejl!$B$2:$C$6,2),\"\")","v":""},{"$f":"IFERROR(VLOOKUP(D37,fejl!$E$2:$F$9,2,),\"\")","v":"Genstartet fyret"}]
[null,"2023-09-22","08:34:00","vand",null,{"$f":"IF(E38<>\"\",VLOOKUP(E38,fejl!$B$2:$C$6,2),\"\")","v":""},{"$f":"IFERROR(VLOOKUP(D38,fejl!$E$2:$F$9,2,),\"\")","v":"Fyldt vand på"}]
[null,"2023-09-22","12:04:00","Fejl",4,{"$f":"IF(E39<>\"\",VLOOKUP(E39,fejl!$B$2:$C$6,2),\"\")","v":"Overophedning vand"},{"$f":"IFERROR(VLOOKUP(D39,fejl!$E$2:$F$6,2,),\"\")","v":""}]
[null,"2023-09-22","15:35:00","Opt.",null,{"$f":"IF(E40<>\"\",VLOOKUP(E40,fejl!$B$2:$C$6,2),\"\")","v":""},{"$f":"IFERROR(VLOOKUP(D40,fejl!$E$2:$F$6,2,),\"\")","v":"Genstartet fyret"}]
[null,"2023-10-07","08:04:00","Fejl",12,{"$f":"IF(E41<>\"\",VLOOKUP(E41,fejl!$B$2:$C$6,2),\"\")","v":"tændnings fejl"},{"$f":"IFERROR(VLOOKUP(D41,fejl!$E$2:$F$6,2,),\"\")","v":""}]
[null,"2023-10-07","09:54:00","Opt.",null,{"$f":"IF(E42<>\"\",VLOOKUP(E42,fejl!$B$2:$C$6,2),\"\")","v":""},{"$f":"IFERROR(VLOOKUP(D42,fejl!$E$2:$F$6,2,),\"\")","v":"Genstartet fyret"}]
[null,"2023-10-07","10:45:00","Fejl",3,{"$f":"IF(E43<>\"\",VLOOKUP(E43,fejl!$B$2:$C$6,2),\"\")","v":"Manglende Flamme"},{"$f":"IFERROR(VLOOKUP(D43,fejl!$E$2:$F$6,2,),\"\")","v":""}]
[null,"2023-10-07",null,"Opt.",null,{"$f":"IF(E44<>\"\",VLOOKUP(E44,fejl!$B$2:$C$6,2),\"\")","v":""},{"$f":"IFERROR(VLOOKUP(D44,fejl!$E$2:$F$6,2,),\"\")","v":"Genstartet fyret"}]
[null,"2023-10-07","15:05:00","Fejl",3,{"$f":"IF(E45<>\"\",VLOOKUP(E45,fejl!$B$2:$C$6,2),\"\")","v":"Manglende Flamme"},{"$f":"IFERROR(VLOOKUP(D45,fejl!$E$2:$F$6,2,),\"\")","v":""}]
[null,"2023-10-07","15:10:00","Opt.",null,{"$f":"IF(E46<>\"\",VLOOKUP(E46,fejl!$B$2:$C$6,2),\"\")","v":""},{"$f":"IFERROR(VLOOKUP(D46,fejl!$E$2:$F$6,2,),\"\")","v":"Genstartet fyret"}]
[null,"2023-10-07","15:33:00","Fejl",3,{"$f":"IF(E47<>\"\",VLOOKUP(E47,fejl!$B$2:$C$6,2),\"\")","v":"Manglende Flamme"},{"$f":"IFERROR(VLOOKUP(D47,fejl!$E$2:$F$6,2,),\"\")","v":""}]
[null,"2023-10-07","16:25:00","Opt.",null,{"$f":"IF(E48<>\"\",VLOOKUP(E48,fejl!$B$2:$C$6,2),\"\")","v":""},{"$f":"IFERROR(VLOOKUP(D48,fejl!$E$2:$F$6,2,),\"\")","v":"Genstartet fyret"}]
[null,"2023-10-12",null,null,25,{"$f":"IF(E49<>\"\",VLOOKUP(E49,fejl!$B$2:$C$6,2),\"\")","v":"Sikkerhedsmotor 1"},{"$f":"IFERROR(VLOOKUP(D49,fejl!$E$2:$F$6,2,),\"\")","v":""}]
[null,"2023-10-12",null,null,25,{"$f":"IF(E50<>\"\",VLOOKUP(E50,fejl!$B$2:$C$6,2),\"\")","v":"Sikkerhedsmotor 1"},{"$f":"IFERROR(VLOOKUP(D50,fejl!$E$2:$F$6,2,),\"\")","v":""}]
[null,"2023-10-13","11:00:00","Opt.",null,{"$f":"IF(E51<>\"\",VLOOKUP(E51,fejl!$B$2:$C$6,2),\"\")","v":""},{"$f":"IFERROR(VLOOKUP(D51,fejl!$E$2:$F$6,2,),\"\")","v":"Genstartet fyret"}]
[null,"2023-10-24","16:32:00","Fejl",25,{"$f":"IF(E52<>\"\",VLOOKUP(E52,fejl!$B$2:$C$6,2),\"\")","v":"Sikkerhedsmotor 1"},{"$f":"IFERROR(VLOOKUP(D52,fejl!$E$2:$F$6,2,),\"\")","v":""}]
[null,"2023-10-24","17:12:00","Opt.",null,{"$f":"IF(E53<>\"\",VLOOKUP(E53,fejl!$B$2:$C$6,2),\"\")","v":""},{"$f":"IFERROR(VLOOKUP(D53,fejl!$E$2:$F$6,2,),\"\")","v":"Genstartet fyret"}]
[null,"2023-10-24","17:43:00","Fejl",12,{"$f":"IF(E54<>\"\",VLOOKUP(E54,fejl!$B$2:$C$6,2),\"\")","v":"tændnings fejl"},{"$f":"IFERROR(VLOOKUP(D54,fejl!$E$2:$F$6,2,),\"\")","v":""}]
[null,"2023-10-24","17:43:00","Opt.",null,{"$f":"IF(E55<>\"\",VLOOKUP(E55,fejl!$B$2:$C$4,2),\"\")","v":""},{"$f":"IFERROR(VLOOKUP(D55,fejl!$E$2:$F$6,2,),\"\")","v":"Genstartet fyret"}]
[null,"2023-11-07","02:18:00","Fejl",3,{"$f":"IF(E56<>\"\",VLOOKUP(E56,fejl!$B$2:$C$4,2),\"\")","v":"Manglende Flamme"},{"$f":"IFERROR(VLOOKUP(D56,fejl!$E$2:$F$6,2,),\"\")","v":""}]
[null,"2023-11-07","06:30:00","Opt.",null,{"$f":"IF(E57<>\"\",VLOOKUP(E57,fejl!$B$2:$C$22,2),\"\")","v":""},{"$f":"IFERROR(VLOOKUP(D57,fejl!$E$2:$F$6,2,),\"\")","v":"Genstartet fyret"}]
[null,"2023-11-16","01:19:00","Fejl",3,{"$f":"IF(E58<>\"\",VLOOKUP(E58,fejl!$B$2:$C$22,2),\"\")","v":"Manglende Flamme"},{"$f":"IFERROR(VLOOKUP(D58,fejl!$E$2:$F$6,2,),\"\")","v":""}]
[null,"2023-11-16","06:20:00","Opt.",null,{"$f":"IF(E59<>\"\",VLOOKUP(E59,fejl!$B$2:$C$22,2),\"\")","v":""},{"$f":"IFERROR(VLOOKUP(D59,fejl!$E$2:$F$6,2,),\"\")","v":"Genstartet fyret"}]
[null,"2023-11-30","06:23:00","Fejl",3,{"$f":"IF(E60<>\"\",VLOOKUP(E60,fejl!$B$2:$C$22,2),\"\")","v":"Manglende Flamme"},{"$f":"IFERROR(VLOOKUP(D60,fejl!$E$2:$F$6,2,),\"\")","v":""}]
[null,"2023-11-30","07:30:00","Opt.",null,{"$f":"IF(E61<>\"\",VLOOKUP(E61,fejl!$B$2:$C$22,2),\"\")","v":""},{"$f":"IFERROR(VLOOKUP(D61,fejl!$E$2:$F$6,2,),\"\")","v":"Genstartet fyret"}]
[null,null,null,null,null,{"$f":"IF(E62<>\"\",VLOOKUP(E62,fejl!$B$2:$C$22,2),\"\")","v":""},{"$f":"IFERROR(VLOOKUP(D62,fejl!$E$2:$F$6,2,),\"\")","v":""}]
[null,null,null,null,null,{"$f":"IF(E63<>\"\",VLOOKUP(E63,fejl!$B$2:$C$22,2),\"\")","v":""},{"$f":"IFERROR(VLOOKUP(D63,fejl!$E$2:$F$6,2,),\"\")","v":""}]
[null,null,null,null,null,{"$f":"IF(E64<>\"\",VLOOKUP(E64,fejl!$B$2:$C$22,2),\"\")","v":""},{"$f":"IFERROR(VLOOKUP(D64,fejl!$E$2:$F$6,2,),\"\")","v":""}]
[null,null,null,null,null,{"$f":"IF(E65<>\"\",VLOOKUP(E65,fejl!$B$2:$C$22,2),\"\")","v":""},{"$f":"IFERROR(VLOOKUP(D65,fejl!$E$2:$F$6,2,),\"\")","v":""}]
[null,null,null,null,null,{"$f":"IF(E66<>\"\",VLOOKUP(E66,fejl!$B$2:$C$22,2),\"\")","v":""},{"$f":"IFERROR(VLOOKUP(D66,fejl!$E$2:$F$6,2,),\"\")","v":""}]
[null,null,null,null,null,{"$f":"IF(E67<>\"\",VLOOKUP(E67,fejl!$B$2:$C$22,2),\"\")","v":""},{"$f":"IFERROR(VLOOKUP(D67,fejl!$E$2:$F$6,2,),\"\")","v":""}]
[null,null,null,null,null,{"$f":"IF(E68<>\"\",VLOOKUP(E68,fejl!$B$2:$C$22,2),\"\")","v":""},{"$f":"IFERROR(VLOOKUP(D68,fejl!$E$2:$F$6,2,),\"\")","v":""}]
[null,null,null,null,null,{"$f":"IF(E69<>\"\",VLOOKUP(E69,fejl!$B$2:$C$22,2),\"\")","v":""},{"$f":"IFERROR(VLOOKUP(D69,fejl!$E$2:$F$6,2,),\"\")","v":""}]
[null,null,null,null,null,{"$f":"IF(E70<>\"\",VLOOKUP(E70,fejl!$B$2:$C$22,2),\"\")","v":""},{"$f":"IFERROR(VLOOKUP(D70,fejl!$E$2:$F$6,2,),\"\")","v":""}]
[null,null,null,null,null,{"$f":"IF(E71<>\"\",VLOOKUP(E71,fejl!$B$2:$C$22,2),\"\")","v":""},{"$f":"IFERROR(VLOOKUP(D71,fejl!$E$2:$F$6,2,),\"\")","v":""}]
[null,null,null,null,null,{"$f":"IF(E72<>\"\",VLOOKUP(E72,fejl!$B$2:$C$22,2),\"\")","v":""},{"$f":"IFERROR(VLOOKUP(D72,fejl!$E$2:$F$6,2,),\"\")","v":""}]
[null,null,null,null,null,{"$f":"IF(E73<>\"\",VLOOKUP(E73,fejl!$B$2:$C$22,2),\"\")","v":""},{"$f":"IFERROR(VLOOKUP(D73,fejl!$E$2:$F$6,2,),\"\")","v":""}]
[null,null,null,null,null,{"$f":"IF(E74<>\"\",VLOOKUP(E74,fejl!$B$2:$C$22,2),\"\")","v":""},{"$f":"IFERROR(VLOOKUP(D74,fejl!$E$2:$F$6,2,),\"\")","v":""}]
[null,null,null,null,null,{"$f":"IF(E75<>\"\",VLOOKUP(E75,fejl!$B$2:$C$22,2),\"\")","v":""},{"$f":"IFERROR(VLOOKUP(D75,fejl!$E$2:$F$6,2,),\"\")","v":""}]
[null,null,null,null,null,{"$f":"IF(E76<>\"\",VLOOKUP(E76,fejl!$B$2:$C$22,2),\"\")","v":""},{"$f":"IFERROR(VLOOKUP(D76,fejl!$E$2:$F$6,2,),\"\")","v":""}]
[null,null,null,null,null,{"$f":"IF(E77<>\"\",VLOOKUP(E77,fejl!$B$2:$C$22,2),\"\")","v":""},{"$f":"IFERROR(VLOOKUP(D77,fejl!$E$2:$F$6,2,),\"\")","v":""}]
[null,null,null,null,null,{"$f":"IF(E78<>\"\",VLOOKUP(E78,fejl!$B$2:$C$22,2),\"\")","v":""},{"$f":"IFERROR(VLOOKUP(D78,fejl!$E$2:$F$6,2,),\"\")","v":""}]
[null,null,null,null,null,{"$f":"IF(E79<>\"\",VLOOKUP(E79,fejl!$B$2:$C$22,2),\"\")","v":""},{"$f":"IFERROR(VLOOKUP(D79,fejl!$E$2:$F$6,2,),\"\")","v":""}]
[null,null,null,null,null,{"$f":"IF(E80<>\"\",VLOOKUP(E80,fejl!$B$2:$C$22,2),\"\")","v":""},{"$f":"IFERROR(VLOOKUP(D80,fejl!$E$2:$F$6,2,),\"\")","v":""}]
[null,null,null,null,null,{"$f":"IF(E81<>\"\",VLOOKUP(E81,fejl!$B$2:$C$22,2),\"\")","v":""},{"$f":"IFERROR(VLOOKUP(D81,fejl!$E$2:$F$6,2,),\"\")","v":""}]
[null,null,null,null,null,{"$f":"IF(E82<>\"\",VLOOKUP(E82,fejl!$B$2:$C$22,2),\"\")","v":""},{"$f":"IFERROR(VLOOKUP(D82,fejl!$E$2:$F$6,2,),\"\")","v":""}]
[null,null,null,null,null,{"$f":"IF(E83<>\"\",VLOOKUP(E83,fejl!$B$2:$C$22,2),\"\")","v":""},{"$f":"IFERROR(VLOOKUP(D83,fejl!$E$2:$F$6,2,),\"\")","v":""}]
[null,null,null,null,null,{"$f":"IF(E84<>\"\",VLOOKUP(E84,fejl!$B$2:$C$22,2),\"\")","v":""},{"$f":"IFERROR(VLOOKUP(D84,fejl!$E$2:$F$6,2,),\"\")","v":""}]
[null,null,null,null,null,{"$f":"IF(E85<>\"\",VLOOKUP(E85,fejl!$B$2:$C$22,2),\"\")","v":""},{"$f":"IFERROR(VLOOKUP(D85,fejl!$E$2:$F$6,2,),\"\")","v":""}]
[null,null,null,null,null,{"$f":"IF(E86<>\"\",VLOOKUP(E86,fejl!$B$2:$C$22,2),\"\")","v":""},{"$f":"IFERROR(VLOOKUP(D86,fejl!$E$2:$F$6,2,),\"\")","v":""}]
[null,null,null,null,null,{"$f":"IF(E87<>\"\",VLOOKUP(E87,fejl!$B$2:$C$22,2),\"\")","v":""},{"$f":"IFERROR(VLOOKUP(D87,fejl!$E$2:$F$6,2,),\"\")","v":""}]
[null,null,null,null,null,{"$f":"IF(E88<>\"\",VLOOKUP(E88,fejl!$B$2:$C$22,2),\"\")","v":""},{"$f":"IFERROR(VLOOKUP(D88,fejl!$E$2:$F$6,2,),\"\")","v":""}]
[null,null,null,null,null,{"$f":"IF(E89<>\"\",VLOOKUP(E89,fejl!$B$2:$C$22,2),\"\")","v":""},{"$f":"IFERROR(VLOOKUP(D89,fejl!$E$2:$F$6,2,),\"\")","v":""}]
[null,null,null,null,null,{"$f":"IF(E90<>\"\",VLOOKUP(E90,fejl!$B$2:$C$22,2),\"\")","v":""},{"$f":"IFERROR(VLOOKUP(D90,fejl!$E$2:$F$6,2,),\"\")","v":""}]
[null,null,null,null,null,{"$f":"IF(E91<>\"\",VLOOKUP(E91,fejl!$B$2:$C$22,2),\"\")","v":""},{"$f":"IFERROR(VLOOKUP(D91,fejl!$E$2:$F$6,2,),\"\")","v":""}]
[null,null,null,null,null,{"$f":"IF(E92<>\"\",VLOOKUP(E92,fejl!$B$2:$C$22,2),\"\")","v":""},{"$f":"IFERROR(VLOOKUP(D92,fejl!$E$2:$F$6,2,),\"\")","v":""}]
[null,null,null,null,null,{"$f":"IF(E93<>\"\",VLOOKUP(E93,fejl!$B$2:$C$22,2),\"\")","v":""},{"$f":"IFERROR(VLOOKUP(D93,fejl!$E$2:$F$6,2,),\"\")","v":""}]
[null,null,null,null,null,{"$f":"IF(E94<>\"\",VLOOKUP(E94,fejl!$B$2:$C$22,2),\"\")","v":""},{"$f":"IFERROR(VLOOKUP(D94,fejl!$E$2:$F$6,2,),\"\")","v":""}]
[null,null,null,null,null,{"$f":"IF(E95<>\"\",VLOOKUP(E95,fejl!$B$2:$C$22,2),\"\")","v":""},{"$f":"IFERROR(VLOOKUP(D95,fejl!$E$2:$F$6,2,),\"\")","v":""}]
[null,null,null,null,null,{"$f":"IF(E96<>\"\",VLOOKUP(E96,fejl!$B$2:$C$22,2),\"\")","v":""},{"$f":"IFERROR(VLOOKUP(D96,fejl!$E$2:$F$6,2,),\"\")","v":""}]
[null,null,null,null,null,{"$f":"IF(E97<>\"\",VLOOKUP(E97,fejl!$B$2:$C$22,2),\"\")","v":""},{"$f":"IFERROR(VLOOKUP(D97,fejl!$E$2:$F$6,2,),\"\")","v":""}]
[null,null,null,null,null,{"$f":"IF(E98<>\"\",VLOOKUP(E98,fejl!$B$2:$C$22,2),\"\")","v":""},{"$f":"IFERROR(VLOOKUP(D98,fejl!$E$2:$F$6,2,),\"\")","v":""}]
[null,null,null,null,null,{"$f":"IF(E99<>\"\",VLOOKUP(E99,fejl!$B$2:$C$22,2),\"\")","v":""},{"$f":"IFERROR(VLOOKUP(D99,fejl!$E$2:$F$6,2,),\"\")","v":""}]
[null,null,null,null,null,{"$f":"IF(E100<>\"\",VLOOKUP(E100,fejl!$B$2:$C$22,2),\"\")","v":""},{"$f":"IFERROR(VLOOKUP(D100,fejl!$E$2:$F$6,2,),\"\")","v":""}]
[null,null,null,null,null,{"$f":"IF(E101<>\"\",VLOOKUP(E101,fejl!$B$2:$C$22,2),\"\")","v":""},{"$f":"IFERROR(VLOOKUP(D101,fejl!$E$2:$F$6,2,),\"\")","v":""}]
[null,null,null,null,null,{"$f":"IF(E102<>\"\",VLOOKUP(E102,fejl!$B$2:$C$22,2),\"\")","v":""},{"$f":"IFERROR(VLOOKUP(D102,fejl!$E$2:$F$6,2,),\"\")","v":""}]

{"sheet":"fejl","index":1,"n_rows":8,"n_cols":6,"rows_kept":8,"cut":false,"hidden":false,"merged":[]}
[]
[null,3,"Manglende Flamme",null,"Tændt.","Tændt fyret"]
[null,4,"Overophedning vand",null,"Sluk.","Slukket fyret"]
[null,12,"tændnings fejl",null,"Opt.","Genstartet fyret"]
[null,15,"Strøm afbrydelse",null,"Skift T.","Skiftet tænder"]
[null,25,"Sikkerhedsmotor 1",null,"Skift D.","Skiftet lysdiode"]
[null,null,null,null,"Fejl"," "]
[null,null,null,null,"vand","Fyldt vand på"]

{"sheet":"Ark1","index":2,"n_rows":0,"n_cols":0,"rows_kept":0,"cut":false,"hidden":true,"merged":[]}