{"text_format":"1","workbook":"xlsx","n_sheets":4,"sheets":["Setup","Kampprogram","Stilling","Ark1"],"not_rendered":{"charts":0,"images":1,"macros":1,"external_links":0,"defined_names":1,"comments":0,"pivot_tables":0},"unopened":[],"bounds":{"document_bytes":16777216,"sheet_cells":100000,"rows_first":2000,"rows_last":500,"rows_between":2000,"halvings":0,"cell_chars":16384,"cell_head_chars":4096},"cells_cut":0,"cells_raw":0,"read":"whole","date_system":"1900"}

{"sheet":"Setup","index":0,"n_rows":10,"n_cols":8,"rows_kept":10,"cut":false,"hidden":false,"merged":[]}
[null,"Hold"]
[1,"perle",null,"Start tid : ",null,null,"08:00:00","min"]
[2,"løg"]
[3,"hvid",null,"Spilletid: ",1,"*","00:07:00","min"]
[4,"sort"]
[5,"blå",null,"Pause :",null,null,"00:01:00","min"]
[6,"rødlig"]
[7,"passion"]
[]
["Række : ","U6-Drenge"]

{"sheet":"Kampprogram","index":1,"n_rows":35,"n_cols":60,"rows_kept":35,"cut":false,"hidden":false,"merged":[[0,2,0,16],[25,4,25,7],[28,4,28,7],[28,2,28,3],[3,20,3,22],[3,38,3,40],[3,23,3,25],[3,26,3,28],[3,29,3,31],[3,32,3,34],[3,35,3,37]]}
[null,null,{"$f":"Setup!B10","v":"U6-Drenge"}]
[]
[null,null,"Nr.","Start","Hold",null,null,"Hold",null,null,null,null,null,null,null,null,null,null,null,null,null,null,null,null,null,null,null,null,null,null,null,null,null,null,null,null,null,null,null,null,null,null,"Team 1","Team 2","Goals","Goals",null,"Place","Team","Win","Draw","Lose","GF","GA","GF - GA","Goals Rank","Points","Rank"]
[null,null,1,{"$f":"Setup!G2","v":"08:00:00"},{"$f":"AW4","v":"perle"},0,1,{"$f":"AW5","v":"løg"},null,"Place","Team","K","W","D","L","GF - GA","Points",null,null,null,{"$f":"T5","v":"perle"},null,null,{"$f":"T6","v":"løg"},null,null,{"$f":"T7","v":"hvid"},null,null,{"$f":"T8","v":"sort"},null,null,{"$f":"T9","v":"blå"},null,null,{"$f":"T10","v":"rødlig"},null,null,{"$f":"T11","v":"passion"},null,null,null,{"$f":"E4 & IF(OR(F4=\"\",G4=\"\"),\"\",IF(F4>G4,\"_win\",IF(F4<G4,\"_lose\",\"_draw\")))","v":"perle_lose"},{"$f":"H4 & IF(OR(F4=\"\",G4=\"\"),\"\",IF(F4<G4,\"_win\",IF(F4>G4,\"_lose\",\"_draw\")))","v":"løg_win"},{"$f":"IF(OR(F4=\"\",G4=\"\"),0,F4)","v":0},{"$f":"IF(OR(F4=\"\",G4=\"\"),0,G4)","v":1},null,{"$f":"IF(SUM(AX4:BC4)=0,0,RANK(BF4,$BF$4:$BF$10,0))","v":1},{"$f":"Setup!B2","v":"perle"},{"$f":"COUNTIF(AQ:AR,AW4&\"_win\")","v":5},{"$f":"COUNTIF(AQ:AR,AW4&\"_draw\")","v":0},{"$f":"COUNTIF(AQ:AR,AW4&\"_lose\")","v":1},{"$f":"SUMIF($E$4:$E$24,AW4,$AS$4:$AS$24)+SUMIF($H$4:$H$24,AW4,$AT$4:$AT$24)","v":30},{"$f":"SUMIF($E$4:$E$24,AW4,$AT$4:$AT$24)+SUMIF($H$4:$H$24,AW4,$AS$4:$AS$24)","v":1},{"$f":"BA4-BB4","v":29},{"$f":"IF(SUM(AX4:AZ4)=0,0,RANK(BC4,$BC$4:$BC$10,1))","v":6},{"$f":"AX4*3+AY4","v":15},{"$f":"BE4*10000+BD4*100+BA4+BH4","v":150630},{"$f":"7-COUNTIF($BF$4:$BF$10,\"<=\"&BF4)","v":0},0]
[null,null,2,{"$f":"D4+Setup!$E$4*Setup!$G$4+Setup!$G$6","v":"08:08:00"},{"$f":"AW6","v":"hvid"},1,1,{"$f":"AW7","v":"sort"},null,1,{"$f":"IFERROR(VLOOKUP(J5,$AV$4:$BF$10,2,FALSE),\"\")","v":"perle"},{"$f":"IFERROR(M5+N5+O5,\"\")","v":6},{"$f":"IFERROR(VLOOKUP(J5,$AV$4:$BF$10,3,FALSE),\"\")","v":5},{"$f":"IFERROR(VLOOKUP(J5,$AV$4:$BF$10,4,FALSE),\"\")","v":0},{"$f":"IFERROR(VLOOKUP(J5,$AV$4:$BF$10,5,FALSE),\"\")","v":1},{"$f":"IFERROR(VLOOKUP(J5,$AV$4:$BF$10,6,FALSE) &\" - \"&VLOOKUP(J5,$AV$4:$BF$10,7,FALSE),\"\")","v":"30 - 1"},{"$f":"IFERROR(VLOOKUP(J5,$AV$4:$BF$10,10,FALSE),\"\")","v":15},null,null,{"$f":"AW4","v":"perle"},null,null,null,{"$f":"W6","v":0},"-",{"$f":"U6","v":1},{"$f":"W7","v":6},"-",{"$f":"U7","v":0},{"$f":"W8","v":6},"-",{"$f":"U8","v":0},{"$f":"W9","v":6},"-",{"$f":"U9","v":0},{"$f":"W10","v":6},"-",{"$f":"U10","v":0},{"$f":"W11","v":6},"-",{"$f":"U11","v":0},null,{"$f":"E5 & IF(OR(F5=\"\",G5=\"\"),\"\",IF(F5>G5,\"_win\",IF(F5<G5,\"_lose\",\"_draw\")))","v":"hvid_draw"},{"$f":"H5 & IF(OR(F5=\"\",G5=\"\"),\"\",IF(F5<G5,\"_win\",IF(F5>G5,\"_lose\",\"_draw\")))","v":"sort_draw"},{"$f":"IF(OR(F5=\"\",G5=\"\"),0,F5)","v":1},{"$f":"IF(OR(F5=\"\",G5=\"\"),0,G5)","v":1},null,{"$f":"IF(SUM(AX5:BC5)=0,0,RANK(BF5,$BF$4:$BF$10,0))","v":1},{"$f":"Setup!B3","v":"løg"},5,0,1,{"$f":"SUMIF($E$4:$E$24,AW5,$AS$4:$AS$24)+SUMIF($H$4:$H$24,AW5,$AT$4:$AT$24)","v":30},{"$f":"SUMIF($E$4:$E$24,AW5,$AT$4:$AT$24)+SUMIF($H$4:$H$24,AW5,$AS$4:$AS$24)","v":1},{"$f":"BA5-BB5","v":29},{"$f":"IF(SUM(AX5:AZ5)=0,0,RANK(BC5,$BC$4:$BC$10,1))","v":6},{"$f":"AX5*3+AY5","v":15},{"$f":"BE5*10000+BD5*100+BA5+BH5","v":150630},0,0]
[null,null,3,{"$f":"D5+Setup!$E$4*Setup!$G$4+Setup!$G$6","v":"08:16:00"},{"$f":"AW8","v":"blå"},2,1,{"$f":"AW9","v":"rødlig"},null,2,"","",{"$f":"IFERROR(VLOOKUP(J6,$AV$4:$BF$10,3,FALSE),\"\")","v":""},{"$f":"IFERROR(VLOOKUP(J6,$AV$4:$BF$10,4,FALSE),\"\")","v":""},{"$f":"IFERROR(VLOOKUP(J6,$AV$4:$BF$10,5,FALSE),\"\")","v":""},{"$f":"IFERROR(VLOOKUP(J6,$AV$4:$BF$10,6,FALSE) &\" - \"&VLOOKUP(J6,$AV$4:$BF$10,7,FALSE),\"\")","v":""},{"$f":"IFERROR(VLOOKUP(J6,$AV$4:$BF$10,10,FALSE),\"\")","v":""},null,null,{"$f":"AW5","v":"løg"},{"$f":"G4","v":1},"-",{"$f":"F4","v":0},null,null,null,{"$f":"Z7","v":11},"-",{"$f":"X7","v":0},{"$f":"Z8","v":0},"-",{"$f":"X8","v":1},{"$f":"Z9","v":6},"-",{"$f":"X9","v":0},{"$f":"Z10","v":6},"-",{"$f":"X10","v":0},{"$f":"Z11","v":6},"-",{"$f":"X11","v":0},null,"blå_win","rødlig_lose",2,1,null,{"$f":"IF(SUM(AX6:BC6)=0,0,RANK(BF6,$BF$4:$BF$10,0))","v":7},{"$f":"Setup!B4","v":"hvid"},0,2,4,3,22,-19,1,2,20103,6,0]
[null,null,4,{"$f":"D6+Setup!$E$4*Setup!$G$4+Setup!$G$6","v":"08:24:00"},{"$f":"AW10","v":"passion"},0,6,{"$f":"AW4","v":"perle"},null,3,{"$f":"IFERROR(VLOOKUP(J7,$AV$4:$BF$10,2,FALSE),\"\")","v":"blå"},{"$f":"IFERROR(M7+N7+O7,\"\")","v":6},3,1,2,"7 - 16",10,null,null,"hvid",{"$f":"F19","v":0},"-",{"$f":"G19","v":6},{"$f":"G12","v":0},"-",{"$f":"F12","v":11},null,null,null,{"$f":"AC8","v":1},"-",{"$f":"AA8","v":1},{"$f":"AC9","v":1},"-",{"$f":"AA9","v":2},{"$f":"AC10","v":0},"-",{"$f":"AA10","v":1},{"$f":"AC11","v":1},"-",{"$f":"AA11","v":1},null,"passion_lose","perle_win",0,6,null,{"$f":"IF(SUM(AX7:BC7)=0,0,RANK(BF7,$BF$4:$BF$10,0))","v":6},{"$f":"Setup!B5","v":"sort"},1,2,3,5,12,-7,5,5,50505,5,0]
[null,null,5,{"$f":"D7+Setup!$E$4*Setup!$G$4+Setup!$G$6","v":"08:32:00"},{"$f":"AW5","v":"løg"},0,1,{"$f":"AW7","v":"sort"},null,4,{"$f":"IFERROR(VLOOKUP(J8,$AV$4:$BF$10,2,FALSE),\"\")","v":"passion"},{"$f":"IFERROR(M8+N8+O8,\"\")","v":6},1,3,2,"5 - 16",6,null,null,"sort",{"$f":"G16","v":0},"-",{"$f":"F16","v":6},{"$f":"G8","v":1},"-",{"$f":"F8","v":0},{"$f":"G5","v":1},"-",{"$f":"F5","v":1},null,null,null,{"$f":"AF9","v":1},"-",{"$f":"AD9","v":2},{"$f":"AF10","v":1},"-",{"$f":"AD10","v":2},{"$f":"AF11","v":1},"-",{"$f":"AD11","v":1},null,"løg_lose","sort_win",0,1,null,3,{"$f":"Setup!B6","v":"blå"},3,1,2,7,16,-9,4,10,100407,2,0]
[null,null,6,{"$f":"D8+Setup!$E$4*Setup!$G$4+Setup!$G$6","v":"08:40:00"},{"$f":"AW6","v":"hvid"},1,2,{"$f":"AW8","v":"blå"},null,5,{"$f":"IFERROR(VLOOKUP(J9,$AV$4:$BF$10,2,FALSE),\"\")","v":"rødlig"},6,2,0,4,"5 - 17",6,null,null,"blå",{"$f":"F13","v":0},"-",{"$f":"G13","v":6},{"$f":"G18","v":0},"-",{"$f":"F18","v":6},{"$f":"G9","v":2},"-",{"$f":"F9","v":1},{"$f":"G24","v":2},"-",{"$f":"F24","v":1},null,null,null,{"$f":"AI10","v":2},"-",{"$f":"AG10","v":1},{"$f":"AI11","v":1},"-",{"$f":"AG11","v":1},null,"hvid_lose","blå_win",1,2,null,5,{"$f":"Setup!B7","v":"rødlig"},2,0,4,5,17,-12,2,6,60205,4,0]
[null,null,7,{"$f":"D9+Setup!$E$4*Setup!$G$4+Setup!$G$6","v":"08:48:00"},{"$f":"AW4","v":"perle"},6,0,{"$f":"AW9","v":"rødlig"},null,6,"sort",6,1,2,3,"5 - 12",5,null,null,"rødlig",{"$f":"G10","v":0},"-",{"$f":"F10","v":6},{"$f":"F15","v":0},"-",{"$f":"G15","v":6},{"$f":"F22","v":1},"-",{"$f":"G22","v":0},{"$f":"G20","v":2},"-",{"$f":"F20","v":1},{"$f":"G6","v":1},"-",{"$f":"F6","v":2},null,null,null,{"$f":"AL11","v":1},"-",{"$f":"AJ11","v":2},null,{"$f":"E10 & IF(OR(F10=\"\",G10=\"\"),\"\",IF(F10>G10,\"_win\",IF(F10<G10,\"_lose\",\"_draw\")))","v":"perle_win"},{"$f":"H10 & IF(OR(F10=\"\",G10=\"\"),\"\",IF(F10<G10,\"_win\",IF(F10>G10,\"_lose\",\"_draw\")))","v":"rødlig_lose"},{"$f":"IF(OR(F10=\"\",G10=\"\"),0,F10)","v":6},{"$f":"IF(OR(F10=\"\",G10=\"\"),0,G10)","v":0},null,4,{"$f":"Setup!B8","v":"passion"},1,3,2,5,16,-11,3,6,60305,3,0]
[null,null,8,{"$f":"D10+Setup!$E$4*Setup!$G$4+Setup!$G$6","v":"08:56:00"},{"$f":"AW7","v":"sort"},1,1,{"$f":"AW10","v":"passion"},null,7,"hvid",6,0,2,4,"3 - 22",2,null,null,"passion",{"$f":"F7","v":0},"-",{"$f":"G7","v":6},{"$f":"F23","v":0},"-",{"$f":"G23","v":6},{"$f":"F14","v":1},"-",{"$f":"G14","v":1},{"$f":"G11","v":1},"-",{"$f":"F11","v":1},{"$f":"G21","v":1},"-",{"$f":"F21","v":1},{"$f":"G17","v":2},"-",{"$f":"F17","v":1},null,null,null,null,"sort_draw","passion_draw",1,1]
[null,null,9,{"$f":"D11+Setup!$E$4*Setup!$G$4+Setup!$G$6","v":"09:04:00"},{"$f":"AW5","v":"løg"},11,0,{"$f":"AW6","v":"hvid"},null,null,null,null,null,null,null,null,null,null,null,null,null,null,null,null,null,null,null,null,null,null,null,null,null,null,null,null,null,null,null,null,null,null,"løg_win","hvid_lose",11,0]
[null,null,10,{"$f":"D12+Setup!$E$4*Setup!$G$4+Setup!$G$6","v":"09:12:00"},{"$f":"AW8","v":"blå"},0,6,{"$f":"AW4","v":"perle"},null,null,null,null,null,null,null,null,null,null,null,null,null,null,null,null,null,null,null,null,null,null,null,null,null,null,null,null,null,null,null,null,null,null,"blå_lose","perle_win",0,6]
[null,null,11,{"$f":"D13+Setup!$E$4*Setup!$G$4+Setup!$G$6","v":"09:20:00"},{"$f":"AW10","v":"passion"},1,1,{"$f":"AW6","v":"hvid"},null,null,null,null,null,null,null,null,null,null,null,null,null,null,null,null,null,null,null,null,null,null,null,null,null,null,null,null,null,null,null,null,null,null,"passion_draw","hvid_draw",1,1]
[null,null,12,{"$f":"D14+Setup!$E$4*Setup!$G$4+Setup!$G$6","v":"09:28:00"},{"$f":"AW9","v":"rødlig"},0,6,{"$f":"AW5","v":"løg"},null,null,null,null,null,null,null,null,null,null,null,null,null,0,1,null,null,6,0,null,null,null,null,null,null,null,null,null,null,null,null,null,null,null,"rødlig_lose","løg_win",0,6]
[null,null,13,{"$f":"D15+Setup!$E$4*Setup!$G$4+Setup!$G$6","v":"09:36:00"},{"$f":"AW4","v":"perle"},6,0,{"$f":"AW7","v":"sort"},null,null,null,null,null,null,null,null,null,null,null,null,null,1,1,null,null,0,6,null,null,null,null,null,null,null,null,null,null,null,null,null,null,null,"perle_win","sort_lose",6,0]
[null,null,14,{"$f":"D16+Setup!$E$4*Setup!$G$4+Setup!$G$6","v":"09:44:00"},{"$f":"AW9","v":"rødlig"},1,2,{"$f":"AW10","v":"passion"},null,null,null,null,null,null,null,null,null,null,null,null,null,2,1,null,null,2,0,null,null,null,null,null,null,null,null,null,null,null,null,null,null,null,"rødlig_lose","passion_win",1,2]
[null,null,15,{"$f":"D17+Setup!$E$4*Setup!$G$4+Setup!$G$6","v":"09:52:00"},{"$f":"AW5","v":"løg"},6,0,{"$f":"AW8","v":"blå"},null,null,null,null,null,null,null,null,null,null,null,null,null,0,6,null,null,0,6,null,null,null,null,null,null,null,null,null,null,null,null,null,null,null,"løg_win","blå_lose",6,0]
[null,null,16,{"$f":"D18+Setup!$E$4*Setup!$G$4+Setup!$G$6","v":"10:00:00"},"hvid",0,6,{"$f":"AW4","v":"perle"},null,null,null,null,null,null,null,null,null,null,null,null,null,0,1,null,null,0,6,null,null,null,null,null,null,null,null,null,null,null,null,null,null,null,"hvid_lose","perle_win",0,6]
[null,null,17,{"$f":"D19+Setup!$E$4*Setup!$G$4+Setup!$G$6","v":"10:08:00"},"sort",1,2,{"$f":"AW9","v":"rødlig"},null,null,null,null,null,null,null,null,null,null,null,null,null,1,2,null,null,0,1,null,null,null,null,null,null,null,null,null,null,null,null,null,null,null,"sort_lose","rødlig_win",1,2]
[null,null,18,{"$f":"D20+Setup!$E$4*Setup!$G$4+Setup!$G$6","v":"10:16:00"},"blå",1,1,{"$f":"AW10","v":"passion"},null,null,null,null,null,null,null,null,null,null,null,null,null,6,0,null,null,6,0,null,null,null,null,null,null,null,null,null,null,null,null,null,null,null,"blå_draw","passion_draw",1,1]
[null,null,19,{"$f":"D21+Setup!$E$4*Setup!$G$4+Setup!$G$6","v":"10:24:00"},"rødlig",1,0,{"$f":"AW6","v":"hvid"},null,null,null,null,null,null,null,null,null,null,null,null,null,1,1,null,null,6,0,null,null,null,null,null,null,null,null,null,null,null,null,null,null,null,"rødlig_win","hvid_lose",1,0]
[null,null,20,{"$f":"D22+Setup!$E$4*Setup!$G$4+Setup!$G$6","v":"10:32:00"},"passion",0,6,{"$f":"AW5","v":"løg"},null,null,null,null,null,null,null,null,null,null,null,null,null,11,0,null,null,0,1,null,null,null,null,null,null,null,null,null,null,null,null,null,null,null,"passion_lose","løg_win",0,6]
[null,null,21,{"$f":"D23+Setup!$E$4*Setup!$G$4+Setup!$G$6","v":"10:40:00"},{"$f":"AW7","v":"sort"},1,2,{"$f":"AW8","v":"blå"},null,null,null,null,null,null,null,null,null,null,null,null,null,0,6,null,null,0,6,null,null,null,null,null,null,null,null,null,null,null,null,null,null,null,"sort_lose","blå_win",1,2]
[null,null,null,null,null,null,null,null,null,null,null,null,null,null,null,null,null,null,null,null,null,1,1,null,null,1,0]
[null,null,"Nr.","Start","Finale",null,null,null,null,null,null,null,null,null,null,null,null,null,null,null,null,0,6,null,null,0,0,null,null,null,null,null,null,null,null,null,null,null,null,null,null,null,null,null,null,null,null,null,"Holdene indtastes på fanen Setup"]
[null,null,22,{"$f":"D24+Setup!E4*Setup!G4+Setup!G6","v":"10:48:00"},{"$f":"IF(SUM(L5:L11)=42,K5,\"\")","v":""},null,null,{"$f":"IF(SUM(L5:L11)=42,K6,\"\")","v":""},null,null,null,null,null,null,null,null,null,null,null,null,null,6,0,null,null,1,1,null,null,null,null,null,null,null,null,null,null,null,null,null,null,null,null,null,null,null,null,null,"Der må kun tastes i de grønne celler…"]
[null,null,null,null,null,null,null,null,null,null,null,null,null,null,null,null,null,null,null,null,null,1,2,null,null,2,1]
[null,null,"Vinder:",null,{"$f":"IF(F27>G27,E27,IF(G27>F27,H27,\"\"))","v":""},null,null,null,null,null,null,null,null,null,null,null,null,null,null,null,null,6,0,null,null,1,2]
[null,null,null,null,null,null,null,null,null,null,null,null,null,null,null,null,null,null,null,null,null,0,6,null,null,0,6]
[null,null,null,null,null,null,null,null,null,null,null,null,null,null,null,null,null,null,null,null,null,1,2,null,null,6,0]
[null,null,null,null,null,null,null,null,null,null,null,null,null,null,null,null,null,null,null,null,null,1,1,null,null,1,1]
[null,null,null,null,null,null,null,null,null,null,null,null,null,null,null,null,null,null,null,null,null,1,0,null,null,3,1]
[null,null,null,null,null,null,null,null,null,null,null,null,null,null,null,null,null,null,null,null,null,0,6,null,null,1,2]
[null,null,null,null,null,null,null,null,null,null,null,null,null,null,null,null,null,null,null,null,null,1,2,null,null,6,0]

{"sheet":"Stilling","index":2,"n_rows":44,"n_cols":54,"rows_kept":44,"cut":false,"hidden":false,"merged":[[39,51,40,52],[40,14,40,29],[40,31,40,47],[43,1,43,13],[43,14,43,29],[43,30,43,47],[43,48,43,52],[38,1,38,2],[38,3,38,13],[38,14,38,47],[38,48,38,52],[39,1,40,2],[39,3,40,13],[39,14,39,29],[39,31,39,47],[39,48,40,49],[39,50,40,50],[36,1,36,2],[36,3,36,5],[36,6,36,8],[36,9,36,13],[36,14,36,29],[36,31,36,47],[36,48,36,49],[36,51,36,52],[34,51,34,52],[35,1,35,2],[35,3,35,5],[35,6,35,8],[35,9,35,13],[35,14,35,29],[35,31,35,47],[35,48,35,49],[35,51,35,52],[33,48,33,49],[33,51,33,52],[34,1,34,2],[34,3,34,5],[34,6,34,8],[34,9,34,13],[34,14,34,29],[34,31,34,47],[34,48,34,49],[33,1,33,2],[33,3,33,5],[33,6,33,8],[33,9,33,13],[33,14,33,29],[33,31,33,47],[32,1,32,2],[32,3,32,5],[32,6,32,8],[32,9,32,13],[32,14,32,29],[32,31,32,47],[32,48,32,49],[32,51,32,52],[30,51,30,52],[31,1,31,2],[31,3,31,5],[31,6,31,8],[31,9,31,13],[31,14,31,29],[31,31,31,47],[31,48,31,49],[31,51,31,52],[29,48,29,49],[29,51,29,52],[30,1,30,2],[30,3,30,5],[30,6,30,8],[30,9,30,13],[30,14,30,29],[30,31,30,47],[30,48,30,49],[29,1,29,2],[29,3,29,5],[29,6,29,8],[29,9,29,13],[29,14,29,29],[29,31,29,47],[28,1,28,2],[28,3,28,5],[28,6,28,8],[28,9,28,13],[28,14,28,29],[28,31,28,47],[28,48,28,49],[28,51,28,52],[26,51,26,52],[27,1,27,2],[27,3,27,5],[27,6,27,8],[27,9,27,13],[27,14,27,29],[27,31,27,47],[27,48,27,49],[27,51,27,52],[25,48,25,49],[25,51,25,52],[26,1,26,2],[26,3,26,5],[26,6,26,8],[26,9,26,13],[26,14,26,29],[26,31,26,47],[26,48,26,49],[25,1,25,2],[25,3,25,5],[25,6,25,8],[25,9,25,13],[25,14,25,29],[25,31,25,47],[24,1,24,2],[24,3,24,5],[24,6,24,8],[24,9,24,13],[24,14,24,29],[24,31,24,47],[24,48,24,49],[24,51,24,52],[22,51,22,52],[23,1,23,2],[23,3,23,5],[23,6,23,8],[23,9,23,13],[23,14,23,29],[23,31,23,47],[23,48,23,49],[23,51,23,52],[21,48,21,49],[21,51,21,52],[22,1,22,2],[22,3,22,5],[22,6,22,8],[22,9,22,13],[22,14,22,29],[22,31,22,47],[22,48,22,49],[21,1,21,2],[21,3,21,5],[21,6,21,8],[21,9,21,13],[21,14,21,29],[21,31,21,47],[20,1,20,2],[20,3,20,5],[20,6,20,8],[20,9,20,13],[20,14,20,29],[20,31,20,47],[20,48,20,49],[20,51,20,52],[18,51,18,52],[19,1,19,2],[19,3,19,5],[19,6,19,8],[19,9,19,13],[19,14,19,29],[19,31,19,47],[19,48,19,49],[19,51,19,52],[17,48,17,49],[17,51,17,52],[18,1,18,2],[18,3,18,5],[18,6,18,8],[18,9,18,13],[18,14,18,29],[18,31,18,47],[18,48,18,49],[17,1,17,2],[17,3,17,5],[17,6,17,8],[17,9,17,13],[17,14,17,29],[17,31,17,47],[16,1,16,2],[16,3,16,5],[16,6,16,8],[16,9,16,13],[16,14,16,29],[16,31,16,47],[16,48,16,49],[16,51,16,52],[12,9,12,10],[12,11,12,46],[15,1,15,2],[15,3,15,5],[15,6,15,8],[15,9,15,13],[15,14,15,47],[15,48,15,52],[0,0,1,53],[5,9,5,46],[10,9,10,10],[10,11,10,46],[11,9,11,10],[11,11,11,46],[8,9,8,10],[8,11,8,46],[9,9,9,10],[9,11,9,46],[6,9,6,10],[6,11,6,46],[7,9,7,10],[7,11,7,46]]}
[{"$f":"Setup!B10","v":"U6-Drenge"}]
[]
[]
[]
[]
[null,null,null,null,null,null,null,null,null,"Stilling i Gruppe A"]
[null,null,null,null,null,null,null,null,null,"1.",null,{"$f":"Kampprogram!K5","v":"perle"}]
[null,null,null,null,null,null,null,null,null,"2.",null,{"$f":"Kampprogram!K6","v":""}]
[null,null,null,null,null,null,null,null,null,"3.",null,{"$f":"Kampprogram!K7","v":"blå"}]
[null,null,null,null,null,null,null,null,null,"4.",null,{"$f":"Kampprogram!K8","v":"passion"},null,null,null,null,null,null,null,null,null,null,null,null,null,null,null,null,null,null,null,null,null,null,null,null,null,null,null,null,null,null,null,null,null,null,null,null,null,null,null,null,null,{"$f":"CC10","v":0}]
[null,null,null,null,null,null,null,null,null,"5.",null,{"$f":"Kampprogram!K9","v":"rødlig"},null,null,null,null,null,null,null,null,null,null,null,null,null,null,null,null,null,null,null,null,null,null,null,null,null,null,null,null,null,null,null,null,null,null,null,null,null,null,null,null,null,0]
[null,null,null,null,null,null,null,null,null,"6.",null,{"$f":"Kampprogram!K10","v":"sort"},null,null,null,null,null,null,null,null,null,null,null,null,null,null,null,null,null,null,null,null,null,null,null,null,null,null,null,null,null,null,null,null,null,null,null,null,null,null,null,null,null,0]
[null,null,null,null,null,null,null,null,null,"7.",null,{"$f":"Kampprogram!K11","v":"hvid"},null,null,null,null,null,null,null,null,null,null,null,null,null,null,null,null,null,null,null,null,null,null,null,null,null,null,null,null,null,null,null,null,null,null,null,null,null,null,null,null,null,0]
[null,null,null,null,null,null,null,null,null,null,null,null,null,null,null,null,null,null,null,null,null,null,null,null,null,null,null,null,null,null,null,null,null,null,null,null,null,null,null,null,null,null,null,null,null,null,null,null,null,null,null,null,null,0]
[null,null,null,null,null,null,null,null,null,null,null,null,null,null,null,null,null,null,null,null,null,null,null,null,null,null,null,null,null,null,null,null,null,null,null,null,null,null,null,null,null,null,null,null,null,null,null,null,null,null,null,null,null,0]
[null,"Nr.",null,null,null,null,null,null,null,"Start",null,null,null,null,null,null,null,null,null,null,null,null,null,null,null,null,null,null,null,null,null,null,null,null,null,null,null,null,null,null,null,null,null,null,null,null,null,null,"Resultat"]
[null,1,null,null,null,null,null,null,null,{"$f":"Setup!G2","v":"08:00:00"},null,null,null,null,{"$f":"Kampprogram!E4","v":"perle"},null,null,null,null,null,null,null,null,null,null,null,null,null,null,null,"-",{"$f":"Kampprogram!H4","v":"løg"},null,null,null,null,null,null,null,null,null,null,null,null,null,null,null,null,{"$f":"Kampprogram!F4","v":0},null,":",{"$f":"Kampprogram!G4","v":1}]
[null,2,null,null,null,null,null,null,null,{"$f":"J17+Setup!$E$4*Setup!$G$4+Setup!$G$6","v":"08:08:00"},null,null,null,null,{"$f":"Kampprogram!E5","v":"hvid"},null,null,null,null,null,null,null,null,null,null,null,null,null,null,null,"-",{"$f":"Kampprogram!H5","v":"sort"},null,null,null,null,null,null,null,null,null,null,null,null,null,null,null,null,{"$f":"Kampprogram!F5","v":1},null,":",{"$f":"Kampprogram!G5","v":1}]
[null,3,null,null,null,null,null,null,null,{"$f":"J18+Setup!$E$4*Setup!$G$4+Setup!$G$6","v":"08:16:00"},null,null,null,null,{"$f":"Kampprogram!E6","v":"blå"},null,null,null,null,null,null,null,null,null,null,null,null,null,null,null,"-",{"$f":"Kampprogram!H6","v":"rødlig"},null,null,null,null,null,null,null,null,null,null,null,null,null,null,null,null,{"$f":"Kampprogram!F6","v":2},null,":",{"$f":"Kampprogram!G6","v":1}]
[null,4,null,null,null,null,null,null,null,{"$f":"J19+Setup!$E$4*Setup!$G$4+Setup!$G$6","v":"08:24:00"},null,null,null,null,{"$f":"Kampprogram!E7","v":"passion"},null,null,null,null,null,null,null,null,null,null,null,null,null,null,null,"-",{"$f":"Kampprogram!H7","v":"perle"},null,null,null,null,null,null,null,null,null,null,null,null,null,null,null,null,{"$f":"Kampprogram!F7","v":0},null,":",{"$f":"Kampprogram!G7","v":6}]
[null,5,null,null,null,null,null,null,null,{"$f":"J20+Setup!$E$4*Setup!$G$4+Setup!$G$6","v":"08:32:00"},null,null,null,null,{"$f":"Kampprogram!E8","v":"løg"},null,null,null,null,null,null,null,null,null,null,null,null,null,null,null,"-",{"$f":"Kampprogram!H8","v":"sort"},null,null,null,null,null,null,null,null,null,null,null,null,null,null,null,null,{"$f":"Kampprogram!F8","v":0},null,":",{"$f":"Kampprogram!G8","v":1}]
[null,6,null,null,null,null,null,null,null,{"$f":"J21+Setup!$E$4*Setup!$G$4+Setup!$G$6","v":"08:40:00"},null,null,null,null,{"$f":"Kampprogram!E9","v":"hvid"},null,null,null,null,null,null,null,null,null,null,null,null,null,null,null,"-",{"$f":"Kampprogram!H9","v":"blå"},null,null,null,null,null,null,null,null,null,null,null,null,null,null,null,null,{"$f":"Kampprogram!F9","v":1},null,":",{"$f":"Kampprogram!G9","v":2}]
[null,7,null,null,null,null,null,null,null,{"$f":"J22+Setup!$E$4*Setup!$G$4+Setup!$G$6","v":"08:48:00"},null,null,null,null,{"$f":"Kampprogram!E10","v":"perle"},null,null,null,null,null,null,null,null,null,null,null,null,null,null,null,"-",{"$f":"Kampprogram!H10","v":"rødlig"},null,null,null,null,null,null,null,null,null,null,null,null,null,null,null,null,{"$f":"Kampprogram!F10","v":6},null,":",{"$f":"Kampprogram!G10","v":0}]
[null,8,null,null,null,null,null,null,null,{"$f":"J23+Setup!$E$4*Setup!$G$4+Setup!$G$6","v":"08:56:00"},null,null,null,null,{"$f":"Kampprogram!E11","v":"sort"},null,null,null,null,null,null,null,null,null,null,null,null,null,null,null,"-",{"$f":"Kampprogram!H11","v":"passion"},null,null,null,null,null,null,null,null,null,null,null,null,null,null,null,null,{"$f":"Kampprogram!F11","v":1},null,":",{"$f":"Kampprogram!G11","v":1}]
[null,9,null,null,null,null,null,null,null,{"$f":"J24+Setup!$E$4*Setup!$G$4+Setup!$G$6","v":"09:04:00"},null,null,null,null,{"$f":"Kampprogram!E12","v":"løg"},null,null,null,null,null,null,null,null,null,null,null,null,null,null,null,"-",{"$f":"Kampprogram!H12","v":"hvid"},null,null,null,null,null,null,null,null,null,null,null,null,null,null,null,null,{"$f":"Kampprogram!F12","v":11},null,":",{"$f":"Kampprogram!G12","v":0}]
[null,10,null,null,null,null,null,null,null,{"$f":"J25+Setup!$E$4*Setup!$G$4+Setup!$G$6","v":"09:12:00"},null,null,null,null,{"$f":"Kampprogram!E13","v":"blå"},null,null,null,null,null,null,null,null,null,null,null,null,null,null,null,"-",{"$f":"Kampprogram!H13","v":"perle"},null,null,null,null,null,null,null,null,null,null,null,null,null,null,null,null,{"$f":"Kampprogram!F13","v":0},null,":",{"$f":"Kampprogram!G13","v":6}]
[null,11,null,null,null,null,null,null,null,{"$f":"J26+Setup!$E$4*Setup!$G$4+Setup!$G$6","v":"09:20:00"},null,null,null,null,{"$f":"Kampprogram!E14","v":"passion"},null,null,null,null,null,null,null,null,null,null,null,null,null,null,null,"-",{"$f":"Kampprogram!H14","v":"hvid"},null,null,null,null,null,null,null,null,null,null,null,null,null,null,null,null,{"$f":"Kampprogram!F14","v":1},null,":",{"$f":"Kampprogram!G14","v":1}]
[null,12,null,null,null,null,null,null,null,{"$f":"J27+Setup!$E$4*Setup!$G$4+Setup!$G$6","v":"09:28:00"},null,null,null,null,{"$f":"Kampprogram!E15","v":"rødlig"},null,null,null,null,null,null,null,null,null,null,null,null,null,null,null,"-",{"$f":"Kampprogram!H15","v":"løg"},null,null,null,null,null,null,null,null,null,null,null,null,null,null,null,null,{"$f":"Kampprogram!F15","v":0},null,":",{"$f":"Kampprogram!G15","v":6}]
[null,13,null,null,null,null,null,null,null,{"$f":"J28+Setup!$E$4*Setup!$G$4+Setup!$G$6","v":"09:36:00"},null,null,null,null,{"$f":"Kampprogram!E16","v":"perle"},null,null,null,null,null,null,null,null,null,null,null,null,null,null,null,"-",{"$f":"Kampprogram!H16","v":"sort"},null,null,null,null,null,null,null,null,null,null,null,null,null,null,null,null,{"$f":"Kampprogram!F16","v":6},null,":",{"$f":"Kampprogram!G16","v":0}]
[null,14,null,null,null,null,null,null,null,{"$f":"J29+Setup!$E$4*Setup!$G$4+Setup!$G$6","v":"09:44:00"},null,null,null,null,{"$f":"Kampprogram!E17","v":"rødlig"},null,null,null,null,null,null,null,null,null,null,null,null,null,null,null,"-",{"$f":"Kampprogram!H17","v":"passion"},null,null,null,null,null,null,null,null,null,null,null,null,null,null,null,null,{"$f":"Kampprogram!F17","v":1},null,":",{"$f":"Kampprogram!G17","v":2}]
[null,15,null,null,null,null,null,null,null,{"$f":"J30+Setup!$E$4*Setup!$G$4+Setup!$G$6","v":"09:52:00"},null,null,null,null,{"$f":"Kampprogram!E18","v":"løg"},null,null,null,null,null,null,null,null,null,null,null,null,null,null,null,"-",{"$f":"Kampprogram!H18","v":"blå"},null,null,null,null,null,null,null,null,null,null,null,null,null,null,null,null,{"$f":"Kampprogram!F18","v":6},null,":",{"$f":"Kampprogram!G18","v":0}]
[null,16,null,null,null,null,null,null,null,{"$f":"J31+Setup!$E$4*Setup!$G$4+Setup!$G$6","v":"10:00:00"},null,null,null,null,{"$f":"Kampprogram!E19","v":"hvid"},null,null,null,null,null,null,null,null,null,null,null,null,null,null,null,"-",{"$f":"Kampprogram!H19","v":"perle"},null,null,null,null,null,null,null,null,null,null,null,null,null,null,null,null,{"$f":"Kampprogram!F19","v":0},null,":",{"$f":"Kampprogram!G19","v":6}]
[null,17,null,null,null,null,null,null,null,{"$f":"J32+Setup!$E$4*Setup!$G$4+Setup!$G$6","v":"10:08:00"},null,null,null,null,{"$f":"Kampprogram!E20","v":"sort"},null,null,null,null,null,null,null,null,null,null,null,null,null,null,null,"-",{"$f":"Kampprogram!H20","v":"rødlig"},null,null,null,null,null,null,null,null,null,null,null,null,null,null,null,null,{"$f":"Kampprogram!F20","v":1},null,":",{"$f":"Kampprogram!G20","v":2}]
[null,18,null,null,null,null,null,null,null,{"$f":"J33+Setup!$E$4*Setup!$G$4+Setup!$G$6","v":"10:16:00"},null,null,null,null,{"$f":"Kampprogram!E21","v":"blå"},null,null,null,null,null,null,null,null,null,null,null,null,null,null,null,"-",{"$f":"Kampprogram!H21","v":"passion"},null,null,null,null,null,null,null,null,null,null,null,null,null,null,null,null,{"$f":"Kampprogram!F21","v":1},null,":",{"$f":"Kampprogram!G21","v":1}]
[null,19,null,null,null,null,null,null,null,{"$f":"J34+Setup!$E$4*Setup!$G$4+Setup!$G$6","v":"10:24:00"},null,null,null,null,{"$f":"Kampprogram!E22","v":"rødlig"},null,null,null,null,null,null,null,null,null,null,null,null,null,null,null,"-",{"$f":"Kampprogram!H22","v":"hvid"},null,null,null,null,null,null,null,null,null,null,null,null,null,null,null,null,{"$f":"Kampprogram!F22","v":1},null,":",{"$f":"Kampprogram!G22","v":0}]
[null,20,null,null,null,null,null,null,null,{"$f":"J35+Setup!$E$4*Setup!$G$4+Setup!$G$6","v":"10:32:00"},null,null,null,null,{"$f":"Kampprogram!E23","v":"passion"},null,null,null,null,null,null,null,null,null,null,null,null,null,null,null,"-",{"$f":"Kampprogram!H23","v":"løg"},null,null,null,null,null,null,null,null,null,null,null,null,null,null,null,null,{"$f":"Kampprogram!F23","v":0},null,":",{"$f":"Kampprogram!G23","v":6}]
[null,21,null,null,null,null,null,null,null,{"$f":"J36+Setup!$E$4*Setup!$G$4+Setup!$G$6","v":"10:40:00"},null,null,null,null,{"$f":"Kampprogram!E24","v":"sort"},null,null,null,null,null,null,null,null,null,null,null,null,null,null,null,"-",{"$f":"Kampprogram!H24","v":"blå"},null,null,null,null,null,null,null,null,null,null,null,null,null,null,null,null,{"$f":"Kampprogram!F24","v":1},null,":",{"$f":"Kampprogram!G24","v":2}]
[]
[null,"Nr.",null,"Start",null,null,null,null,null,null,null,null,null,null,"Finale",null,null,null,null,null,null,null,null,null,null,null,null,null,null,null,null,null,null,null,null,null,null,null,null,null,null,null,null,null,null,null,null,null,"Resultat"]
[null,22,null,{"$f":"J37+Setup!E4*Setup!G4+Setup!G6","v":"10:48:00"},null,null,null,null,null,null,null,null,null,null,{"$f":"Kampprogram!E27","v":""},null,null,null,null,null,null,null,null,null,null,null,null,null,null,null,"-",{"$f":"Kampprogram!H27","v":""},null,null,null,null,null,null,null,null,null,null,null,null,null,null,null,null,{"$f":"Kampprogram!M28","v":0},null,":",{"$f":"Kampprogram!N28","v":0}]
[null,null,null,null,null,null,null,null,null,null,null,null,null,null,"1. Gruppe A",null,null,null,null,null,null,null,null,null,null,null,null,null,null,null,null,"2. Gruppe A"]
[]
[]
[null,"Vinder",null,null,null,null,null,null,null,null,null,null,null,null,{"$f":"Kampprogram!E29","v":""},null,null,null,null,null,null,null,null,null,null,null,null,null,null,null,"Samlet Mål Scoret:",null,null,null,null,null,null,null,null,null,null,null,null,null,null,null,null,null,{"$f":"SUM(AW17:AW40)+SUM(AZ17:AZ40)","v":85}]

{"sheet":"Ark1","index":3,"n_rows":5,"n_cols":15,"rows_kept":5,"cut":false,"hidden":false,"merged":[[0,3,0,5],[0,6,0,8],[0,9,0,11],[0,12,0,14]]}
[null,null,null,"Team 1",null,null,"Team 2",null,null,"Team 3",null,null,"Team 4"]
[null,null,"Team 1",null,null,null,{"$f":"F3","v":2},"-",{"$f":"D3","v":7},{"$f":"F4","v":3},"-",{"$f":"D4","v":1},{"$f":"F5","v":1},"-",{"$f":"D5","v":4}]
["Pulje A",null,"Team 2",7,"-",2,null,null,null,{"$f":"I4","v":1},"-",{"$f":"G4","v":5},{"$f":"I5","v":5},"-",{"$f":"G5","v":1}]
[null,null,"Team 3",1,"-",3,5,"-",1,null,null,null,{"$f":"L5","v":1},"-",{"$f":"J5","v":10}]
[null,null,"Team 4",4,"-",1,1,"-",5,10,"-",1]