{"text_format":"1","workbook":"xlsx","n_sheets":6,"sheets":["BEMANDINGSPLAN","DAG","AFTEN","NAT","WEEKEND","FÆLLES"],"not_rendered":{"charts":0,"images":0,"macros":1,"external_links":0,"defined_names":8,"comments":0,"pivot_tables":0},"unopened":[],"bounds":{"document_bytes":16777216,"sheet_cells":100000,"rows_first":2000,"rows_last":500,"rows_between":2000,"halvings":0,"cell_chars":16384,"cell_head_chars":4096},"cells_cut":0,"cells_raw":0,"read":"whole","date_system":"1900"}

{"sheet":"BEMANDINGSPLAN","index":0,"n_rows":227,"n_cols":13,"rows_kept":227,"cut":false,"hidden":false,"merged":[]}
[null,"ANLÆG","DAG",null,null,"AFTEN",null,null,"NAT"]
[]
[null,"Anl. 1",{"$f":"VLOOKUP(E3,DAG!A2:B23,2,0)","v":"Person 7"},null,7,{"$f":"VLOOKUP(H3,AFTEN!A2:B23,2,0)","v":"Person 14"},null,5,{"$f":"VLOOKUP(K3,NAT!A2:B23,2,0)","v":"Person 23"},null,5]
[null,null,{"$f":"VLOOKUP(E4,DAG!A2:B23,2,0)","v":"Person 8"},"Elev",8,{"$f":"VLOOKUP(H4,AFTEN!A3:B24,2,0)","v":"Person 17"},null,8,{"$f":"VLOOKUP(K4,NAT!A3:B24,2,0)","v":"Person 26"},null,8]
[]
[null,"Anl. 2",{"$f":"VLOOKUP(E6,DAG!$A$2:$B$23,2,0)","v":"Person 3"},null,3,{"$f":"VLOOKUP(H6,AFTEN!A2:B23,2,0)","v":"Person 13"},null,4,{"$f":"VLOOKUP(K6,NAT!A2:B23,2,0)","v":"Person 25"},null,7]
[null,null,{"$f":"VLOOKUP(E7,DAG!A2:B23,2,0)","v":0},null,10,{"$f":"VLOOKUP(H7,AFTEN!A2:B23,2,0)","v":0},null,13,{"$f":"VLOOKUP(K7,NAT!A2:B23,2,0)","v":0},null,11]
[]
[null,"Anl. 3",{"$f":"VLOOKUP(E9,DAG!$A$2:$B$23,2,0)","v":"Person 2"},null,2,{"$f":"VLOOKUP(H9,AFTEN!$A$2:$B$23,2,0)","v":"Person 12"},null,3,{"$f":"VLOOKUP(K9,NAT!$A$2:$B$23,2,0)","v":"Person 24"},null,6]
[null,null,{"$f":"VLOOKUP(E10,DAG!$A$2:$B$23,2,0)","v":0},null,10,{"$f":"VLOOKUP(H10,AFTEN!$A$2:$B$23,2,0)","v":0},null,10,{"$f":"VLOOKUP(K10,NAT!$A$2:$B$23,2,0)","v":0},null,11]
[]
[null,"Anl. 4",{"$f":"VLOOKUP(E12,DAG!$A$2:$B$23,2,0)","v":"Person 5"},null,5,{"$f":"VLOOKUP(H12,AFTEN!$A$2:$B$23,2,0)","v":"Person 10"},null,1,{"$f":"VLOOKUP(K12,NAT!$A$2:$B$23,2,0)","v":"Person 22"},null,4]
[null,null,{"$f":"VLOOKUP(E13,DAG!$A$2:$B$23,2,0)","v":"Person 9"},null,9,{"$f":"VLOOKUP(H13,AFTEN!$A$2:$B$23,2,0)","v":0},null,11,{"$f":"VLOOKUP(K13,NAT!$A$2:$B$23,2,0)","v":0},null,11]
[]
[null,"Anl. 5",{"$f":"VLOOKUP(E15,DAG!$A$2:$B$23,2,0)","v":"Person 7"},null,7,{"$f":"VLOOKUP(H15,AFTEN!$A$2:$B$23,2,0)","v":"Person 16"},null,7,{"$f":"VLOOKUP(K15,NAT!$A$2:$B$23,2,0)","v":"Person 19"},null,1]
[null,null,{"$f":"VLOOKUP(E16,DAG!$A$2:$B$23,2,0)","v":0},null,10,{"$f":"VLOOKUP(H16,AFTEN!$A$2:$B$23,2,0)","v":0},null,12,{"$f":"VLOOKUP(K16,NAT!$A$2:$B$23,2,0)","v":"Person 26"},null,8]
[]
[null,"Anl. 6",{"$f":"VLOOKUP(E18,DAG!$A$2:$B$23,2,0)","v":"Person 4"},null,4,{"$f":"VLOOKUP(H18,AFTEN!$A$2:$B$23,2,0)","v":"Person 11"},null,2,{"$f":"VLOOKUP(K18,NAT!$A$2:$B$23,2,0)","v":"Person 20"},null,2]
[null,null,{"$f":"VLOOKUP(E19,DAG!$A$2:$B$23,2,0)","v":0},"Elev",18,{"$f":"VLOOKUP(H19,AFTEN!$A$2:$B$23,2,0)","v":0},null,10,{"$f":"VLOOKUP(K19,NAT!$A$2:$B$23,2,0)","v":0},null,11]
[]
[null,"Anl. 7",{"$f":"VLOOKUP(E21,DAG!$A$2:$B$23,2,0)","v":"Person 1"},null,1,{"$f":"VLOOKUP(H21,AFTEN!$A$2:$B$23,2,0)","v":"Person 15"},null,6,{"$f":"VLOOKUP(K21,NAT!$A$2:$B$23,2,0)","v":"Person 21"},null,3]
[null,null,{"$f":"VLOOKUP(E22,DAG!$A$2:$B$23,2,0)","v":0},null,16,{"$f":"VLOOKUP(H22,AFTEN!$A$2:$B$23,2,0)","v":0},null,10,{"$f":"VLOOKUP(K22,NAT!$A$2:$B$23,2,0)","v":0},null,11]
[]
[null,"Kursus/Skole","Ferie",null,null,"Ferie",null,null,"Sygdom"]
[null,{"$f":"VLOOKUP(M25,FÆLLES!$A$2:$B$29,2,0)","v":0},{"$f":"VLOOKUP(E25,FÆLLES!$A$2:$B$29,2,0)","v":0},null,27,{"$f":"VLOOKUP(H25,FÆLLES!$A$2:$B$29,2,0)","v":0},null,27,{"$f":"VLOOKUP(K25,FÆLLES!$A$2:$B$26,2,0)","v":{"$error":"#N/A"}},null,26,null,26]
[null,{"$f":"VLOOKUP(M26,FÆLLES!$A$2:$B$29,2,0)","v":0},{"$f":"VLOOKUP(E26,FÆLLES!$A$2:$B$29,2,0)","v":0},null,26,{"$f":"VLOOKUP(H26,FÆLLES!$A$2:$B$29,2,0)","v":0},null,27,{"$f":"VLOOKUP(K26,FÆLLES!$A$2:$B$26,2,0)","v":{"$error":"#N/A"}},null,26,null,27]
[null,{"$f":"VLOOKUP(M27,FÆLLES!$A$2:$B$29,2,0)","v":0},{"$f":"VLOOKUP(E27,FÆLLES!$A$2:$B$29,2,0)","v":0},null,27,{"$f":"VLOOKUP(H27,FÆLLES!$A$2:$B$29,2,0)","v":0},null,27,{"$f":"VLOOKUP(K27,FÆLLES!$A$2:$B$26,2,0)","v":{"$error":"#N/A"}},null,26,null,27]
[null,{"$f":"VLOOKUP(M28,FÆLLES!$A$2:$B$29,2,0)","v":0},{"$f":"VLOOKUP(E28,FÆLLES!$A$2:$B$29,2,0)","v":0},null,26,{"$f":"VLOOKUP(H28,FÆLLES!$A$2:$B$29,2,0)","v":0},null,27,{"$f":"VLOOKUP(K28,FÆLLES!$A$2:$B$26,2,0)","v":{"$error":"#N/A"}},null,26,null,27]
[null,{"$f":"VLOOKUP(M29,FÆLLES!$A$2:$B$29,2,0)","v":0},{"$f":"VLOOKUP(E29,FÆLLES!$A$2:$B$29,2,0)","v":0},null,27,{"$f":"VLOOKUP(H29,FÆLLES!$A$2:$B$29,2,0)","v":0},null,27,{"$f":"VLOOKUP(K29,FÆLLES!$A$2:$B$26,2,0)","v":{"$error":"#N/A"}},null,26,null,27]
[null,{"$f":"VLOOKUP(M30,FÆLLES!$A$2:$B$29,2,0)","v":0},{"$f":"VLOOKUP(E30,FÆLLES!$A$2:$B$29,2,0)","v":0},null,27,{"$f":"VLOOKUP(H30,FÆLLES!$A$2:$B$29,2,0)","v":0},null,27,{"$f":"VLOOKUP(K30,FÆLLES!$A$2:$B$26,2,0)","v":{"$error":"#N/A"}},null,26,null,27]
[null,{"$f":"VLOOKUP(M31,FÆLLES!$A$2:$B$29,2,0)","v":0},{"$f":"VLOOKUP(E31,FÆLLES!$A$2:$B$29,2,0)","v":0},null,26,{"$f":"VLOOKUP(H31,FÆLLES!$A$2:$B$29,2,0)","v":0},null,27,{"$f":"VLOOKUP(K31,FÆLLES!$A$2:$B$26,2,0)","v":{"$error":"#N/A"}},null,26,null,27]
[null,{"$f":"VLOOKUP(M32,FÆLLES!$A$2:$B$29,2,0)","v":0},{"$f":"VLOOKUP(E32,FÆLLES!$A$2:$B$29,2,0)","v":0},null,26,{"$f":"VLOOKUP(H32,FÆLLES!$A$2:$B$29,2,0)","v":0},null,27,{"$f":"VLOOKUP(K32,FÆLLES!$A$2:$B$26,2,0)","v":{"$error":"#N/A"}},null,26,null,27]
[null,{"$f":"VLOOKUP(M33,FÆLLES!$A$2:$B$29,2,0)","v":0},{"$f":"VLOOKUP(E33,FÆLLES!$A$2:$B$29,2,0)","v":0},null,26,{"$f":"VLOOKUP(H33,FÆLLES!$A$2:$B$29,2,0)","v":0},null,27,{"$f":"VLOOKUP(K33,FÆLLES!$A$2:$B$26,2,0)","v":{"$error":"#N/A"}},null,26,null,27]
[null,{"$f":"VLOOKUP(M34,FÆLLES!$A$2:$B$29,2,0)","v":0},{"$f":"VLOOKUP(E34,FÆLLES!$A$2:$B$29,2,0)","v":0},null,27,{"$f":"VLOOKUP(H34,FÆLLES!$A$2:$B$29,2,0)","v":0},null,27,{"$f":"VLOOKUP(K34,FÆLLES!$A$2:$B$26,2,0)","v":{"$error":"#N/A"}},null,26,null,27]
[]
[]
[]
[]
[]
[]
[]
[]
[]
[]
[]
[]
[]
[]
[]
[]
[]
[]
[]
[]
[]
[]
[]
[]
[]
[]
[]
[]
[]
[]
[]
[]
[]
[]
[]
[]
[]
[]
[]
[]
[]
[]
[]
[]
[]
[]
[]
[]
[]
[]
[]
[]
[]
[]
[]
[]
[]
[]
[]
[]
[]
[]
[]
[]
[]
[]
[]
[]
[]
[]
[]
[]
[]
[]
[]
[]
[]
[]
[]
[]
[]
[]
[]
[]
[]
[]
[]
[]
[]
[]
[]
[]
[]
[]
[]
[]
[]
[]
[]
[]
[]
[]
[]
[]
[]
[]
[]
[]
[]
[]
[]
[]
[]
[]
[]
[]
[]
[]
[]
[]
[]
[]
[]
[]
[]
[]
[]
[]
[]
[]
[]
[]
[]
[]
[]
[]
[]
[]
[]
[]
[]
[]
[]
[]
[]
[]
[]
[]
[]
[]
[]
[]
[]
[]
[]
[]
[]
[]
[]
[]
[]
[]
[]
[]
[]
[]
[]
[]
[]
[]
[]
[]
[]
[]
[]
[]
[]
[]
[]
[]
[]
[]
[]
[]
[]
[]
[]
[]
[]
[]
[]
[]
[null,null,null,null,2]

{"sheet":"DAG","index":1,"n_rows":23,"n_cols":2,"rows_kept":23,"cut":false,"hidden":false,"merged":[]}
["NR","Navn"]
[0,"DAG"]
[1,"Person 1"]
[2,"Person 2"]
[3,"Person 3"]
[4,"Person 4"]
[5,"Person 5"]
[6,"Person 6"]
[7,"Person 7"]
[8,"Person 8"]
[9,"Person 9"]
[10]
[11]
[12]
[13]
[14]
[15]
[16]
[17]
[18]
[19]
[20]
[21]

{"sheet":"AFTEN","index":2,"n_rows":23,"n_cols":2,"rows_kept":23,"cut":false,"hidden":false,"merged":[]}
["NR","NAVN"]
[0,"AFTEN"]
[1,"Person 10"]
[2,"Person 11"]
[3,"Person 12"]
[4,"Person 13"]
[5,"Person 14"]
[6,"Person 15"]
[7,"Person 16"]
[8,"Person 17"]
[9,"Person 18"]
[10]
[11]
[12]
[13]
[14]
[15]
[16]
[17]
[18]
[19]
[20]
[21]

{"sheet":"NAT","index":3,"n_rows":23,"n_cols":2,"rows_kept":23,"cut":false,"hidden":false,"merged":[]}
["NR","Navn"]
[0,"NAT"]
[1,"Person 19"]
[2,"Person 20"]
[3,"Person 21"]
[4,"Person 22"]
[5,"Person 23"]
[6,"Person 24"]
[7,"Person 25"]
[8,"Person 26"]
[9]
[10]
[11]
[12]
[13]
[14]
[15]
[16]
[17]
[18]
[19]
[20]
[21]

{"sheet":"WEEKEND","index":4,"n_rows":23,"n_cols":2,"rows_kept":23,"cut":false,"hidden":false,"merged":[]}
["NR","Navn"]
[0,"WEEKEND"]
[1,"Person 20"]
[2,"Person 21"]
[3,"Person 22"]
[4,"Person 23"]
[5,"Person 24"]
[6]
[7]
[8]
[9]
[10]
[11]
[12]
[13]
[14]
[15]
[16]
[17]
[18]
[19]
[20]
[21]

{"sheet":"FÆLLES","index":5,"n_rows":29,"n_cols":2,"rows_kept":29,"cut":false,"hidden":false,"merged":[]}
["NR","Navn"]
[0,"FÆLLES"]
[1,"Person 1"]
[2,"Person 2"]
[3,"Person 3"]
[4,"Person 4"]
[5,"Person 5"]
[6,"Person 6"]
[7,"Person 7"]
[8,"Person 8"]
[9,"Person 9"]
[10,"Person 10"]
[11,"Person 11"]
[12,"Person 12"]
[13,"Person 13"]
[14,"Person 14"]
[15,"Person 15"]
[16,"Person 16"]
[17,"Person 17"]
[18,"Person 18"]
[19,"Person 19"]
[20,"Person 20"]
[21,"Person 21"]
[22,"Person 22"]
[23,"Person 23"]
[24,"Person 24"]
[25,"Person 25"]
[26]
[27]