{"text_format":"1","workbook":"xlsx","n_sheets":3,"sheets":["Verpackungsdatenblatt","Data für Verpackungsdatenblatt","Sheet3"],"not_rendered":{"charts":0,"images":0,"macros":1,"external_links":0,"defined_names":1,"comments":0,"pivot_tables":0},"unopened":[],"bounds":{"document_bytes":16777216,"sheet_cells":100000,"rows_first":2000,"rows_last":500,"rows_between":2000,"halvings":0,"cell_chars":16384,"cell_head_chars":4096},"cells_cut":0,"cells_raw":0,"read":"whole","date_system":"1900"}

{"sheet":"Verpackungsdatenblatt","index":0,"n_rows":87,"n_cols":29,"rows_kept":87,"cut":false,"hidden":false,"merged":[[82,14,82,18],[84,16,84,18],[85,16,85,18],[86,16,86,18],[84,2,84,4],[85,2,85,4],[86,2,86,4],[82,0,82,4],[82,6,82,12],[84,8,84,12],[85,8,85,12],[86,8,86,12],[83,8,83,10],[80,6,80,10],[80,0,80,4],[21,10,40,18],[5,12,5,18],[7,12,7,18],[12,12,12,18],[13,12,13,18],[14,12,14,18],[64,2,64,6],[65,2,65,6],[66,2,66,6],[64,12,64,18],[65,12,65,18],[66,12,66,18],[44,10,44,12],[80,14,80,18],[54,2,54,4],[54,14,54,18],[55,2,55,4],[55,14,55,18],[56,2,56,4],[56,14,56,18],[56,10,56,12],[45,2,45,4],[81,8,81,10],[60,2,60,4],[21,0,21,4],[79,0,79,19],[45,10,45,12],[46,10,46,12],[47,10,47,12],[48,10,48,12],[49,10,49,12],[50,10,50,12],[51,10,51,12],[52,10,52,12],[53,10,53,12],[54,10,54,12],[55,10,55,12],[57,2,57,4],[57,14,57,18],[58,2,58,4],[58,14,58,18],[59,2,59,4],[59,14,59,18],[57,10,57,12],[58,10,58,12],[59,10,59,12],[50,2,50,4],[50,14,50,18],[38,2,38,4],[44,2,44,4],[44,14,44,18],[46,2,46,4],[46,14,46,18],[47,2,47,4],[47,14,47,18],[48,2,48,4],[48,14,48,18],[39,2,39,4],[40,2,40,4],[5,2,5,6],[7,2,7,6],[3,0,3,19],[16,2,16,6],[16,10,16,18],[11,10,11,18],[45,14,45,18],[49,2,49,4],[49,14,49,18],[26,2,26,4],[27,2,27,4],[28,2,28,4],[29,2,29,4],[30,2,30,4],[34,2,34,4],[35,2,35,4],[36,2,36,4],[37,2,37,4],[90,10,90,13],[91,10,91,13],[92,10,92,13],[12,2,12,6],[0,0,0,19],[1,2,1,14],[10,0,10,19],[19,0,19,19],[14,2,14,6],[11,0,11,6],[2,0,2,19],[62,0,62,19],[70,0,70,19],[72,0,72,19],[73,0,73,19],[74,0,74,19],[75,0,75,19],[76,0,76,19],[77,0,77,19],[88,10,88,13],[89,10,89,13],[69,0,69,19],[24,2,24,4],[25,2,25,4]]}
[{"$f":"VLOOKUP(ROW(A1),Sheet3!$A$1:$C$23,Sheet3!$F$1+1,FALSE)","v":"Engelsk Ord 1"},null,null,null,null,null,null,null,null,null,null,null,null,null,null,null,null,null,null,null,null,null,null,null,null,null,null,null,"LOPSLAG(RÆKKE(A1);Sheet3!$A$1:$C$23;Sheet3!$F$1+1;FALSK)"]
[{"$f":"VLOOKUP(ROW(A2),Sheet3!$A$1:$C$23,Sheet3!$F$1+1,FALSE)","v":"Engelsk Ord 2"},null,null,null,null,null,null,null,null,null,null,null,null,null,null,null,{"$f":"VLOOKUP(ROW(A3),Sheet3!$A$1:$C$23,Sheet3!$F$1+1,FALSE)","v":"Engelsk Ord 3"}]
[]
[{"$f":"VLOOKUP(ROW(A4),Sheet3!$A$1:$C$23,Sheet3!$F$1+1,FALSE)","v":"Engelsk Ord 4"}]
[]
[{"$f":"VLOOKUP(ROW(A5),Sheet3!$A$1:$C$23,Sheet3!$F$1+1,FALSE)","v":"Engelsk Ord 5"},null,null,null,null,null,null,null,null,null,{"$f":"VLOOKUP(ROW(A6),Sheet3!$A$1:$C$23,Sheet3!$F$1+1,FALSE)","v":"Engelsk Ord 6"}]
[]
[{"$f":"VLOOKUP(ROW(A7),Sheet3!$A$1:$C$23,Sheet3!$F$1+1,FALSE)","v":"Engelsk Ord 7"},null,null,null,null,null,null,null,null,null,{"$f":"VLOOKUP(ROW(A8),Sheet3!$A$1:$C$23,Sheet3!$F$1+1,FALSE)","v":"Engelsk Ord 8"}]
[]
[]
[{"$f":"VLOOKUP(ROW(A9),Sheet3!$A$1:$C$23,Sheet3!$F$1+1,FALSE)","v":"Engelsk Ord 9"}]
[{"$f":"VLOOKUP(ROW(A10),Sheet3!$A$1:$C$23,Sheet3!$F$1+1,FALSE)","v":"Engelsk Ord 10"},null,null,null,null,null,null,null,null,null,{"$f":"VLOOKUP(ROW(A11),Sheet3!$A$1:$C$23,Sheet3!$F$1+1,FALSE)","v":"Engelsk Ord 11"}]
[{"$f":"VLOOKUP(ROW(A12),Sheet3!$A$1:$C$23,Sheet3!$F$1+1,FALSE)","v":"Engelsk Ord 12"},null,null,null,null,null,null,null,null,null,{"$f":"VLOOKUP(ROW(A13),Sheet3!$A$1:$C$23,Sheet3!$F$1+1,FALSE)","v":"Engelsk Ord 13"}]
[]
[{"$f":"VLOOKUP(ROW(A14),Sheet3!$A$1:$C$23,Sheet3!$F$1+1,FALSE)","v":"Engelsk Ord 14"},null,null,null,null,null,null,null,null,null,{"$f":"VLOOKUP(ROW(A15),Sheet3!$A$1:$C$23,Sheet3!$F$1+1,FALSE)","v":"Engelsk Ord 15"}]
[]
[{"$f":"VLOOKUP(ROW(A16),Sheet3!$A$1:$C$23,Sheet3!$F$1+1,FALSE)","v":"Engelsk Ord 16"}]
[]
[]
[{"$f":"VLOOKUP(ROW(A17),Sheet3!$A$1:$C$23,Sheet3!$F$1+1,FALSE)","v":"Engelsk Ord 17"}]
[]
[null,null,null,null,null,null,{"$f":"VLOOKUP(ROW(A18),Sheet3!$A$1:$C$23,Sheet3!$F$1+1,FALSE)","v":"Engelsk Ord 18"},null,null,null,"Bild vom Teil"]
[]
[]
[{"$f":"VLOOKUP(ROW(A19),Sheet3!$A$1:$C$23,Sheet3!$F$1+1,FALSE)","v":"Engelsk Ord 19"}]
[]
[{"$f":"VLOOKUP(ROW(A20),Sheet3!$A$1:$C$23,Sheet3!$F$1+1,FALSE)","v":"Engelsk Ord 20"}]
[]
[{"$f":"VLOOKUP(ROW(A21),Sheet3!$A$1:$C$23,Sheet3!$F$1+1,FALSE)","v":"Engelsk Ord 21"}]
[]
["B&O Nummer:"]
[]
[]
[]
["Deckel:"]
[]
["Dimensionen LxBxH (mm):"]
[]
["Kundennummer:"]
[]
["B&O Nummer:"]
[]
[]
[]
["Ladungsträger",null,null,null,null,null,null,null,null,null,"Teile pro KLT (Stk.):"]
[]
["Dimensionen LxBxH (mm):",null,null,null,null,null,null,null,null,null,"Menge KLT pro Lage (Stk):"]
[]
["Kundennummer:",null,null,null,null,null,null,null,null,null,"Lagen pro Palette (Stk):"]
[]
["B&O Nummer:"]
[]
[]
[]
["Innenverpackung:",null,null,null,null,null,null,null,null,null,"Teile pro Innenverpackung (Stk.):"]
[]
["Dimensionen LxBxH (mm):",null,null,null,null,null,null,null,null,null,"Innenverpackung pro Lage (Stk):"]
[]
["Kundennummer:",null,null,null,null,null,null,null,null,null,"Lagen pro Palette (Stk):"]
[]
["B&O Nummer:"]
[]
["1/1 Palette"]
[]
["Dimensionen LxBxH (mm):",null,null,null,null,null,null,null,null,null,"Brutto Gewicht (kg):"]
[]
["Teile pro Palette (Stk):",null,null,null,null,null,null,null,null,null,"Netto Gewicht  (kg):"]
[]
[]
["Bilder Verpackungsprozess"]
[]
[]
["Beschreibung / Bemerkung"]
[]
[]
[]
[]
[]
[]
["Validierung"]
["Vorbereitet von:",null,null,null,null,null,"Akzeptiert von:",null,null,null,null,null,null,null,"Freigabe vom Kunden:"]
[]
[]
[]
["Ort:",null,null,null,null,null,"Ort:",null,null,null,null,null,null,null,"Ort:"]
[]
["Datum:",null,null,null,null,null,"Datum:",null,null,null,null,null,null,null,"Datum:"]

{"sheet":"Data für Verpackungsdatenblatt","index":1,"n_rows":0,"n_cols":0,"rows_kept":0,"cut":false,"hidden":false,"merged":[]}

{"sheet":"Sheet3","index":2,"n_rows":23,"n_cols":6,"rows_kept":23,"cut":false,"hidden":false,"merged":[]}
["Tekst nr.","Engelsk tekst","tysk tekst",null,null,1]
[1,"Engelsk Ord 1","Tysk Ord 1"]
[2,"Engelsk Ord 2","Tysk Ord 2"]
[3,"Engelsk Ord 3","Tysk Ord 3"]
[4,"Engelsk Ord 4","Tysk Ord 4"]
[5,"Engelsk Ord 5","Tysk Ord 5"]
[6,"Engelsk Ord 6","Tysk Ord 6"]
[7,"Engelsk Ord 7","Tysk Ord 7"]
[8,"Engelsk Ord 8","Tysk Ord 8"]
[9,"Engelsk Ord 9","Tysk Ord 9"]
[10,"Engelsk Ord 10","Tysk Ord 10"]
[11,"Engelsk Ord 11","Tysk Ord 11"]
[12,"Engelsk Ord 12","Tysk Ord 12"]
[13,"Engelsk Ord 13","Tysk Ord 13"]
[14,"Engelsk Ord 14","Tysk Ord 14"]
[15,"Engelsk Ord 15","Tysk Ord 15"]
[16,"Engelsk Ord 16","Tysk Ord 16"]
[17,"Engelsk Ord 17","Tysk Ord 17"]
[18,"Engelsk Ord 18","Tysk Ord 18"]
[19,"Engelsk Ord 19","Tysk Ord 19"]
[20,"Engelsk Ord 20","Tysk Ord 20"]
[21,"Engelsk Ord 21","Tysk Ord 21"]
[22,"Engelsk Ord 22","Tysk Ord 22"]