{"text_format":"1","workbook":"xlsx","n_sheets":14,"sheets":["januar","februar","marts","april","maj","juni","juli","august","september","oktober","november","december","Variable","Decentral"],"not_rendered":{"charts":0,"images":0,"macros":1,"external_links":0,"defined_names":0,"comments":0,"pivot_tables":0},"unopened":[],"bounds":{"document_bytes":16777216,"sheet_cells":100000,"rows_first":2000,"rows_last":500,"rows_between":2000,"halvings":0,"cell_chars":16384,"cell_head_chars":4096},"cells_cut":0,"cells_raw":0,"read":"whole","date_system":"1900"}

{"sheet":"januar","index":0,"n_rows":56,"n_cols":16,"rows_kept":56,"cut":false,"hidden":false,"merged":[]}
["Medarb. nr.","Navn","Selsk.","Bonus 1181 Kr.","Tekst","Udlæg 9100 Kr.","Tekst","Fradr. net 9471 Kr.","Tekst","Fratrædg. 5500 Kr.","Km-godt. 9011 Km.","Km-godtg. - Tekst","25% Rejseg. 9030 Kr.","Rejseg. Tekst","Timelønnede\nantal timer","Kommentarer"]
[10035,"Pia",1]
[10299,"Inge",1]
[10912,"Anette",1]
[10923,"John",1]
[10947,"Bente",1]
[]
[10946,"Dorte",6]
[31917,"Pontus",6,null,null,null,null,null,null,null,null,null,-3331.04,"Dobbelt okt/nov."]
[60027,"Martin",6,null,null,null,null,null,null,null,null,null,-123.23,"Dobbelt okt/nov."]
[60027,"Martin",6,null,null,null,null,null,null,null,null,null,1194.3800000000001,"Sept.Okt."]
[60027,"Martin",6]
[60132,"Kent",6]
[60909,"Martin",6]
[60910,"Birgitte",6]
[60912,"Mette",6]
[60913,"Henriette",6]
[60919,"Ralph",6]
[60920,"Jette",6]
[60921,"Thomas",6]
{"$rows_left_out":37}
{"sheet":"februar","index":1,"n_rows":56,"n_cols":16,"rows_kept":56,"cut":false,"hidden":false,"merged":[]}
["Medarb. nr.","Navn","Selsk.","Bonus 1181 Kr.","Tekst","Udlæg 9100 Kr.","Tekst","Fradr. net 9471 Kr.","Tekst","Fratrædg. 5500 Kr.","Km-godt. 9011 Km.","Km-godtg. - Tekst","25% Rejseg. 9030 Kr.","Rejseg. Tekst","Timelønnede\nantal timer","Kommentarer"]
[10035,"Pia",1]
[10299,"Inge",1]
[10912,"Anette",1]
[10923,"John",1]
[10947,"Bente",1]
[]
[10946,"Dorte",6]
[31917,"Pontus",6]
[60027,"Martin",6]
[60027,"Martin",6]
[60027,"Martin",6]
[60132,"Kent",6]
[60909,"Martin",6]
[60910,"Birgitte",6]
[60912,"Mette",6]
[60913,"Henriette",6]
[60919,"Ralph",6]
[60920,"Jette",6]
[60921,"Thomas",6]
{"$rows_left_out":37}
{"sheet":"marts","index":2,"n_rows":56,"n_cols":16,"rows_kept":56,"cut":false,"hidden":false,"merged":[]}
["Medarb. nr.","Navn","Selsk.","Bonus 1181 Kr.","Tekst","Udlæg 9100 Kr.","Tekst","Fradr. net 9471 Kr.","Tekst","Fratrædg. 5500 Kr.","Km-godt. 9011 Km.","Km-godtg. - Tekst","25% Rejseg. 9030 Kr.","Rejseg. Tekst","Timelønnede\nantal timer","Kommentarer"]
[10035,"Pia",1]
[10299,"Inge",1]
[10912,"Anette",1]
[10923,"John",1]
[10947,"Bente",1]
[]
[10946,"Dorte",6]
[31917,"Pontus",6]
[60027,"Martin",6]
[60027,"Martin",6]
[60027,"Martin",6]
[60132,"Kent",6]
[60909,"Martin",6]
[60910,"Birgitte",6]
[60912,"Mette",6]
[60913,"Henriette",6]
[60919,"Ralph",6]
[60920,"Jette",6]
[60921,"Thomas",6]
{"$rows_left_out":37}
{"sheet":"april","index":3,"n_rows":56,"n_cols":16,"rows_kept":56,"cut":false,"hidden":false,"merged":[]}
["Medarb. nr.","Navn","Selsk.","Bonus 1181 Kr.","Tekst","Udlæg 9100 Kr.","Tekst","Fradr. net 9471 Kr.","Tekst","Fratrædg. 5500 Kr.","Km-godt. 9011 Km.","Km-godtg. - Tekst","25% Rejseg. 9030 Kr.","Rejseg. Tekst","Timelønnede\nantal timer","Kommentarer"]
[10035,"Pia",1]
[10299,"Inge",1]
[10912,"Anette",1]
[10923,"John",1]
[10947,"Bente",1]
[]
[10946,"Dorte",6]
[31917,"Pontus",6]
[60027,"Martin",6]
[60027,"Martin",6]
[60027,"Martin",6]
[60132,"Kent",6]
[60909,"Martin",6]
[60910,"Birgitte",6]
[60912,"Mette",6]
[60913,"Henriette",6]
[60919,"Ralph",6]
[60920,"Jette",6]
[60921,"Thomas",6]
{"$rows_left_out":37}
{"sheet":"maj","index":4,"n_rows":56,"n_cols":16,"rows_kept":56,"cut":false,"hidden":false,"merged":[]}
["Medarb. nr.","Navn","Selsk.","Bonus 1181 Kr.","Tekst","Udlæg 9100 Kr.","Tekst","Fradr. net 9471 Kr.","Tekst","Fratrædg. 5500 Kr.","Km-godt. 9011 Km.","Km-godtg. - Tekst","25% Rejseg. 9030 Kr.","Rejseg. Tekst","Timelønnede\nantal timer","Kommentarer"]
[10035,"Pia",1]
[10299,"Inge",1]
[10912,"Anette",1]
[10923,"John",1]
[10947,"Bente",1]
[]
[10946,"Dorte",6]
[31917,"Pontus",6]
[60027,"Martin",6]
[60027,"Martin",6]
[60027,"Martin",6]
[60132,"Kent",6]
[60909,"Martin",6]
[60910,"Birgitte",6]
[60912,"Mette",6]
[60913,"Henriette",6]
[60919,"Ralph",6]
[60920,"Jette",6]
[60921,"Thomas",6]
{"$rows_left_out":37}
{"sheet":"juni","index":5,"n_rows":56,"n_cols":16,"rows_kept":56,"cut":false,"hidden":false,"merged":[]}
["Medarb. nr.","Navn","Selsk.","Bonus 1181 Kr.","Tekst","Udlæg 9100 Kr.","Tekst","Fradr. net 9471 Kr.","Tekst","Fratrædg. 5500 Kr.","Km-godt. 9011 Km.","Km-godtg. - Tekst","25% Rejseg. 9030 Kr.","Rejseg. Tekst","Timelønnede\nantal timer","Kommentarer"]
[10035,"Pia",1]
[10299,"Inge",1]
[10912,"Anette",1]
[10923,"John",1]
[10947,"Bente",1]
[]
[10946,"Dorte",6]
[31917,"Pontus",6]
[60027,"Martin",6]
[60027,"Martin",6]
[60027,"Martin",6]
[60132,"Kent",6]
[60909,"Martin",6]
[60910,"Birgitte",6]
[60912,"Mette",6]
[60913,"Henriette",6]
[60919,"Ralph",6]
[60920,"Jette",6]
[60921,"Thomas",6]
{"$rows_left_out":37}
{"sheet":"juli","index":6,"n_rows":56,"n_cols":16,"rows_kept":56,"cut":false,"hidden":false,"merged":[]}
["Medarb. nr.","Navn","Selsk.","Bonus 1181 Kr.","Tekst","Udlæg 9100 Kr.","Tekst","Fradr. net 9471 Kr.","Tekst","Fratrædg. 5500 Kr.","Km-godt. 9011 Km.","Km-godtg. - Tekst","25% Rejseg. 9030 Kr.","Rejseg. Tekst","Timelønnede\nantal timer","Kommentarer"]
[10035,"Pia",1]
[10299,"Inge",1]
[10912,"Anette",1]
[10923,"John",1]
[10947,"Bente",1]
[]
[10946,"Dorte",6]
[31917,"Pontus",6]
[60027,"Martin",6]
[60027,"Martin",6]
[60027,"Martin",6]
[60132,"Kent",6]
[60909,"Martin",6]
[60910,"Birgitte",6]
[60912,"Mette",6]
[60913,"Henriette",6]
[60919,"Ralph",6]
[60920,"Jette",6]
[60921,"Thomas",6]
{"$rows_left_out":37}
{"sheet":"august","index":7,"n_rows":56,"n_cols":16,"rows_kept":56,"cut":false,"hidden":false,"merged":[]}
["Medarb. nr.","Navn","Selsk.","Bonus 1181 Kr.","Tekst","Udlæg 9100 Kr.","Tekst","Fradr. net 9471 Kr.","Tekst","Fratrædg. 5500 Kr.","Km-godt. 9011 Km.","Km-godtg. - Tekst","25% Rejseg. 9030 Kr.","Rejseg. Tekst","Timelønnede\nantal timer","Kommentarer"]
[10035,"Pia",1]
[10299,"Inge",1]
[10912,"Anette",1]
[10923,"John",1]
[10947,"Bente",1]
[]
[10946,"Dorte",6]
[31917,"Pontus",6]
[60027,"Martin",6]
[60027,"Martin",6]
[60027,"Martin",6]
[60132,"Kent",6]
[60909,"Martin",6]
[60910,"Birgitte",6]
[60912,"Mette",6]
[60913,"Henriette",6]
[60919,"Ralph",6]
[60920,"Jette",6]
[60921,"Thomas",6]
{"$rows_left_out":37}
{"sheet":"september","index":8,"n_rows":56,"n_cols":16,"rows_kept":56,"cut":false,"hidden":false,"merged":[]}
["Medarb. nr.","Navn","Selsk.","Bonus 1181 Kr.","Tekst","Udlæg 9100 Kr.","Tekst","Fradr. net 9471 Kr.","Tekst","Fratrædg. 5500 Kr.","Km-godt. 9011 Km.","Km-godtg. - Tekst","25% Rejseg. 9030 Kr.","Rejseg. Tekst","Timelønnede\nantal timer","Kommentarer"]
[10035,"Pia",1]
[10299,"Inge",1]
[10912,"Anette",1]
[10923,"John",1]
[10947,"Bente",1]
[]
[10946,"Dorte",6]
[31917,"Pontus",6]
[60027,"Martin",6]
[60027,"Martin",6]
[60027,"Martin",6]
[60132,"Kent",6]
[60909,"Martin",6]
[60910,"Birgitte",6]
[60912,"Mette",6]
[60913,"Henriette",6]
[60919,"Ralph",6]
[60920,"Jette",6]
[60921,"Thomas",6]
{"$rows_left_out":37}
{"sheet":"oktober","index":9,"n_rows":56,"n_cols":16,"rows_kept":56,"cut":false,"hidden":false,"merged":[]}
["Medarb. nr.","Navn","Selsk.","Bonus 1181 Kr.","Tekst","Udlæg 9100 Kr.","Tekst","Fradr. net 9471 Kr.","Tekst","Fratrædg. 5500 Kr.","Km-godt. 9011 Km.","Km-godtg. - Tekst","25% Rejseg. 9030 Kr.","Rejseg. Tekst","Timelønnede\nantal timer","Kommentarer"]
[10035,"Pia",1]
[10299,"Inge",1]
[10912,"Anette",1]
[10923,"John",1]
[10947,"Bente",1]
[]
[10946,"Dorte",6]
[31917,"Pontus",6]
[60027,"Martin",6]
[60027,"Martin",6]
[60027,"Martin",6]
[60132,"Kent",6]
[60909,"Martin",6]
[60910,"Birgitte",6]
[60912,"Mette",6]
[60913,"Henriette",6]
[60919,"Ralph",6]
[60920,"Jette",6]
[60921,"Thomas",6]
{"$rows_left_out":37}
{"sheet":"november","index":10,"n_rows":56,"n_cols":16,"rows_kept":56,"cut":false,"hidden":false,"merged":[]}
["Medarb. nr.","Navn","Selsk.","Bonus 1181 Kr.","Tekst","Udlæg 9100 Kr.","Tekst","Fradr. net 9471 Kr.","Tekst","Fratrædg. 5500 Kr.","Km-godt. 9011 Km.","Km-godtg. - Tekst","25% Rejseg. 9030 Kr.","Rejseg. Tekst","Timelønnede\nantal timer","Kommentarer"]
[10035,"Pia",1]
[10299,"Inge",1]
[10912,"Anette",1]
[10923,"John",1]
[10947,"Bente",1]
[]
[10946,"Dorte",6]
[31917,"Pontus",6]
[60027,"Martin",6]
[60027,"Martin",6]
[60027,"Martin",6]
[60132,"Kent",6]
[60909,"Martin",6]
[60910,"Birgitte",6]
[60912,"Mette",6]
[60913,"Henriette",6]
[60919,"Ralph",6]
[60920,"Jette",6]
[60921,"Thomas",6]
{"$rows_left_out":37}
{"sheet":"december","index":11,"n_rows":56,"n_cols":16,"rows_kept":56,"cut":false,"hidden":false,"merged":[]}
["Medarb. nr.","Navn","Selsk.","Bonus 1181 Kr.","Tekst","Udlæg 9100 Kr.","Tekst","Fradr. net 9471 Kr.","Tekst","Fratrædg. 5500 Kr.","Km-godt. 9011 Km.","Km-godtg. - Tekst","25% Rejseg. 9030 Kr.","Rejseg. Tekst","Timelønnede\nantal timer","Kommentarer"]
[10035,"Pia",1]
[10299,"Inge",1]
[10912,"Anette",1]
[10923,"John",1]
[10947,"Bente",1]
[]
[10946,"Dorte",6]
[31917,"Pontus",6,6179,"Bonus Q2 iflg aftale"]
[60027,"Martin",6]
[60027,"Martin",6]
[60027,"Martin",6]
[60132,"Kent",6]
[60909,"Martin",6]
[60910,"Birgitte",6]
[60912,"Mette",6]
[60913,"Henriette",6]
[60919,"Ralph",6]
[60920,"Jette",6]
[60921,"Thomas",6]
{"$rows_left_out":37}
{"sheet":"Variable","index":12,"n_rows":703,"n_cols":11,"rows_kept":703,"cut":false,"hidden":false,"merged":[]}
["Kundeforholdnr.","Arbejdsgivernr.","Variabel","Medarbejdernr.","Fradato","Tildato"]
[3,null,null,null,{"$f":"TODAY()-28","v":"2011-12-15"},{"$f":"TODAY()","v":"2012-01-12"}]
["Bonus:",null,null,null,{"$f":"TEXT(E2,\"MMmm\")","v":"december"},{"$f":"TEXT(F2,\"MMmm\")","v":"januar"}]
[{"$f":"IF($D4=\"\",\"\",$A$2)","v":""},{"$f":"IF($D4=\"\",\"\",INDEX(december!$A:$O,ROW()-2,COLUMN($C:$C)))","v":""},"Variabel",{"$f":"IF(INDEX(december!$A:$O,ROW()-2,COLUMN(D:D))=\"\",\"\",IF(INDEX(december!$A:$O,ROW()-2,COLUMN(A:A))=\"\",\"\",INDEX(december!$A:$O,ROW()-2,COLUMN(A:A))))","v":""},{"$f":"IF($D4=\"\",\"\",$F$2)","v":""},null,{"$f":"IF($D4=\"\",\"\",1181)","v":""},{"$f":"IF($D4=\"\",\"\",IF(INDEX(december!$A:$O,ROW()-2,COLUMN($E:$E))=\"\",\"\",INDEX(december!$A:$O,ROW()-2,COLUMN($E:$E))))","v":""},null,null,{"$f":"IF($D4=\"\",\"\",IF(INDEX(december!$A:$O,ROW()-2,COLUMN($D:$D))=\"\",\"\",INDEX(december!$A:$O,ROW()-2,COLUMN($D:$D))))","v":""}]
["",{"$f":"IF($D5=\"\",\"\",INDEX(december!$A:$O,ROW()-2,COLUMN($C:$C)))","v":""},"Variabel",{"$f":"IF(INDEX(december!$A:$O,ROW()-2,COLUMN(D:D))=\"\",\"\",IF(INDEX(december!$A:$O,ROW()-2,COLUMN(A:A))=\"\",\"\",INDEX(december!$A:$O,ROW()-2,COLUMN(A:A))))","v":""},"",null,"",{"$f":"IF($D5=\"\",\"\",IF(INDEX(december!$A:$O,ROW()-2,COLUMN($E:$E))=\"\",\"\",INDEX(december!$A:$O,ROW()-2,COLUMN($E:$E))))","v":""},null,null,{"$f":"IF($D5=\"\",\"\",IF(INDEX(december!$A:$O,ROW()-2,COLUMN($D:$D))=\"\",\"\",INDEX(december!$A:$O,ROW()-2,COLUMN($D:$D))))","v":""}]
["",{"$f":"IF($D6=\"\",\"\",INDEX(december!$A:$O,ROW()-2,COLUMN($C:$C)))","v":""},"Variabel",{"$f":"IF(INDEX(december!$A:$O,ROW()-2,COLUMN(D:D))=\"\",\"\",IF(INDEX(december!$A:$O,ROW()-2,COLUMN(A:A))=\"\",\"\",INDEX(december!$A:$O,ROW()-2,COLUMN(A:A))))","v":""},"",null,"",{"$f":"IF($D6=\"\",\"\",IF(INDEX(december!$A:$O,ROW()-2,COLUMN($E:$E))=\"\",\"\",INDEX(december!$A:$O,ROW()-2,COLUMN($E:$E))))","v":""},null,null,{"$f":"IF($D6=\"\",\"\",IF(INDEX(december!$A:$O,ROW()-2,COLUMN($D:$D))=\"\",\"\",INDEX(december!$A:$O,ROW()-2,COLUMN($D:$D))))","v":""}]
["",{"$f":"IF($D7=\"\",\"\",INDEX(december!$A:$O,ROW()-2,COLUMN($C:$C)))","v":""},"Variabel",{"$f":"IF(INDEX(december!$A:$O,ROW()-2,COLUMN(D:D))=\"\",\"\",IF(INDEX(december!$A:$O,ROW()-2,COLUMN(A:A))=\"\",\"\",INDEX(december!$A:$O,ROW()-2,COLUMN(A:A))))","v":""},"",null,"",{"$f":"IF($D7=\"\",\"\",IF(INDEX(december!$A:$O,ROW()-2,COLUMN($E:$E))=\"\",\"\",INDEX(december!$A:$O,ROW()-2,COLUMN($E:$E))))","v":""},null,null,{"$f":"IF($D7=\"\",\"\",IF(INDEX(december!$A:$O,ROW()-2,COLUMN($D:$D))=\"\",\"\",INDEX(december!$A:$O,ROW()-2,COLUMN($D:$D))))","v":""}]
["",{"$f":"IF($D8=\"\",\"\",INDEX(december!$A:$O,ROW()-2,COLUMN($C:$C)))","v":""},"Variabel",{"$f":"IF(INDEX(december!$A:$O,ROW()-2,COLUMN(D:D))=\"\",\"\",IF(INDEX(december!$A:$O,ROW()-2,COLUMN(A:A))=\"\",\"\",INDEX(december!$A:$O,ROW()-2,COLUMN(A:A))))","v":""},"",null,"",{"$f":"IF($D8=\"\",\"\",IF(INDEX(december!$A:$O,ROW()-2,COLUMN($E:$E))=\"\",\"\",INDEX(december!$A:$O,ROW()-2,COLUMN($E:$E))))","v":""},null,null,{"$f":"IF($D8=\"\",\"\",IF(INDEX(december!$A:$O,ROW()-2,COLUMN($D:$D))=\"\",\"\",INDEX(december!$A:$O,ROW()-2,COLUMN($D:$D))))","v":""}]
["",{"$f":"IF($D9=\"\",\"\",INDEX(december!$A:$O,ROW()-2,COLUMN($C:$C)))","v":""},"Variabel",{"$f":"IF(INDEX(december!$A:$O,ROW()-2,COLUMN(D:D))=\"\",\"\",IF(INDEX(december!$A:$O,ROW()-2,COLUMN(A:A))=\"\",\"\",INDEX(december!$A:$O,ROW()-2,COLUMN(A:A))))","v":""},"",null,"",{"$f":"IF($D9=\"\",\"\",IF(INDEX(december!$A:$O,ROW()-2,COLUMN($E:$E))=\"\",\"\",INDEX(december!$A:$O,ROW()-2,COLUMN($E:$E))))","v":""},null,null,{"$f":"IF($D9=\"\",\"\",IF(INDEX(december!$A:$O,ROW()-2,COLUMN($D:$D))=\"\",\"\",INDEX(december!$A:$O,ROW()-2,COLUMN($D:$D))))","v":""}]
["",{"$f":"IF($D10=\"\",\"\",INDEX(december!$A:$O,ROW()-2,COLUMN($C:$C)))","v":""},"Variabel",{"$f":"IF(INDEX(december!$A:$O,ROW()-2,COLUMN(D:D))=\"\",\"\",IF(INDEX(december!$A:$O,ROW()-2,COLUMN(A:A))=\"\",\"\",INDEX(december!$A:$O,ROW()-2,COLUMN(A:A))))","v":""},"",null,"",{"$f":"IF($D10=\"\",\"\",IF(INDEX(december!$A:$O,ROW()-2,COLUMN($E:$E))=\"\",\"\",INDEX(december!$A:$O,ROW()-2,COLUMN($E:$E))))","v":""},null,null,{"$f":"IF($D10=\"\",\"\",IF(INDEX(december!$A:$O,ROW()-2,COLUMN($D:$D))=\"\",\"\",INDEX(december!$A:$O,ROW()-2,COLUMN($D:$D))))","v":""}]
[3,{"$f":"IF($D11=\"\",\"\",INDEX(december!$A:$O,ROW()-2,COLUMN($C:$C)))","v":6},"Variabel",{"$f":"IF(INDEX(december!$A:$O,ROW()-2,COLUMN(D:D))=\"\",\"\",IF(INDEX(december!$A:$O,ROW()-2,COLUMN(A:A))=\"\",\"\",INDEX(december!$A:$O,ROW()-2,COLUMN(A:A))))","v":31917},"2012-01-12",null,1181,{"$f":"IF($D11=\"\",\"\",IF(INDEX(december!$A:$O,ROW()-2,COLUMN($E:$E))=\"\",\"\",INDEX(december!$A:$O,ROW()-2,COLUMN($E:$E))))","v":"Bonus Q2 iflg aftale"},null,null,{"$f":"IF($D11=\"\",\"\",IF(INDEX(december!$A:$O,ROW()-2,COLUMN($D:$D))=\"\",\"\",INDEX(december!$A:$O,ROW()-2,COLUMN($D:$D))))","v":6179}]
["",{"$f":"IF($D12=\"\",\"\",INDEX(december!$A:$O,ROW()-2,COLUMN($C:$C)))","v":""},"Variabel",{"$f":"IF(INDEX(december!$A:$O,ROW()-2,COLUMN(D:D))=\"\",\"\",IF(INDEX(december!$A:$O,ROW()-2,COLUMN(A:A))=\"\",\"\",INDEX(december!$A:$O,ROW()-2,COLUMN(A:A))))","v":""},"",null,"",{"$f":"IF($D12=\"\",\"\",IF(INDEX(december!$A:$O,ROW()-2,COLUMN($E:$E))=\"\",\"\",INDEX(december!$A:$O,ROW()-2,COLUMN($E:$E))))","v":""},null,null,{"$f":"IF($D12=\"\",\"\",IF(INDEX(december!$A:$O,ROW()-2,COLUMN($D:$D))=\"\",\"\",INDEX(december!$A:$O,ROW()-2,COLUMN($D:$D))))","v":""}]
["",{"$f":"IF($D13=\"\",\"\",INDEX(december!$A:$O,ROW()-2,COLUMN($C:$C)))","v":""},"Variabel",{"$f":"IF(INDEX(december!$A:$O,ROW()-2,COLUMN(D:D))=\"\",\"\",IF(INDEX(december!$A:$O,ROW()-2,COLUMN(A:A))=\"\",\"\",INDEX(december!$A:$O,ROW()-2,COLUMN(A:A))))","v":""},"",null,"",{"$f":"IF($D13=\"\",\"\",IF(INDEX(december!$A:$O,ROW()-2,COLUMN($E:$E))=\"\",\"\",INDEX(december!$A:$O,ROW()-2,COLUMN($E:$E))))","v":""},null,null,{"$f":"IF($D13=\"\",\"\",IF(INDEX(december!$A:$O,ROW()-2,COLUMN($D:$D))=\"\",\"\",INDEX(december!$A:$O,ROW()-2,COLUMN($D:$D))))","v":""}]
["",{"$f":"IF($D14=\"\",\"\",INDEX(december!$A:$O,ROW()-2,COLUMN($C:$C)))","v":""},"Variabel",{"$f":"IF(INDEX(december!$A:$O,ROW()-2,COLUMN(D:D))=\"\",\"\",IF(INDEX(december!$A:$O,ROW()-2,COLUMN(A:A))=\"\",\"\",INDEX(december!$A:$O,ROW()-2,COLUMN(A:A))))","v":""},"",null,"",{"$f":"IF($D14=\"\",\"\",IF(INDEX(december!$A:$O,ROW()-2,COLUMN($E:$E))=\"\",\"\",INDEX(december!$A:$O,ROW()-2,COLUMN($E:$E))))","v":""},null,null,{"$f":"IF($D14=\"\",\"\",IF(INDEX(december!$A:$O,ROW()-2,COLUMN($D:$D))=\"\",\"\",INDEX(december!$A:$O,ROW()-2,COLUMN($D:$D))))","v":""}]
["",{"$f":"IF($D15=\"\",\"\",INDEX(december!$A:$O,ROW()-2,COLUMN($C:$C)))","v":""},"Variabel",{"$f":"IF(INDEX(december!$A:$O,ROW()-2,COLUMN(D:D))=\"\",\"\",IF(INDEX(december!$A:$O,ROW()-2,COLUMN(A:A))=\"\",\"\",INDEX(december!$A:$O,ROW()-2,COLUMN(A:A))))","v":""},"",null,"",{"$f":"IF($D15=\"\",\"\",IF(INDEX(december!$A:$O,ROW()-2,COLUMN($E:$E))=\"\",\"\",INDEX(december!$A:$O,ROW()-2,COLUMN($E:$E))))","v":""},null,null,{"$f":"IF($D15=\"\",\"\",IF(INDEX(december!$A:$O,ROW()-2,COLUMN($D:$D))=\"\",\"\",INDEX(december!$A:$O,ROW()-2,COLUMN($D:$D))))","v":""}]
["",{"$f":"IF($D16=\"\",\"\",INDEX(december!$A:$O,ROW()-2,COLUMN($C:$C)))","v":""},"Variabel",{"$f":"IF(INDEX(december!$A:$O,ROW()-2,COLUMN(D:D))=\"\",\"\",IF(INDEX(december!$A:$O,ROW()-2,COLUMN(A:A))=\"\",\"\",INDEX(december!$A:$O,ROW()-2,COLUMN(A:A))))","v":""},"",null,"",{"$f":"IF($D16=\"\",\"\",IF(INDEX(december!$A:$O,ROW()-2,COLUMN($E:$E))=\"\",\"\",INDEX(december!$A:$O,ROW()-2,COLUMN($E:$E))))","v":""},null,null,{"$f":"IF($D16=\"\",\"\",IF(INDEX(december!$A:$O,ROW()-2,COLUMN($D:$D))=\"\",\"\",INDEX(december!$A:$O,ROW()-2,COLUMN($D:$D))))","v":""}]
["",{"$f":"IF($D17=\"\",\"\",INDEX(december!$A:$O,ROW()-2,COLUMN($C:$C)))","v":""},"Variabel",{"$f":"IF(INDEX(december!$A:$O,ROW()-2,COLUMN(D:D))=\"\",\"\",IF(INDEX(december!$A:$O,ROW()-2,COLUMN(A:A))=\"\",\"\",INDEX(december!$A:$O,ROW()-2,COLUMN(A:A))))","v":""},"",null,"",{"$f":"IF($D17=\"\",\"\",IF(INDEX(december!$A:$O,ROW()-2,COLUMN($E:$E))=\"\",\"\",INDEX(december!$A:$O,ROW()-2,COLUMN($E:$E))))","v":""},null,null,{"$f":"IF($D17=\"\",\"\",IF(INDEX(december!$A:$O,ROW()-2,COLUMN($D:$D))=\"\",\"\",INDEX(december!$A:$O,ROW()-2,COLUMN($D:$D))))","v":""}]
["",{"$f":"IF($D18=\"\",\"\",INDEX(december!$A:$O,ROW()-2,COLUMN($C:$C)))","v":""},"Variabel",{"$f":"IF(INDEX(december!$A:$O,ROW()-2,COLUMN(D:D))=\"\",\"\",IF(INDEX(december!$A:$O,ROW()-2,COLUMN(A:A))=\"\",\"\",INDEX(december!$A:$O,ROW()-2,COLUMN(A:A))))","v":""},"",null,"",{"$f":"IF($D18=\"\",\"\",IF(INDEX(december!$A:$O,ROW()-2,COLUMN($E:$E))=\"\",\"\",INDEX(december!$A:$O,ROW()-2,COLUMN($E:$E))))","v":""},null,null,{"$f":"IF($D18=\"\",\"\",IF(INDEX(december!$A:$O,ROW()-2,COLUMN($D:$D))=\"\",\"\",INDEX(december!$A:$O,ROW()-2,COLUMN($D:$D))))","v":""}]
["",{"$f":"IF($D19=\"\",\"\",INDEX(december!$A:$O,ROW()-2,COLUMN($C:$C)))","v":""},"Variabel",{"$f":"IF(INDEX(december!$A:$O,ROW()-2,COLUMN(D:D))=\"\",\"\",IF(INDEX(december!$A:$O,ROW()-2,COLUMN(A:A))=\"\",\"\",INDEX(december!$A:$O,ROW()-2,COLUMN(A:A))))","v":""},"",null,"",{"$f":"IF($D19=\"\",\"\",IF(INDEX(december!$A:$O,ROW()-2,COLUMN($E:$E))=\"\",\"\",INDEX(december!$A:$O,ROW()-2,COLUMN($E:$E))))","v":""},null,null,{"$f":"IF($D19=\"\",\"\",IF(INDEX(december!$A:$O,ROW()-2,COLUMN($D:$D))=\"\",\"\",INDEX(december!$A:$O,ROW()-2,COLUMN($D:$D))))","v":""}]
["",{"$f":"IF($D20=\"\",\"\",INDEX(december!$A:$O,ROW()-2,COLUMN($C:$C)))","v":""},"Variabel",{"$f":"IF(INDEX(december!$A:$O,ROW()-2,COLUMN(D:D))=\"\",\"\",IF(INDEX(december!$A:$O,ROW()-2,COLUMN(A:A))=\"\",\"\",INDEX(december!$A:$O,ROW()-2,COLUMN(A:A))))","v":""},"",null,"",{"$f":"IF($D20=\"\",\"\",IF(INDEX(december!$A:$O,ROW()-2,COLUMN($E:$E))=\"\",\"\",INDEX(december!$A:$O,ROW()-2,COLUMN($E:$E))))","v":""},null,null,{"$f":"IF($D20=\"\",\"\",IF(INDEX(december!$A:$O,ROW()-2,COLUMN($D:$D))=\"\",\"\",INDEX(december!$A:$O,ROW()-2,COLUMN($D:$D))))","v":""}]
{"$rows_left_out":684}
{"sheet":"Decentral","index":13,"n_rows":4,"n_cols":11,"rows_kept":4,"cut":false,"hidden":false,"merged":[]}
[]
[3,6,"Variabel",31917,"2012-01-12",null,1181,"Bonus Q2 iflg aftale",null,null,6179]
[3,11,"Variabel",60916,"2012-01-12",null,9471,"Faktura 25",null,null,462.29]
[3,8,"Variabel",80020,"2012-01-12",null,9030,"Dobbelt okt/nov.",null,null,-3331.04]