{"text_format":"1","workbook":"xlsx","n_sheets":7,"sheets":["Timer","Overenskomst","Medarbejder","Helligdage","Timeseddel","Setup","job"],"not_rendered":{"charts":0,"images":0,"macros":1,"external_links":0,"defined_names":4,"comments":1,"pivot_tables":0},"unopened":[],"bounds":{"document_bytes":16777216,"sheet_cells":100000,"rows_first":2000,"rows_last":500,"rows_between":2000,"halvings":0,"cell_chars":16384,"cell_head_chars":4096},"cells_cut":0,"cells_raw":0,"read":"whole","date_system":"1900"}

{"sheet":"Timer","index":0,"n_rows":44,"n_cols":19,"rows_kept":44,"cut":false,"hidden":false,"merged":[[1,5,1,8],[3,2,3,3],[4,2,4,3],[5,2,5,3],[9,10,10,10],[8,7,8,13],[5,9,7,15],[9,15,10,15],[9,0,10,0],[9,13,10,13],[9,7,10,7],[9,6,10,6],[9,12,10,12],[9,5,10,5],[9,4,10,4],[9,3,10,3],[9,2,10,2],[9,11,10,11],[9,16,10,16],[9,17,10,17],[9,18,10,18],[9,1,10,1],[9,14,10,14]]}
[]
["Vælg år + måned >>>",2025,"April",null,null,"Timeregistrering"]
[null,"Medarbejder nr:",1]
[null,"Cpr nr:",{"$f":"IF(C3=0,\"\",VLOOKUP(C3,Medarbejder!A:F,3))","v":"????"}]
[null,"Navn",{"$f":"IF(C3=0,\"\",VLOOKUP(C3,Medarbejder!A:F,2))","v":"????"}]
[null,"Adresse",{"$f":"IF(C3=0,\"\",VLOOKUP(C3,Medarbejder!A:F,4))","v":"????"}]
[null,"By",{"$f":"IF(C3=0,\"\",VLOOKUP(C3,Medarbejder!A:F,5))","v":"????"}]
[null,"Postnr:",{"$f":"IF(C3=0,\"\",VLOOKUP(C3,Medarbejder!A:F,6))","v":"????"}]
[]
["Helligdage","Ugenr","Ugedag","Dato","Starttid","Sluttid","Pause","Normaltimer","Overtid 50%","Overtid 100%","Aftentimer","Nattimer","søndag","Helligdags timer","Sygetimer","Barsel","Feriefridag","Ferie","Barn syg"]
[null,null,null,null,null,null,null,null,"1-3 timer","Over 3 timer"]
[{"$f":"IF(NOT(ISERROR(MATCH(D12,Helligdage!A$3:A$12,0))),INDEX(Helligdage!B$3:B$12,MATCH(D12,Helligdage!A$3:A$12,0)),\"\")","v":""},{"$f":"IF(ISNUMBER(D12),WEEKNUM(D12,2),\"\")","v":14},{"$f":"PROPER(TEXT(D12,\"dddd\"))","v":"Tirsdag"},{"$f":"DATEVALUE(\"1/\"&C2&\"/\"&B2)","v":"2025-04-01"},null,null,null,{"$f":"IF(OR(E12=0,F12=0),0,IF(F12<E12,((F12+1)-E12)*24-G12,(F12-E12)*24-G12))","v":0},{"$f":"IF(OR(AND(OR(C12=\"mandag\",C12=\"tirsdag\",C12=\"onsdag\",C12=\"torsdag\"),H12>Setup!$F$4),AND(C12=\"fredag\",H12>Setup!$F$5)),MIN(H12-IF(C12=\"fredag\",Setup!$F$5,Setup!$F$4),3),0)","v":0},{"$f":"IF(OR(AND(OR(C12=\"mandag\",C12=\"tirsdag\",C12=\"onsdag\",C12=\"torsdag\"),H12>Setup!$F$4),AND(C12=\"fredag\",H12>Setup!$F$5)),H12-IF(C12=\"fredag\",Setup!$F$5,Setup!$F$4)-I12,0)","v":0},{"$f":"IF(OR(E12=0,F12=0),0,MAX(0,MIN(IF(F12<E12,F12+1,F12),IF(Setup!$G$2<Setup!$F$2,Setup!$G$2+1,Setup!$G$2))-MAX(E12,Setup!$F$2))*24)","v":0},{"$f":"IF(OR(E12=0,F12=0),0,MAX(0,MIN(IF(F12<E12,F12+1,F12),IF(Setup!$G$3<Setup!$F$3,Setup!$G$3+1,Setup!$G$3))-MAX(E12,Setup!$F$3))*24)","v":0},{"$f":"IF(C12=\"søndag\",H12,\"\")","v":""},{"$f":"IF(OR(A12=\"Skærtorsdag\",A12=\"Langfredag\",A12=\"Påskedag\",A12=\"2.Påskedag\",A12=\"Kr.Himmelfartsdag\",A12=\"Pinsedag\",A12=\"2. Pinsedag\",A12=\"Juledag\",A12=\"2 Juledag\",A12=\"Nytårsdag\"),H12-IF(ISNUMBER(M12),M12,0),\"\")","v":""}]
[{"$f":"IF(NOT(ISERROR(MATCH(D13,Helligdage!A$3:A$12,0))),INDEX(Helligdage!B$3:B$12,MATCH(D13,Helligdage!A$3:A$12,0)),\"\")","v":""},{"$f":"IF(ISNUMBER(D13),WEEKNUM(D13,2),\"\")","v":14},{"$f":"PROPER(TEXT(D13,\"dddd\"))","v":"Onsdag"},{"$f":"IFERROR(IF(AND(D12<>\"\",D12+1<=DATE(YEAR(D12),MONTH(D12)+1,0)),D12+1,\"\"),\"\")","v":"2025-04-02"},null,null,null,{"$f":"IF(OR(E13=0,F13=0),0,IF(F13<E13,((F13+1)-E13)*24-G13,(F13-E13)*24-G13))","v":0},{"$f":"IF(OR(AND(OR(C13=\"mandag\",C13=\"tirsdag\",C13=\"onsdag\",C13=\"torsdag\"),H13>Setup!$F$4),AND(C13=\"fredag\",H13>Setup!$F$5)),MIN(H13-IF(C13=\"fredag\",Setup!$F$5,Setup!$F$4),3),0)","v":0},{"$f":"IF(OR(AND(OR(C13=\"mandag\",C13=\"tirsdag\",C13=\"onsdag\",C13=\"torsdag\"),H13>Setup!$F$4),AND(C13=\"fredag\",H13>Setup!$F$5)),H13-IF(C13=\"fredag\",Setup!$F$5,Setup!$F$4)-I13,0)","v":0},{"$f":"IF(OR(E13=0,F13=0),0,MAX(0,MIN(IF(F13<E13,F13+1,F13),IF(Setup!$G$2<Setup!$F$2,Setup!$G$2+1,Setup!$G$2))-MAX(E13,Setup!$F$2))*24)","v":0},{"$f":"IF(OR(E13=0,F13=0),0,MAX(0,MIN(IF(F13<E13,F13+1,F13),IF(Setup!$G$3<Setup!$F$3,Setup!$G$3+1,Setup!$G$3))-MAX(E13,Setup!$F$3))*24)","v":0},{"$f":"IF(C13=\"søndag\",H13,\"\")","v":""},{"$f":"IF(OR(A13=\"Skærtorsdag\",A13=\"Langfredag\",A13=\"Påskedag\",A13=\"2.Påskedag\",A13=\"Kr.Himmelfartsdag\",A13=\"Pinsedag\",A13=\"2. Pinsedag\",A13=\"Juledag\",A13=\"2 Juledag\",A13=\"Nytårsdag\"),H13-IF(ISNUMBER(M13),M13,0),\"\")","v":""}]
[{"$f":"IF(NOT(ISERROR(MATCH(D14,Helligdage!A$3:A$12,0))),INDEX(Helligdage!B$3:B$12,MATCH(D14,Helligdage!A$3:A$12,0)),\"\")","v":""},14,"Torsdag",{"$f":"IFERROR(IF(AND(D13<>\"\",D13+1<=DATE(YEAR(D13),MONTH(D13)+1,0)),D13+1,\"\"),\"\")","v":"2025-04-03"},null,null,null,0,{"$f":"IF(OR(AND(OR(C14=\"mandag\",C14=\"tirsdag\",C14=\"onsdag\",C14=\"torsdag\"),H14>Setup!$F$4),AND(C14=\"fredag\",H14>Setup!$F$5)),MIN(H14-IF(C14=\"fredag\",Setup!$F$5,Setup!$F$4),3),0)","v":0},{"$f":"IF(OR(AND(OR(C14=\"mandag\",C14=\"tirsdag\",C14=\"onsdag\",C14=\"torsdag\"),H14>Setup!$F$4),AND(C14=\"fredag\",H14>Setup!$F$5)),H14-IF(C14=\"fredag\",Setup!$F$5,Setup!$F$4)-I14,0)","v":0},{"$f":"IF(OR(E14=0,F14=0),0,MAX(0,MIN(IF(F14<E14,F14+1,F14),IF(Setup!$G$2<Setup!$F$2,Setup!$G$2+1,Setup!$G$2))-MAX(E14,Setup!$F$2))*24)","v":0},{"$f":"IF(OR(E14=0,F14=0),0,MAX(0,MIN(IF(F14<E14,F14+1,F14),IF(Setup!$G$3<Setup!$F$3,Setup!$G$3+1,Setup!$G$3))-MAX(E14,Setup!$F$3))*24)","v":0},"",""]
[{"$f":"IF(NOT(ISERROR(MATCH(D15,Helligdage!A$3:A$12,0))),INDEX(Helligdage!B$3:B$12,MATCH(D15,Helligdage!A$3:A$12,0)),\"\")","v":""},14,"Fredag","2025-04-04",null,null,null,0,{"$f":"IF(OR(AND(OR(C15=\"mandag\",C15=\"tirsdag\",C15=\"onsdag\",C15=\"torsdag\"),H15>Setup!$F$4),AND(C15=\"fredag\",H15>Setup!$F$5)),MIN(H15-IF(C15=\"fredag\",Setup!$F$5,Setup!$F$4),3),0)","v":0},{"$f":"IF(OR(AND(OR(C15=\"mandag\",C15=\"tirsdag\",C15=\"onsdag\",C15=\"torsdag\"),H15>Setup!$F$4),AND(C15=\"fredag\",H15>Setup!$F$5)),H15-IF(C15=\"fredag\",Setup!$F$5,Setup!$F$4)-I15,0)","v":0},{"$f":"IF(OR(E15=0,F15=0),0,MAX(0,MIN(IF(F15<E15,F15+1,F15),IF(Setup!$G$2<Setup!$F$2,Setup!$G$2+1,Setup!$G$2))-MAX(E15,Setup!$F$2))*24)","v":0},{"$f":"IF(OR(E15=0,F15=0),0,MAX(0,MIN(IF(F15<E15,F15+1,F15),IF(Setup!$G$3<Setup!$F$3,Setup!$G$3+1,Setup!$G$3))-MAX(E15,Setup!$F$3))*24)","v":0},"",""]
[{"$f":"IF(NOT(ISERROR(MATCH(D16,Helligdage!A$3:A$12,0))),INDEX(Helligdage!B$3:B$12,MATCH(D16,Helligdage!A$3:A$12,0)),\"\")","v":""},14,"Lørdag","2025-04-05",null,null,null,0,{"$f":"IF(OR(AND(OR(C16=\"mandag\",C16=\"tirsdag\",C16=\"onsdag\",C16=\"torsdag\"),H16>Setup!$F$4),AND(C16=\"fredag\",H16>Setup!$F$5)),MIN(H16-IF(C16=\"fredag\",Setup!$F$5,Setup!$F$4),3),0)","v":0},{"$f":"IF(OR(AND(OR(C16=\"mandag\",C16=\"tirsdag\",C16=\"onsdag\",C16=\"torsdag\"),H16>Setup!$F$4),AND(C16=\"fredag\",H16>Setup!$F$5)),H16-IF(C16=\"fredag\",Setup!$F$5,Setup!$F$4)-I16,0)","v":0},{"$f":"IF(OR(E16=0,F16=0),0,MAX(0,MIN(IF(F16<E16,F16+1,F16),IF(Setup!$G$2<Setup!$F$2,Setup!$G$2+1,Setup!$G$2))-MAX(E16,Setup!$F$2))*24)","v":0},{"$f":"IF(OR(E16=0,F16=0),0,MAX(0,MIN(IF(F16<E16,F16+1,F16),IF(Setup!$G$3<Setup!$F$3,Setup!$G$3+1,Setup!$G$3))-MAX(E16,Setup!$F$3))*24)","v":0},"",""]
[{"$f":"IF(NOT(ISERROR(MATCH(D17,Helligdage!A$3:A$12,0))),INDEX(Helligdage!B$3:B$12,MATCH(D17,Helligdage!A$3:A$12,0)),\"\")","v":""},14,"Søndag","2025-04-06",null,null,null,0,{"$f":"IF(OR(AND(OR(C17=\"mandag\",C17=\"tirsdag\",C17=\"onsdag\",C17=\"torsdag\"),H17>Setup!$F$4),AND(C17=\"fredag\",H17>Setup!$F$5)),MIN(H17-IF(C17=\"fredag\",Setup!$F$5,Setup!$F$4),3),0)","v":0},{"$f":"IF(OR(AND(OR(C17=\"mandag\",C17=\"tirsdag\",C17=\"onsdag\",C17=\"torsdag\"),H17>Setup!$F$4),AND(C17=\"fredag\",H17>Setup!$F$5)),H17-IF(C17=\"fredag\",Setup!$F$5,Setup!$F$4)-I17,0)","v":0},{"$f":"IF(OR(E17=0,F17=0),0,MAX(0,MIN(IF(F17<E17,F17+1,F17),IF(Setup!$G$2<Setup!$F$2,Setup!$G$2+1,Setup!$G$2))-MAX(E17,Setup!$F$2))*24)","v":0},{"$f":"IF(OR(E17=0,F17=0),0,MAX(0,MIN(IF(F17<E17,F17+1,F17),IF(Setup!$G$3<Setup!$F$3,Setup!$G$3+1,Setup!$G$3))-MAX(E17,Setup!$F$3))*24)","v":0},0,""]
[{"$f":"IF(NOT(ISERROR(MATCH(D18,Helligdage!A$3:A$12,0))),INDEX(Helligdage!B$3:B$12,MATCH(D18,Helligdage!A$3:A$12,0)),\"\")","v":""},15,"Mandag","2025-04-07",null,null,null,0,{"$f":"IF(OR(AND(OR(C18=\"mandag\",C18=\"tirsdag\",C18=\"onsdag\",C18=\"torsdag\"),H18>Setup!$F$4),AND(C18=\"fredag\",H18>Setup!$F$5)),MIN(H18-IF(C18=\"fredag\",Setup!$F$5,Setup!$F$4),3),0)","v":0},{"$f":"IF(OR(AND(OR(C18=\"mandag\",C18=\"tirsdag\",C18=\"onsdag\",C18=\"torsdag\"),H18>Setup!$F$4),AND(C18=\"fredag\",H18>Setup!$F$5)),H18-IF(C18=\"fredag\",Setup!$F$5,Setup!$F$4)-I18,0)","v":0},{"$f":"IF(OR(E18=0,F18=0),0,MAX(0,MIN(IF(F18<E18,F18+1,F18),IF(Setup!$G$2<Setup!$F$2,Setup!$G$2+1,Setup!$G$2))-MAX(E18,Setup!$F$2))*24)","v":0},{"$f":"IF(OR(E18=0,F18=0),0,MAX(0,MIN(IF(F18<E18,F18+1,F18),IF(Setup!$G$3<Setup!$F$3,Setup!$G$3+1,Setup!$G$3))-MAX(E18,Setup!$F$3))*24)","v":0},"",""]
[{"$f":"IF(NOT(ISERROR(MATCH(D19,Helligdage!A$3:A$12,0))),INDEX(Helligdage!B$3:B$12,MATCH(D19,Helligdage!A$3:A$12,0)),\"\")","v":""},15,"Tirsdag","2025-04-08",null,null,null,0,{"$f":"IF(OR(AND(OR(C19=\"mandag\",C19=\"tirsdag\",C19=\"onsdag\",C19=\"torsdag\"),H19>Setup!$F$4),AND(C19=\"fredag\",H19>Setup!$F$5)),MIN(H19-IF(C19=\"fredag\",Setup!$F$5,Setup!$F$4),3),0)","v":0},{"$f":"IF(OR(AND(OR(C19=\"mandag\",C19=\"tirsdag\",C19=\"onsdag\",C19=\"torsdag\"),H19>Setup!$F$4),AND(C19=\"fredag\",H19>Setup!$F$5)),H19-IF(C19=\"fredag\",Setup!$F$5,Setup!$F$4)-I19,0)","v":0},{"$f":"IF(OR(E19=0,F19=0),0,MAX(0,MIN(IF(F19<E19,F19+1,F19),IF(Setup!$G$2<Setup!$F$2,Setup!$G$2+1,Setup!$G$2))-MAX(E19,Setup!$F$2))*24)","v":0},{"$f":"IF(OR(E19=0,F19=0),0,MAX(0,MIN(IF(F19<E19,F19+1,F19),IF(Setup!$G$3<Setup!$F$3,Setup!$G$3+1,Setup!$G$3))-MAX(E19,Setup!$F$3))*24)","v":0},"",""]
[{"$f":"IF(NOT(ISERROR(MATCH(D20,Helligdage!A$3:A$12,0))),INDEX(Helligdage!B$3:B$12,MATCH(D20,Helligdage!A$3:A$12,0)),\"\")","v":""},15,"Onsdag","2025-04-09",null,null,null,0,{"$f":"IF(OR(AND(OR(C20=\"mandag\",C20=\"tirsdag\",C20=\"onsdag\",C20=\"torsdag\"),H20>Setup!$F$4),AND(C20=\"fredag\",H20>Setup!$F$5)),MIN(H20-IF(C20=\"fredag\",Setup!$F$5,Setup!$F$4),3),0)","v":0},{"$f":"IF(OR(AND(OR(C20=\"mandag\",C20=\"tirsdag\",C20=\"onsdag\",C20=\"torsdag\"),H20>Setup!$F$4),AND(C20=\"fredag\",H20>Setup!$F$5)),H20-IF(C20=\"fredag\",Setup!$F$5,Setup!$F$4)-I20,0)","v":0},{"$f":"IF(OR(E20=0,F20=0),0,MAX(0,MIN(IF(F20<E20,F20+1,F20),IF(Setup!$G$2<Setup!$F$2,Setup!$G$2+1,Setup!$G$2))-MAX(E20,Setup!$F$2))*24)","v":0},{"$f":"IF(OR(E20=0,F20=0),0,MAX(0,MIN(IF(F20<E20,F20+1,F20),IF(Setup!$G$3<Setup!$F$3,Setup!$G$3+1,Setup!$G$3))-MAX(E20,Setup!$F$3))*24)","v":0},"",""]
{"$rows_left_out":25}
{"sheet":"Overenskomst","index":1,"n_rows":34,"n_cols":4,"rows_kept":34,"cut":false,"hidden":false,"merged":[]}
[]
[null,"Overenskomst satser afdeling","Rengøring"]
[]
[null,"Tekst  fra overenskomst","2023-03-15","Bemærkning"]
[null,"Kludevask",139.53,"aftalt fast timepris uden tillæg"]
[null,"Transporttid timesats",136.11000000000001,"køretid fra hjem til arbejdsplads i egen bil u/ tillæg"]
[null,"Præstationsløn (normaltimer)",164.86,"udgangspunkt i løn med tillæg"]
[null,"Servicetillæg",3.65,"NB! Kun ansatte før 1. sep 2017"]
[null,"Anciennitesttillæg",4.6500000000000004,"NB! Efter 1 års ansættelse (ansatte før 1.sep 2017)"]
[null,"Brancheanciennitetstillæg efter 36 md.",9.3000000000000007,"Træder i kraft d. 15 nevember 2023 kr.9,30"]
[null,"Brancheanciennitetstillæg 12 - 18 md.",5.54,"Model 2: Intet servicetillæg og anciennitetstillæg"]
[null,"Brancheanciennitetstillæg Eft. 18 md.",8.3000000000000007,"Model 2: Intet servicetillæg og anciennitetstillæg"]
[null,"Serviceassistent tillæg",4,"uddannet/ tillæg som præstationsløn"]
[null,"Aftentillæg - se setup fane",16.989999999999998,"tillæg mellem kl. 18 - 22"]
[null,"Nattillæg - se setup fane      ",22.12,"tillæg mellem kl. 22 - 05"]
[null,"Søn-helligdag  ",24.55,"tillæg mellem kl. 00,00 - 24,00"]
[null,"Hovedrengøring",7.13,"tillæg for ekstra rengøring"]
[null,"Genetillæg",4.71,"ved specielle gene rengøringer"]
[null,"Skurtillæg",3.11]
[null,"Overtid 50% 1-3 timer",43.59]
{"$rows_left_out":15}
{"sheet":"Medarbejder","index":2,"n_rows":3,"n_cols":12,"rows_kept":3,"cut":false,"hidden":false,"merged":[[0,0,0,5],[0,7,0,11]]}
["Medarbejder",null,null,null,null,null,null,"Firma Oplysninger"]
["Medarbejder nummer","Navn","Cpr nummer","Vejnavn","By","Postnummer",null,"Firma","Adresse","By","Postnummer","Kontaktperson"]
[1,"????","????","????","????","????",null,"???","???","???","???","???"]

{"sheet":"Helligdage","index":3,"n_rows":26,"n_cols":5,"rows_kept":26,"cut":false,"hidden":true,"merged":[[1,0,1,1]]}
[{"$f":"Timer!B2","v":2025},null,"Palmesøndag",null,"Hvis disse  tekster og koder ændres vil det have fatal indflydelse på opsætningen af arket \"Timer\""]
["Helligdage til timeregistrering",null,{"$f":"PalmSunday(A1)","v":"2025-04-13"}]
[{"$f":"C2+4","v":"2025-04-17"},"Skærtorsdag"]
[{"$f":"C2+5","v":"2025-04-18"},"Langfredag"]
[{"$f":"C2+7","v":"2025-04-20"},"Påskedag"]
[{"$f":"C2+8","v":"2025-04-21"},"2.Påskedag"]
[{"$f":"C2+46","v":"2025-05-29"},"Kr.Himmelfartsdag"]
[{"$f":"C2+56","v":"2025-06-08"},"Pinsedag"]
[{"$f":"C2+57","v":"2025-06-09"},"2. Pinsedag"]
[{"$f":"DATE(A1,12,25)","v":"2025-12-25"},"Juledag"]
[{"$f":"DATE(A1,12,26)","v":"2025-12-26"},"2 Juledag"]
[{"$f":"DATE(A1,1,1)","v":"2025-01-01"},"Nytårsdag"]
[]
["Måneder","Hvis i Kolonne A "]
["Januar","Syg"]
["Februar","Barn syg"]
["Marts","Ferie"]
["April","Feriefridag"]
["Maj","Barsel"]
["Juni"]
{"$rows_left_out":7}
{"sheet":"Timeseddel","index":4,"n_rows":43,"n_cols":14,"rows_kept":43,"cut":false,"hidden":false,"merged":[[9,0,10,0],[7,5,7,6],[9,1,10,1],[9,5,10,5],[2,5,2,7],[3,5,3,7],[4,5,4,7],[5,5,5,7],[6,5,6,7],[3,1,3,2],[4,1,4,2],[5,1,5,2],[6,1,6,2],[7,1,7,2],[9,6,10,6],[9,2,10,2],[1,4,1,7],[0,12,0,13],[9,9,10,9],[9,10,10,10],[9,11,10,11],[9,12,10,12],[9,13,10,13],[9,8,10,8],[9,7,10,7]]}
[null,null,null,null,null,null,null,null,null,null,null,null,{"$f":"TODAY()","v":"2025-04-07"}]
["Start Dato",{"$f":"Timer!B2","v":2025},{"$f":"Timer!C2","v":"April"},null,"Firma Oplysninger"]
["Medarbejder",{"$f":"Timer!C3","v":1},null,null,"Firma",{"$f":"IF(Setup!A8=\"vis\",Medarbejder!H3,\"-\")","v":"-"}]
["Cpr nr:",{"$f":"Timer!C4","v":"????"},null,null,"Adresse",{"$f":"IF(Setup!A8=\"vis\",Medarbejder!I3,\"-\")","v":"-"}]
["Navn",{"$f":"Timer!C5","v":"????"},null,null,"By",{"$f":"IF(Setup!A8=\"vis\",Medarbejder!J3,\"-\")","v":"-"}]
["Adresse",{"$f":"Timer!C6","v":"????"},null,null,"Postnummer",{"$f":"IF(Setup!A8=\"vis\",Medarbejder!K3,\"-\")","v":"-"}]
["By",{"$f":"Timer!C7","v":"????"},null,null,"Kontaktperson",{"$f":"IF(Setup!A8=\"vis\",Medarbejder!L3,\"-\")","v":"-"}]
["Postnr:",{"$f":"Timer!C8","v":"????"}]
[]
["Dato","Normaltimer","Pause","Overtid 50%","Overtid 100%","Aftentimer","nat timer","Søndage","Helligdage","Sygetimer","Barsel","Feriefridag","Ferie","Barn syg"]
[null,null,null,"1-3 timer","Over 3 timer"]
[{"$f":"Timer!D12","v":"2025-04-01"},{"$f":"Timer!H12","v":0},{"$f":"Timer!G12","v":0},{"$f":"Timer!I12","v":0},{"$f":"Timer!J12","v":0},{"$f":"Timer!K12","v":0},{"$f":"Timer!L12","v":0},{"$f":"Timer!M12","v":""},{"$f":"Timer!N12","v":""},{"$f":"Timer!O12","v":"00:00:00"},{"$f":"Timer!P12","v":"00:00:00"},{"$f":"Timer!Q12","v":0},{"$f":"Timer!R12","v":0},{"$f":"Timer!S12","v":0}]
[{"$f":"Timer!D13","v":"2025-04-02"},{"$f":"Timer!H13","v":0},{"$f":"Timer!G13","v":0},{"$f":"Timer!I13","v":0},{"$f":"Timer!J13","v":0},{"$f":"Timer!K13","v":0},{"$f":"Timer!L13","v":0},{"$f":"Timer!M13","v":""},{"$f":"Timer!N13","v":""},{"$f":"Timer!O13","v":"00:00:00"},{"$f":"Timer!P13","v":"00:00:00"},{"$f":"Timer!Q13","v":0},{"$f":"Timer!R13","v":0},{"$f":"Timer!S13","v":0}]
[{"$f":"Timer!D14","v":"2025-04-03"},{"$f":"Timer!H14","v":0},{"$f":"Timer!G14","v":0},{"$f":"Timer!I14","v":0},{"$f":"Timer!J14","v":0},{"$f":"Timer!K14","v":0},{"$f":"Timer!L14","v":0},{"$f":"Timer!M14","v":""},{"$f":"Timer!N14","v":""},{"$f":"Timer!O14","v":"00:00:00"},{"$f":"Timer!P14","v":"00:00:00"},{"$f":"Timer!Q14","v":0},{"$f":"Timer!R14","v":0},{"$f":"Timer!S14","v":0}]
[{"$f":"Timer!D15","v":"2025-04-04"},{"$f":"Timer!H15","v":0},{"$f":"Timer!G15","v":0},{"$f":"Timer!I15","v":0},{"$f":"Timer!J15","v":0},{"$f":"Timer!K15","v":0},{"$f":"Timer!L15","v":0},{"$f":"Timer!M15","v":""},{"$f":"Timer!N15","v":""},{"$f":"Timer!O15","v":"00:00:00"},{"$f":"Timer!P15","v":"00:00:00"},{"$f":"Timer!Q15","v":0},{"$f":"Timer!R15","v":0},{"$f":"Timer!S15","v":0}]
[{"$f":"Timer!D16","v":"2025-04-05"},{"$f":"Timer!H16","v":0},{"$f":"Timer!G16","v":0},{"$f":"Timer!I16","v":0},{"$f":"Timer!J16","v":0},{"$f":"Timer!K16","v":0},{"$f":"Timer!L16","v":0},{"$f":"Timer!M16","v":""},{"$f":"Timer!N16","v":""},{"$f":"Timer!O16","v":"00:00:00"},{"$f":"Timer!P16","v":"00:00:00"},{"$f":"Timer!Q16","v":0},{"$f":"Timer!R16","v":0},{"$f":"Timer!S16","v":0}]
[{"$f":"Timer!D17","v":"2025-04-06"},{"$f":"Timer!H17","v":0},{"$f":"Timer!G17","v":0},{"$f":"Timer!I17","v":0},{"$f":"Timer!J17","v":0},{"$f":"Timer!K17","v":0},{"$f":"Timer!L17","v":0},{"$f":"Timer!M17","v":0},{"$f":"Timer!N17","v":""},{"$f":"Timer!O17","v":"00:00:00"},{"$f":"Timer!P17","v":"00:00:00"},{"$f":"Timer!Q17","v":0},{"$f":"Timer!R17","v":0},{"$f":"Timer!S17","v":0}]
[{"$f":"Timer!D18","v":"2025-04-07"},{"$f":"Timer!H18","v":0},{"$f":"Timer!G18","v":0},{"$f":"Timer!I18","v":0},{"$f":"Timer!J18","v":0},{"$f":"Timer!K18","v":0},{"$f":"Timer!L18","v":0},{"$f":"Timer!M18","v":""},{"$f":"Timer!N18","v":""},{"$f":"Timer!O18","v":"00:00:00"},{"$f":"Timer!P18","v":"00:00:00"},{"$f":"Timer!Q18","v":0},{"$f":"Timer!R18","v":0},{"$f":"Timer!S18","v":0}]
[{"$f":"Timer!D19","v":"2025-04-08"},{"$f":"Timer!H19","v":0},{"$f":"Timer!G19","v":0},{"$f":"Timer!I19","v":0},{"$f":"Timer!J19","v":0},{"$f":"Timer!K19","v":0},{"$f":"Timer!L19","v":0},{"$f":"Timer!M19","v":""},{"$f":"Timer!N19","v":""},{"$f":"Timer!O19","v":"00:00:00"},{"$f":"Timer!P19","v":"00:00:00"},{"$f":"Timer!Q19","v":0},{"$f":"Timer!R19","v":0},{"$f":"Timer!S19","v":0}]
[{"$f":"Timer!D20","v":"2025-04-09"},{"$f":"Timer!H20","v":0},{"$f":"Timer!G20","v":0},{"$f":"Timer!I20","v":0},{"$f":"Timer!J20","v":0},{"$f":"Timer!K20","v":0},{"$f":"Timer!L20","v":0},{"$f":"Timer!M20","v":""},{"$f":"Timer!N20","v":""},{"$f":"Timer!O20","v":"00:00:00"},{"$f":"Timer!P20","v":"00:00:00"},{"$f":"Timer!Q20","v":0},{"$f":"Timer!R20","v":0},{"$f":"Timer!S20","v":0}]
{"$rows_left_out":24}
{"sheet":"Setup","index":5,"n_rows":8,"n_cols":10,"rows_kept":8,"cut":false,"hidden":false,"merged":[[0,0,0,1]]}
["Opsætning af mailadresse, sender timeseddel som mail",null,"Måned",null,null,"Start","Slut"]
["Mailadresse",null,null,null,"aftenarbejde","18:00:00","22:00:00","Ændre start og slut tid for aftenarbejde"]
["Meddelelse","            ",{"$f":"Timer!C2","v":"April"},null,"Natarbejde","22:00:00","05:00:00","Ændre start og slut tid for for natarbejde"]
["Afsender",null,null,null,"Overarbejde man,tir,ons,torsdag",7.5,null,"Ændre timerne fra hvornår overarbejde begynder",{"$f":"Overenskomst!B20","v":"Overtid 50% 1-3 timer"},{"$f":"Overenskomst!B21","v":"Overtid 100% over 3 timer"}]
[null,null,null,null,"overarbejde Fredag efter ",7,null,"Ændre timerne fra hvornår overarbejde begynder",{"$f":"Overenskomst!B20","v":"Overtid 50% 1-3 timer"},{"$f":"Overenskomst!B21","v":"Overtid 100% over 3 timer"}]
["Vis ikke","Vælg \"Vis\" hvis du se beløbet under timer, regner efter arket overenskomst."]
[]
["Vis ikke","Her kan du vælge om du vil vise firmanavn på timesedlen"]

{"sheet":"job","index":6,"n_rows":14,"n_cols":7,"rows_kept":14,"cut":false,"hidden":false,"merged":[[6,1,9,6],[5,1,5,2]]}
[null,null,null,"Arbejdsseddel"]
[null,"Dato","2025-04-11"]
[null,"Arbejdssted"]
[null,"Firma","Adresse","By","Postnr.","Kontaktperson","Tlfnr."]
[null,"Arbejdsgiver","Vejnavn","byen","posnr","personen"]
[null,"Arbejdsbeskrivelse"]
[null,"Dette felt bruges til at beskrive opgaven"]
[]
[]
[]
[]
[null,"Mødetid","07:00:00"]
[null,"Sluttid","23:00:00"]
[null,"Pause ",0.25]