{"text_format":"1","workbook":"xlsx","n_sheets":7,"sheets":["List_items","Ingredient list","Starter_1","Starter_2","Main_1","Main_2","Opslag"],"not_rendered":{"charts":0,"images":1,"macros":1,"external_links":0,"defined_names":9,"comments":0,"pivot_tables":0},"unopened":[],"bounds":{"document_bytes":16777216,"sheet_cells":100000,"rows_first":2000,"rows_last":500,"rows_between":2000,"halvings":0,"cell_chars":16384,"cell_head_chars":4096},"cells_cut":0,"cells_raw":0,"read":"whole","date_system":"1900"}

{"sheet":"List_items","index":0,"n_rows":106,"n_cols":14,"rows_kept":106,"cut":false,"hidden":false,"merged":[[3,8,3,13]]}
[{"$f":"+ROW()","v":1},"UNIT:","BUTIK XXYY","Currency:"]
[{"$f":"+ROW()","v":2},"VAT_%",0.25,"DKK"]
[3,"Valid per","2018-10-01"]
[4,null,null,null,null,null,null,null,"FROM CALCULATION SHEETS"]
[5,null,null,null,null,null,null,null,1,2,4,5,6,7]
[6,"Type","Name","At menu from","Updated","Covers","MenuPriceACT","GM%Goal","Calc Price","Menu Price, ex VAT","Cost, 1 unit","Gr Profit, act","Gr Margin, act","GM, goal"]
[7,"Starter_1","Starter nr 1",null,null,1,100,null,{"$f":"IFERROR(VLOOKUP(I$5,INDIRECT($B7),9,0),\"\")","v":7.09},100,5.67,74.33,0.92900000000000005,0]
[8,"Starter_2","Starter nr 2",null,null,1,100,null,{"$f":"IFERROR(VLOOKUP(I$5,INDIRECT($B8),9,0),\"\")","v":22.58},100,18.059999999999999,61.94,0.77400000000000002,0]
[9,"Starter_3",null,null,null,null,null,null,"","","","","",""]
[10,"Starter_4",null,null,null,null,null,null,"","","","","",""]
[11,"Starter_5",null,null,null,null,null,null,"","","","","",""]
[12,"Starter_6",null,null,null,null,null,null,"","","","","",""]
[13,"Starter_7",null,null,null,null,null,null,"","","","","",""]
[14,"Starter_8",null,null,null,null,null,null,"","","","","",""]
[15,"Starter_9",null,null,null,null,null,null,"","","","","",""]
[16,"Starter_10",null,null,null,null,null,null,"","","","","",""]
[17,"Starter_11",null,null,null,null,null,null,"","","","","",""]
[18,"Starter_12",null,null,null,null,null,null,"","","","","",""]
[19,"Starter_13",null,null,null,null,null,null,"","","","","",""]
[20,"Starter_14",null,null,null,null,null,null,"","","","","",""]
{"$rows_left_out":87}
{"sheet":"Ingredient list","index":1,"n_rows":312,"n_cols":7,"rows_kept":312,"cut":false,"hidden":false,"merged":[]}
["Lookup","MainGroup","SubGroup","Ingredient","Price_unit","Unit","Empty"]
[{"$f":"+CONCATENATE(C2,D2)","v":""}]
[{"$f":"+CONCATENATE(C3,D3)","v":"0"},{"$f":"+B2","v":0},{"$f":"+C2","v":0}]
["0",{"$f":"+B3","v":0},{"$f":"+C3","v":0}]
["0",0,0]
["0",0,0]
["0",0,0]
["0",0,0]
["0",0,0]
["0",0,0]
["0",0,0]
["0",0,0]
["0",0,0]
["0",0,0]
["0",0,0]
["0",0,0]
["0",0,0]
["0",0,0]
["0",0,0]
["0",0,0]
{"$rows_left_out":293}
{"sheet":"Starter_1","index":2,"n_rows":50,"n_cols":9,"rows_kept":50,"cut":false,"hidden":false,"merged":[[0,2,0,5],[37,1,37,8],[38,1,38,8],[39,1,39,8],[49,1,49,8],[40,1,40,8],[41,1,41,8],[42,1,42,8],[43,1,43,8],[44,1,44,8],[48,1,48,8]]}
[{"$f":"+ROW()","v":1},"Name of course",{"$f":"IFERROR(VLOOKUP($C$4,List_items!$B:$I,2,0),\"\")","v":"Starter nr 1"},null,null,null,"Calc Price to GM",null,{"$f":"+IFERROR(ROUND(I36/(1-I7)*1.25,2),\"\")","v":7.09}]
[{"$f":"+ROW()","v":2},"Restaurant",{"$f":"+List_items!$C$1","v":"BUTIK XXYY"},null,null,null,"Menu Price, act",null,{"$f":"+VLOOKUP($C$4,List_items!$B:$L,6,0)","v":100}]
[3,"At menu form/updated",null,{"$f":"IFERROR(VLOOKUP($C$4,List_items!$B:$I,3,0),\"\")","v":"00:00:00"},{"$f":"+VLOOKUP($C$4,List_items!$B:$I,4,0)","v":"00:00:00"},null,"Menu Price, ex VAT",null,{"$f":"IFERROR(ROUND(I2/(1+List_items!C2),0),\"\")","v":80}]
[4,"Fane_item value","Starter_1",null,null,null,"Cost, 1 unit",null,{"$f":"+IFERROR(ROUND(I36/H8,2),\"\")","v":5.67}]
[5,null,null,null,null,null,"Gr Profit, act",null,{"$f":"+IFERROR(I3-I4,\"\")","v":74.33}]
[6,null,null,null,null,null,"Gr Margin, act",null,{"$f":"+IFERROR(ROUND(I5/I3,3),\"\")","v":0.92900000000000005}]
[7,null,null,null,null,null,"GM, goal",null,{"$f":"+VLOOKUP($C$4,List_items!$B:$L,7,0)","v":0}]
[8,null,null,null,null,null,"Covers:",{"$f":"+VLOOKUP($C$4,List_items!$B:$L,5,0)","v":1}]
[9,"MainGroup","Ingredients","Net dish","Unit","Waste","Total use","Unit Cost","Costpris"]
[10,null,null,null,{"$f":"IFERROR(VLOOKUP(CONCATENATE($B10,$C10),'Ingredient list'!$A:$F,6,0),\"\")","v":0},null,{"$f":"IFERROR(ROUND(D10/(1-F10),3),\"\")","v":0},{"$f":"IFERROR(VLOOKUP(CONCATENATE($B10,$C10),'Ingredient list'!$A:$F,5,0),\"\")","v":0},{"$f":"IFERROR(G10*H10,\"\")","v":0}]
[11,null,null,null,{"$f":"IFERROR(VLOOKUP(CONCATENATE($B11,$C11),'Ingredient list'!$A:$F,6,0),\"\")","v":0},null,{"$f":"IFERROR(ROUND(D11/(1-F11),3),\"\")","v":0},{"$f":"IFERROR(VLOOKUP(CONCATENATE($B11,$C11),'Ingredient list'!$A:$F,5,0),\"\")","v":0},{"$f":"IFERROR(G11*H11,\"\")","v":0}]
[12,"Dairy_milk","Sødmælk",0.3,{"$f":"IFERROR(VLOOKUP(CONCATENATE($B12,$C12),'Ingredient list'!$A:$F,6,0),\"\")","v":"ltr"},0.2,0.375,{"$f":"IFERROR(VLOOKUP(CONCATENATE($B12,$C12),'Ingredient list'!$A:$F,5,0),\"\")","v":10},3.75]
[13,"Dairy_cheese","Frrisk ost",2.5000000000000001E-2,{"$f":"IFERROR(VLOOKUP(CONCATENATE($B13,$C13),'Ingredient list'!$A:$F,6,0),\"\")","v":"kg"},null,2.5000000000000001E-2,{"$f":"IFERROR(VLOOKUP(CONCATENATE($B13,$C13),'Ingredient list'!$A:$F,5,0),\"\")","v":10},0.25]
[14,null,null,null,{"$f":"IFERROR(VLOOKUP(CONCATENATE($B14,$C14),'Ingredient list'!$A:$F,6,0),\"\")","v":0},null,0,{"$f":"IFERROR(VLOOKUP(CONCATENATE($B14,$C14),'Ingredient list'!$A:$F,5,0),\"\")","v":0},0]
[15,"Dairy_butter","Smør, klaret 1,8kg",0.15,{"$f":"IFERROR(VLOOKUP(CONCATENATE($B15,$C15),'Ingredient list'!$A:$F,6,0),\"\")","v":"sp"},0.1,0.16700000000000001,{"$f":"IFERROR(VLOOKUP(CONCATENATE($B15,$C15),'Ingredient list'!$A:$F,5,0),\"\")","v":10},1.6700000000000002]
[16,null,null,null,{"$f":"IFERROR(VLOOKUP(CONCATENATE($B16,$C16),'Ingredient list'!$A:$F,6,0),\"\")","v":0},null,0,{"$f":"IFERROR(VLOOKUP(CONCATENATE($B16,$C16),'Ingredient list'!$A:$F,5,0),\"\")","v":0},0]
[17,null,null,null,{"$f":"IFERROR(VLOOKUP(CONCATENATE($B17,$C17),'Ingredient list'!$A:$F,6,0),\"\")","v":0},null,0,{"$f":"IFERROR(VLOOKUP(CONCATENATE($B17,$C17),'Ingredient list'!$A:$F,5,0),\"\")","v":0},0]
[18,null,null,null,{"$f":"IFERROR(VLOOKUP(CONCATENATE($B18,$C18),'Ingredient list'!$A:$F,6,0),\"\")","v":0},null,0,{"$f":"IFERROR(VLOOKUP(CONCATENATE($B18,$C18),'Ingredient list'!$A:$F,5,0),\"\")","v":0},0]
[19,null,null,null,{"$f":"IFERROR(VLOOKUP(CONCATENATE($B19,$C19),'Ingredient list'!$A:$F,6,0),\"\")","v":0},null,0,{"$f":"IFERROR(VLOOKUP(CONCATENATE($B19,$C19),'Ingredient list'!$A:$F,5,0),\"\")","v":0},0]
[20,null,null,null,{"$f":"IFERROR(VLOOKUP(CONCATENATE($B20,$C20),'Ingredient list'!$A:$F,6,0),\"\")","v":0},null,0,{"$f":"IFERROR(VLOOKUP(CONCATENATE($B20,$C20),'Ingredient list'!$A:$F,5,0),\"\")","v":0},0]
{"$rows_left_out":31}
{"sheet":"Starter_2","index":3,"n_rows":50,"n_cols":9,"rows_kept":50,"cut":false,"hidden":false,"merged":[[0,2,0,5],[43,1,43,8],[44,1,44,8],[48,1,48,8],[49,1,49,8],[37,1,37,8],[38,1,38,8],[39,1,39,8],[40,1,40,8],[41,1,41,8],[42,1,42,8]]}
[{"$f":"+ROW()","v":1},"Name of course",{"$f":"IFERROR(VLOOKUP($C$4,List_items!$B:$I,2,0),\"\")","v":"Starter nr 2"},null,null,null,"Calc Price",null,{"$f":"+IFERROR(ROUND(I36/(1-I7)*1.25,2),\"\")","v":22.58}]
[{"$f":"+ROW()","v":2},"Restaurant",{"$f":"+List_items!$C$1","v":"BUTIK XXYY"},null,null,null,"Menu Price, fixed",null,{"$f":"+VLOOKUP($C$4,List_items!$B:$L,6,0)","v":100}]
[3,"At menu form/updated",null,{"$f":"IFERROR(VLOOKUP($C$4,List_items!$B:$I,3,0),\"\")","v":"00:00:00"},{"$f":"+VLOOKUP($C$4,List_items!$B:$I,4,0)","v":"00:00:00"},null,"Menu Price, ex VAT",null,{"$f":"IFERROR(ROUND(I2/(1+List_items!C2),0),\"\")","v":80}]
[4,"Fane_item value","Starter_2",null,null,null,"Cost, 1 unit",null,{"$f":"+IFERROR(ROUND(I36/H8,2),\"\")","v":18.059999999999999}]
[5,null,null,null,null,null,"Gr Profit, act",null,{"$f":"+IFERROR(I3-I4,\"\")","v":61.94}]
[6,null,null,null,null,null,"Gr Margin, act",null,{"$f":"+IFERROR(ROUND(I5/I3,3),\"\")","v":0.77400000000000002}]
[7,null,null,null,null,null,"GM, goal",null,{"$f":"+VLOOKUP($C$4,List_items!$B:$L,7,0)","v":0}]
[8,null,null,null,null,null,"Covers:",{"$f":"+VLOOKUP($C$4,List_items!$B:$L,5,0)","v":1}]
[9,"MainGroup","Ingredients","Net dish","Unit","Waste","Total use","Unit Cost","Costpris"]
[10,null,null,null,{"$f":"IFERROR(VLOOKUP(CONCATENATE($B10,$C10),'Ingredient list'!$A:$F,6,0),\"\")","v":0},null,{"$f":"IFERROR(ROUND(D10/(1-F10),3),\"\")","v":0},{"$f":"IFERROR(VLOOKUP(CONCATENATE($B10,$C10),'Ingredient list'!$A:$F,5,0),\"\")","v":0},{"$f":"IFERROR(G10*H10,\"\")","v":0}]
[11,"Dairy_milk","Sødmælk",0.5,{"$f":"IFERROR(VLOOKUP(CONCATENATE($B11,$C11),'Ingredient list'!$A:$F,6,0),\"\")","v":"ltr"},0.1,{"$f":"IFERROR(ROUND(D11/(1-F11),3),\"\")","v":0.55600000000000005},{"$f":"IFERROR(VLOOKUP(CONCATENATE($B11,$C11),'Ingredient list'!$A:$F,5,0),\"\")","v":10},{"$f":"IFERROR(G11*H11,\"\")","v":5.5600000000000005}]
[12,"Dairy_egg","hele æg",1,{"$f":"IFERROR(VLOOKUP(CONCATENATE($B12,$C12),'Ingredient list'!$A:$F,6,0),\"\")","v":"dnk"},0.2,1.25,{"$f":"IFERROR(VLOOKUP(CONCATENATE($B12,$C12),'Ingredient list'!$A:$F,5,0),\"\")","v":10},12.5]
[13,null,null,null,{"$f":"IFERROR(VLOOKUP(CONCATENATE($B13,$C13),'Ingredient list'!$A:$F,6,0),\"\")","v":0},null,0,{"$f":"IFERROR(VLOOKUP(CONCATENATE($B13,$C13),'Ingredient list'!$A:$F,5,0),\"\")","v":0},0]
[14,null,null,null,{"$f":"IFERROR(VLOOKUP(CONCATENATE($B14,$C14),'Ingredient list'!$A:$F,6,0),\"\")","v":0},null,0,{"$f":"IFERROR(VLOOKUP(CONCATENATE($B14,$C14),'Ingredient list'!$A:$F,5,0),\"\")","v":0},0]
[15,null,null,null,{"$f":"IFERROR(VLOOKUP(CONCATENATE($B15,$C15),'Ingredient list'!$A:$F,6,0),\"\")","v":0},null,0,{"$f":"IFERROR(VLOOKUP(CONCATENATE($B15,$C15),'Ingredient list'!$A:$F,5,0),\"\")","v":0},0]
[16,null,null,null,{"$f":"IFERROR(VLOOKUP(CONCATENATE($B16,$C16),'Ingredient list'!$A:$F,6,0),\"\")","v":0},null,0,{"$f":"IFERROR(VLOOKUP(CONCATENATE($B16,$C16),'Ingredient list'!$A:$F,5,0),\"\")","v":0},0]
[17,null,null,null,{"$f":"IFERROR(VLOOKUP(CONCATENATE($B17,$C17),'Ingredient list'!$A:$F,6,0),\"\")","v":0},null,0,{"$f":"IFERROR(VLOOKUP(CONCATENATE($B17,$C17),'Ingredient list'!$A:$F,5,0),\"\")","v":0},0]
[18,null,null,null,{"$f":"IFERROR(VLOOKUP(CONCATENATE($B18,$C18),'Ingredient list'!$A:$F,6,0),\"\")","v":0},null,0,{"$f":"IFERROR(VLOOKUP(CONCATENATE($B18,$C18),'Ingredient list'!$A:$F,5,0),\"\")","v":0},0]
[19,null,null,null,{"$f":"IFERROR(VLOOKUP(CONCATENATE($B19,$C19),'Ingredient list'!$A:$F,6,0),\"\")","v":0},null,0,{"$f":"IFERROR(VLOOKUP(CONCATENATE($B19,$C19),'Ingredient list'!$A:$F,5,0),\"\")","v":0},0]
[20,null,null,null,{"$f":"IFERROR(VLOOKUP(CONCATENATE($B20,$C20),'Ingredient list'!$A:$F,6,0),\"\")","v":0},null,0,{"$f":"IFERROR(VLOOKUP(CONCATENATE($B20,$C20),'Ingredient list'!$A:$F,5,0),\"\")","v":0},0]
{"$rows_left_out":31}
{"sheet":"Main_1","index":4,"n_rows":50,"n_cols":9,"rows_kept":50,"cut":false,"hidden":false,"merged":[[43,1,43,8],[44,1,44,8],[48,1,48,8],[49,1,49,8],[0,2,0,5],[37,1,37,8],[38,1,38,8],[39,1,39,8],[40,1,40,8],[41,1,41,8],[42,1,42,8]]}
[{"$f":"+ROW()","v":1},"Name of course",{"$f":"IFERROR(VLOOKUP($C$4,List_items!$B:$I,2,0),\"\")","v":"Main nr 1"},null,null,null,"Calc Price",null,{"$f":"+IFERROR(ROUND(I36/(1-I7)*1.25,2),\"\")","v":33.78}]
[{"$f":"+ROW()","v":2},"Restaurant",{"$f":"+List_items!$C$1","v":"BUTIK XXYY"},null,null,null,"Menu Price, fixed",null,{"$f":"+VLOOKUP($C$4,List_items!$B:$L,6,0)","v":225}]
[3,"At menu form/updated",null,{"$f":"IFERROR(VLOOKUP($C$4,List_items!$B:$I,3,0),\"\")","v":"00:00:00"},{"$f":"+VLOOKUP($C$4,List_items!$B:$I,4,0)","v":"00:00:00"},null,"Menu Price, ex VAT",null,{"$f":"IFERROR(ROUND(I2/(1+List_items!C2),0),\"\")","v":180}]
[4,"Fane_item value","Main_1",null,null,null,"Cost, 1 unit",null,{"$f":"+IFERROR(ROUND(I36/H8,2),\"\")","v":27.03}]
[5,null,null,null,null,null,"Gr Profit, act",null,{"$f":"+IFERROR(I3-I4,\"\")","v":152.97}]
[6,null,null,null,null,null,"Gr Margin, act",null,{"$f":"+IFERROR(ROUND(I5/I3,3),\"\")","v":0.85}]
[7,null,null,null,null,null,"GM, goal",null,{"$f":"+VLOOKUP($C$4,List_items!$B:$L,7,0)","v":0}]
[8,null,null,null,null,null,"Covers:",{"$f":"+VLOOKUP($C$4,List_items!$B:$L,5,0)","v":1}]
[9,"MainGroup","Ingredients","Net dish","Unit","Waste","Total use","Unit Cost","Costpris"]
[10,null,null,null,{"$f":"IFERROR(VLOOKUP(CONCATENATE($B10,$C10),'Ingredient list'!$A:$F,6,0),\"\")","v":0},null,{"$f":"IFERROR(ROUND(D10/(1-F10),3),\"\")","v":0},{"$f":"IFERROR(VLOOKUP(CONCATENATE($B10,$C10),'Ingredient list'!$A:$F,5,0),\"\")","v":0},{"$f":"IFERROR(G10*H10,\"\")","v":0}]
[11,null,null,null,{"$f":"IFERROR(VLOOKUP(CONCATENATE($B11,$C11),'Ingredient list'!$A:$F,6,0),\"\")","v":0},null,{"$f":"IFERROR(ROUND(D11/(1-F11),3),\"\")","v":0},{"$f":"IFERROR(VLOOKUP(CONCATENATE($B11,$C11),'Ingredient list'!$A:$F,5,0),\"\")","v":0},{"$f":"IFERROR(G11*H11,\"\")","v":0}]
[12,"Grocery_DryGoods","Linguini",0.3,{"$f":"IFERROR(VLOOKUP(CONCATENATE($B12,$C12),'Ingredient list'!$A:$F,6,0),\"\")","v":"kg"},0.2,0.375,{"$f":"IFERROR(VLOOKUP(CONCATENATE($B12,$C12),'Ingredient list'!$A:$F,5,0),\"\")","v":25},9.375]
[13,null,null,null,{"$f":"IFERROR(VLOOKUP(CONCATENATE($B13,$C13),'Ingredient list'!$A:$F,6,0),\"\")","v":0},null,0,{"$f":"IFERROR(VLOOKUP(CONCATENATE($B13,$C13),'Ingredient list'!$A:$F,5,0),\"\")","v":0},0]
[14,null,null,null,{"$f":"IFERROR(VLOOKUP(CONCATENATE($B14,$C14),'Ingredient list'!$A:$F,6,0),\"\")","v":0},null,0,{"$f":"IFERROR(VLOOKUP(CONCATENATE($B14,$C14),'Ingredient list'!$A:$F,5,0),\"\")","v":0},0]
[15,null,null,null,{"$f":"IFERROR(VLOOKUP(CONCATENATE($B15,$C15),'Ingredient list'!$A:$F,6,0),\"\")","v":0},null,0,{"$f":"IFERROR(VLOOKUP(CONCATENATE($B15,$C15),'Ingredient list'!$A:$F,5,0),\"\")","v":0},0]
[16,null,null,null,{"$f":"IFERROR(VLOOKUP(CONCATENATE($B16,$C16),'Ingredient list'!$A:$F,6,0),\"\")","v":0},null,0,{"$f":"IFERROR(VLOOKUP(CONCATENATE($B16,$C16),'Ingredient list'!$A:$F,5,0),\"\")","v":0},0]
[17,null,null,null,{"$f":"IFERROR(VLOOKUP(CONCATENATE($B17,$C17),'Ingredient list'!$A:$F,6,0),\"\")","v":0},null,0,{"$f":"IFERROR(VLOOKUP(CONCATENATE($B17,$C17),'Ingredient list'!$A:$F,5,0),\"\")","v":0},0]
[18,null,null,null,{"$f":"IFERROR(VLOOKUP(CONCATENATE($B18,$C18),'Ingredient list'!$A:$F,6,0),\"\")","v":0},null,0,{"$f":"IFERROR(VLOOKUP(CONCATENATE($B18,$C18),'Ingredient list'!$A:$F,5,0),\"\")","v":0},0]
[19,null,null,null,{"$f":"IFERROR(VLOOKUP(CONCATENATE($B19,$C19),'Ingredient list'!$A:$F,6,0),\"\")","v":0},null,0,{"$f":"IFERROR(VLOOKUP(CONCATENATE($B19,$C19),'Ingredient list'!$A:$F,5,0),\"\")","v":0},0]
[20,"Dairy_milk","Sødmælk",1.5,{"$f":"IFERROR(VLOOKUP(CONCATENATE($B20,$C20),'Ingredient list'!$A:$F,6,0),\"\")","v":"ltr"},0.15,1.7649999999999999,{"$f":"IFERROR(VLOOKUP(CONCATENATE($B20,$C20),'Ingredient list'!$A:$F,5,0),\"\")","v":10},17.649999999999999]
{"$rows_left_out":31}
{"sheet":"Main_2","index":5,"n_rows":50,"n_cols":9,"rows_kept":50,"cut":false,"hidden":false,"merged":[[43,1,43,8],[44,1,44,8],[48,1,48,8],[49,1,49,8],[0,2,0,5],[37,1,37,8],[38,1,38,8],[39,1,39,8],[40,1,40,8],[41,1,41,8],[42,1,42,8]]}
[{"$f":"+ROW()","v":1},"Name of course",{"$f":"IFERROR(VLOOKUP($C$4,List_items!$B:$I,2,0),\"\")","v":"Main nr 2"},null,null,null,"Calc Price",null,{"$f":"+IFERROR(ROUND(I36/(1-I7)*1.25,2),\"\")","v":36.72}]
[{"$f":"+ROW()","v":2},"Restaurant",{"$f":"+List_items!$C$1","v":"BUTIK XXYY"},null,null,null,"Menu Price, fixed",null,{"$f":"+VLOOKUP($C$4,List_items!$B:$L,6,0)","v":295}]
[3,"At menu form/updated",null,{"$f":"IFERROR(VLOOKUP($C$4,List_items!$B:$I,3,0),\"\")","v":"00:00:00"},{"$f":"+VLOOKUP($C$4,List_items!$B:$I,4,0)","v":"00:00:00"},null,"Menu Price, ex VAT",null,{"$f":"IFERROR(ROUND(I2/(1+List_items!C2),0),\"\")","v":236}]
[4,"Fane_item value","Main_2",null,null,null,"Cost, 1 unit",null,{"$f":"+IFERROR(ROUND(I36/H8,2),\"\")","v":29.38}]
[5,null,null,null,null,null,"Gr Profit, act",null,{"$f":"+IFERROR(I3-I4,\"\")","v":206.62}]
[6,null,null,null,null,null,"Gr Margin, act",null,{"$f":"+IFERROR(ROUND(I5/I3,3),\"\")","v":0.876}]
[7,null,null,null,null,null,"GM, goal",null,{"$f":"+VLOOKUP($C$4,List_items!$B:$L,7,0)","v":0}]
[8,null,null,null,null,null,"Covers:",{"$f":"+VLOOKUP($C$4,List_items!$B:$L,5,0)","v":1}]
[9,"MainGroup","Ingredients","Net dish","Unit","Waste","Total use","Unit Cost","Costpris"]
[10,null,null,null,{"$f":"IFERROR(VLOOKUP(CONCATENATE($B10,$C10),'Ingredient list'!$A:$F,6,0),\"\")","v":0},null,{"$f":"IFERROR(ROUND(D10/(1-F10),3),\"\")","v":0},{"$f":"IFERROR(VLOOKUP(CONCATENATE($B10,$C10),'Ingredient list'!$A:$F,5,0),\"\")","v":0},{"$f":"IFERROR(G10*H10,\"\")","v":0}]
[11,null,null,null,{"$f":"IFERROR(VLOOKUP(CONCATENATE($B11,$C11),'Ingredient list'!$A:$F,6,0),\"\")","v":0},null,{"$f":"IFERROR(ROUND(D11/(1-F11),3),\"\")","v":0},{"$f":"IFERROR(VLOOKUP(CONCATENATE($B11,$C11),'Ingredient list'!$A:$F,5,0),\"\")","v":0},{"$f":"IFERROR(G11*H11,\"\")","v":0}]
[12,"Grocery_DryGoods","Div Pasta",0.3,{"$f":"IFERROR(VLOOKUP(CONCATENATE($B12,$C12),'Ingredient list'!$A:$F,6,0),\"\")","v":"kg"},0.2,0.375,{"$f":"IFERROR(VLOOKUP(CONCATENATE($B12,$C12),'Ingredient list'!$A:$F,5,0),\"\")","v":25},9.375]
[13,null,null,null,{"$f":"IFERROR(VLOOKUP(CONCATENATE($B13,$C13),'Ingredient list'!$A:$F,6,0),\"\")","v":0},null,0,{"$f":"IFERROR(VLOOKUP(CONCATENATE($B13,$C13),'Ingredient list'!$A:$F,5,0),\"\")","v":0},0]
[14,null,null,null,{"$f":"IFERROR(VLOOKUP(CONCATENATE($B14,$C14),'Ingredient list'!$A:$F,6,0),\"\")","v":0},null,0,{"$f":"IFERROR(VLOOKUP(CONCATENATE($B14,$C14),'Ingredient list'!$A:$F,5,0),\"\")","v":0},0]
[15,null,null,null,{"$f":"IFERROR(VLOOKUP(CONCATENATE($B15,$C15),'Ingredient list'!$A:$F,6,0),\"\")","v":0},null,0,{"$f":"IFERROR(VLOOKUP(CONCATENATE($B15,$C15),'Ingredient list'!$A:$F,5,0),\"\")","v":0},0]
[16,null,null,null,{"$f":"IFERROR(VLOOKUP(CONCATENATE($B16,$C16),'Ingredient list'!$A:$F,6,0),\"\")","v":0},null,0,{"$f":"IFERROR(VLOOKUP(CONCATENATE($B16,$C16),'Ingredient list'!$A:$F,5,0),\"\")","v":0},0]
[17,null,null,null,{"$f":"IFERROR(VLOOKUP(CONCATENATE($B17,$C17),'Ingredient list'!$A:$F,6,0),\"\")","v":0},null,0,{"$f":"IFERROR(VLOOKUP(CONCATENATE($B17,$C17),'Ingredient list'!$A:$F,5,0),\"\")","v":0},0]
[18,null,null,null,{"$f":"IFERROR(VLOOKUP(CONCATENATE($B18,$C18),'Ingredient list'!$A:$F,6,0),\"\")","v":0},null,0,{"$f":"IFERROR(VLOOKUP(CONCATENATE($B18,$C18),'Ingredient list'!$A:$F,5,0),\"\")","v":0},0]
[19,null,null,null,{"$f":"IFERROR(VLOOKUP(CONCATENATE($B19,$C19),'Ingredient list'!$A:$F,6,0),\"\")","v":0},null,0,{"$f":"IFERROR(VLOOKUP(CONCATENATE($B19,$C19),'Ingredient list'!$A:$F,5,0),\"\")","v":0},0]
[20,null,null,null,{"$f":"IFERROR(VLOOKUP(CONCATENATE($B20,$C20),'Ingredient list'!$A:$F,6,0),\"\")","v":0},null,0,{"$f":"IFERROR(VLOOKUP(CONCATENATE($B20,$C20),'Ingredient list'!$A:$F,5,0),\"\")","v":0},0]
{"$rows_left_out":31}
{"sheet":"Opslag","index":6,"n_rows":12,"n_cols":2,"rows_kept":12,"cut":false,"hidden":false,"merged":[]}
["DKK",2]
["EUR",3]
["GBP",4]
[]
[]
["MainGroup"]
[]
["Dairy_butter"]
["Dairy_cheese"]
["Dairy_egg"]
["Dairy_milk"]
["Grocery_DryGoods"]