{"text_format":"1","workbook":"xlsx","n_sheets":15,"sheets":["Bogføring","Kontoplan","Regnskab GF","Medlemsliste","Afv %","Kontoplan (2)","Udgiftsbilag","T","Regnskab GF2","vejlend.","Udmeldelser","Om","Kontokort","T2","Restanceliste"],"not_rendered":{"charts":0,"images":7,"macros":1,"external_links":1,"defined_names":10,"comments":0,"pivot_tables":0},"unopened":[],"bounds":{"document_bytes":16777216,"sheet_cells":100000,"rows_first":2000,"rows_last":500,"rows_between":2000,"halvings":0,"cell_chars":16384,"cell_head_chars":4096},"cells_cut":0,"cells_raw":0,"read":"whole","date_system":"1900"}

{"sheet":"Bogføring","index":0,"n_rows":2636,"n_cols":11,"rows_kept":2636,"cut":false,"hidden":false,"merged":[]}
[]
[]
[null,null,12310,"Bankbeholdning",{"$f":"SUMIFS(Bogføring!$H:$H,Bogføring!$B:$B,\">=\"&T!$C$4,Bogføring!$B:$B,\"<=\"&T!$C$5,Bogføring!$G:$G,C3)-SUMIFS(Bogføring!$I:$I,Bogføring!$B:$B,\">=\"&T!$C$4,Bogføring!$B:$B,\"<=\"&T!$C$5,Bogføring!$G:$G,C3)","v":21291.5}]
[null,null,12320,"Kassebeholdning",{"$f":"SUMIFS(Bogføring!$H:$H,Bogføring!$B:$B,\">=\"&T!$C$4,Bogføring!$B:$B,\"<=\"&T!$C$5,Bogføring!$G:$G,C4)-SUMIFS(Bogføring!$I:$I,Bogføring!$B:$B,\">=\"&T!$C$4,Bogføring!$B:$B,\"<=\"&T!$C$5,Bogføring!$G:$G,C4)","v":4736},null,null,null,null,null,{"$f":"T!C7&\" / Bjarne Hansen\"","v":"version 1.00.009.047 / Bjarne Hansen"}]
[null,"Dato","Bilag","Tekst","Medl. Nr.","Årstal","Konto","Debet","Kredit",{"$f":"IF(SUM(I:I)-SUM(H:H)=0,\"Kontobeskrivelse\",\"Difference: \"&SUM(I:I)-SUM(H:H))","v":"Kontobeskrivelse"},"Kommentarer"]
[{"$f":"IF(B6>=T!C$4,IF(B6<=T!C$5,Bogføring!G6,\"\"),\"\")","v":""},"2021-01-01",null,"Åbningsbalance, Overført Saldi",null,null,12310,63030.82,null,{"$f":"IF(G6=\"\",\"\",IF(ISERROR(VLOOKUP(G6,Kontoplan!A:D,2,0)),\"Konto findes ikke!\",VLOOKUP(G6,Kontoplan!A:D,2,0)))","v":"Bank konto"}]
[{"$f":"IF(B7>=T!C$4,IF(B7<=T!C$5,Bogføring!G7,\"\"),\"\")","v":""},"2021-01-01",null,"Åbningsbalance, Overført Saldi",null,null,12320,2118,null,{"$f":"IF(G7=\"\",\"\",IF(ISERROR(VLOOKUP(G7,Kontoplan!A:D,2,0)),\"Konto findes ikke!\",VLOOKUP(G7,Kontoplan!A:D,2,0)))","v":"Kasse"}]
[{"$f":"IF(B8>=T!C$4,IF(B8<=T!C$5,Bogføring!G8,\"\"),\"\")","v":""},"2021-01-01",null,"Åbningsbalance, Overført Saldi",null,null,12330,null,65148.82,{"$f":"IF(G8=\"\",\"\",IF(ISERROR(VLOOKUP(G8,Kontoplan!A:D,2,0)),\"Konto findes ikke!\",VLOOKUP(G8,Kontoplan!A:D,2,0)))","v":"Egenkapital"}]
[{"$f":"IF(B9>=T!C$4,IF(B9<=T!C$5,Bogføring!G9,\"\"),\"\")","v":""},"2021-01-04",1,null,null,null,12310,null,377.75,{"$f":"IF(G9=\"\",\"\",IF(ISERROR(VLOOKUP(G9,Kontoplan!A:D,2,0)),\"Konto findes ikke!\",VLOOKUP(G9,Kontoplan!A:D,2,0)))","v":"Bank konto"}]
[{"$f":"IF(B10>=T!C$4,IF(B10<=T!C$5,Bogføring!G10,\"\"),\"\")","v":""},"2021-01-04",1,null,null,null,2060,377.75,null,{"$f":"IF(G10=\"\",\"\",IF(ISERROR(VLOOKUP(G10,Kontoplan!A:D,2,0)),\"Konto findes ikke!\",VLOOKUP(G10,Kontoplan!A:D,2,0)))","v":"Internet, mobiltelefon, Forsik."}]
[{"$f":"IF(B11>=T!C$4,IF(B11<=T!C$5,Bogføring!G11,\"\"),\"\")","v":""},"2021-01-04",2,null,null,null,12310,null,165.23,{"$f":"IF(G11=\"\",\"\",IF(ISERROR(VLOOKUP(G11,Kontoplan!A:D,2,0)),\"Konto findes ikke!\",VLOOKUP(G11,Kontoplan!A:D,2,0)))","v":"Bank konto"}]
[{"$f":"IF(B12>=T!C$4,IF(B12<=T!C$5,Bogføring!G12,\"\"),\"\")","v":""},"2021-01-04",2,null,null,null,2000,165.23,null,{"$f":"IF(G12=\"\",\"\",IF(ISERROR(VLOOKUP(G12,Kontoplan!A:D,2,0)),\"Konto findes ikke!\",VLOOKUP(G12,Kontoplan!A:D,2,0)))","v":"Bankgebyr"}]
[{"$f":"IF(B13>=T!C$4,IF(B13<=T!C$5,Bogføring!G13,\"\"),\"\")","v":""},"2021-01-05",3,null,null,null,12310,72498,null,{"$f":"IF(G13=\"\",\"\",IF(ISERROR(VLOOKUP(G13,Kontoplan!A:D,2,0)),\"Konto findes ikke!\",VLOOKUP(G13,Kontoplan!A:D,2,0)))","v":"Bank konto"}]
[{"$f":"IF(B14>=T!C$4,IF(B14<=T!C$5,Bogføring!G14,\"\"),\"\")","v":""},"2021-01-05",3,null,null,null,1020,null,72498,{"$f":"IF(G14=\"\",\"\",IF(ISERROR(VLOOKUP(G14,Kontoplan!A:D,2,0)),\"Konto findes ikke!\",VLOOKUP(G14,Kontoplan!A:D,2,0)))","v":"Tilskud fra BRK/ drifttilskud"}]
[{"$f":"IF(B15>=T!C$4,IF(B15<=T!C$5,Bogføring!G15,\"\"),\"\")","v":""},"2021-01-05",4,null,null,null,12310,null,2256.25,{"$f":"IF(G15=\"\",\"\",IF(ISERROR(VLOOKUP(G15,Kontoplan!A:D,2,0)),\"Konto findes ikke!\",VLOOKUP(G15,Kontoplan!A:D,2,0)))","v":"Bank konto"}]
[{"$f":"IF(B16>=T!C$4,IF(B16<=T!C$5,Bogføring!G16,\"\"),\"\")","v":""},"2021-01-05",4,null,null,null,2030,2256.25,null,{"$f":"IF(G16=\"\",\"\",IF(ISERROR(VLOOKUP(G16,Kontoplan!A:D,2,0)),\"Konto findes ikke!\",VLOOKUP(G16,Kontoplan!A:D,2,0)))","v":"Bygnings vedligehold"}]
[{"$f":"IF(B17>=T!C$4,IF(B17<=T!C$5,Bogføring!G17,\"\"),\"\")","v":""},"2021-01-05",5,null,null,null,12310,null,1205,{"$f":"IF(G17=\"\",\"\",IF(ISERROR(VLOOKUP(G17,Kontoplan!A:D,2,0)),\"Konto findes ikke!\",VLOOKUP(G17,Kontoplan!A:D,2,0)))","v":"Bank konto"}]
[{"$f":"IF(B18>=T!C$4,IF(B18<=T!C$5,Bogføring!G18,\"\"),\"\")","v":""},"2021-01-05",5,null,null,null,2030,1205,null,{"$f":"IF(G18=\"\",\"\",IF(ISERROR(VLOOKUP(G18,Kontoplan!A:D,2,0)),\"Konto findes ikke!\",VLOOKUP(G18,Kontoplan!A:D,2,0)))","v":"Bygnings vedligehold"}]
[{"$f":"IF(B19>=T!C$4,IF(B19<=T!C$5,Bogføring!G19,\"\"),\"\")","v":""},"2021-01-08",6,null,null,null,12310,null,943.31,{"$f":"IF(G19=\"\",\"\",IF(ISERROR(VLOOKUP(G19,Kontoplan!A:D,2,0)),\"Konto findes ikke!\",VLOOKUP(G19,Kontoplan!A:D,2,0)))","v":"Bank konto"}]
[{"$f":"IF(B20>=T!C$4,IF(B20<=T!C$5,Bogføring!G20,\"\"),\"\")","v":""},"2021-01-08",6,null,null,null,2165,943.31,null,{"$f":"IF(G20=\"\",\"\",IF(ISERROR(VLOOKUP(G20,Kontoplan!A:D,2,0)),\"Konto findes ikke!\",VLOOKUP(G20,Kontoplan!A:D,2,0)))","v":"G4S tyverialarm"}]
[{"$f":"IF(B21>=T!C$4,IF(B21<=T!C$5,Bogføring!G21,\"\"),\"\")","v":""},"2021-01-08",7,null,null,null,12310,null,109.68,{"$f":"IF(G21=\"\",\"\",IF(ISERROR(VLOOKUP(G21,Kontoplan!A:D,2,0)),\"Konto findes ikke!\",VLOOKUP(G21,Kontoplan!A:D,2,0)))","v":"Bank konto"}]
[{"$f":"IF(B22>=T!C$4,IF(B22<=T!C$5,Bogføring!G22,\"\"),\"\")","v":""},"2021-01-08",7,null,null,null,2110,109.68,null,{"$f":"IF(G22=\"\",\"\",IF(ISERROR(VLOOKUP(G22,Kontoplan!A:D,2,0)),\"Konto findes ikke!\",VLOOKUP(G22,Kontoplan!A:D,2,0)))","v":"Kontorhold - Porto - IT"}]
[{"$f":"IF(B23>=T!C$4,IF(B23<=T!C$5,Bogføring!G23,\"\"),\"\")","v":""},"2021-01-19",8,null,null,null,12310,5469.35,null,{"$f":"IF(G23=\"\",\"\",IF(ISERROR(VLOOKUP(G23,Kontoplan!A:D,2,0)),\"Konto findes ikke!\",VLOOKUP(G23,Kontoplan!A:D,2,0)))","v":"Bank konto"}]
[{"$f":"IF(B24>=T!C$4,IF(B24<=T!C$5,Bogføring!G24,\"\"),\"\")","v":""},"2021-01-19",8,null,null,null,1115,null,5469.35,{"$f":"IF(G24=\"\",\"\",IF(ISERROR(VLOOKUP(G24,Kontoplan!A:D,2,0)),\"Konto findes ikke!\",VLOOKUP(G24,Kontoplan!A:D,2,0)))","v":"Løn Retur fra visma"}]
[{"$f":"IF(B25>=T!C$4,IF(B25<=T!C$5,Bogføring!G25,\"\"),\"\")","v":""},"2021-01-20",9,null,null,null,12310,null,1832.75,{"$f":"IF(G25=\"\",\"\",IF(ISERROR(VLOOKUP(G25,Kontoplan!A:D,2,0)),\"Konto findes ikke!\",VLOOKUP(G25,Kontoplan!A:D,2,0)))","v":"Bank konto"}]
[{"$f":"IF(B26>=T!C$4,IF(B26<=T!C$5,Bogføring!G26,\"\"),\"\")","v":""},"2021-01-20",9,null,null,null,3120,1832.75,null,{"$f":"IF(G26=\"\",\"\",IF(ISERROR(VLOOKUP(G26,Kontoplan!A:D,2,0)),\"Konto findes ikke!\",VLOOKUP(G26,Kontoplan!A:D,2,0)))","v":"ATP"}]
[{"$f":"IF(B27>=T!C$4,IF(B27<=T!C$5,Bogføring!G27,\"\"),\"\")","v":""},"2021-01-25",10,null,null,null,12310,null,3170,{"$f":"IF(G27=\"\",\"\",IF(ISERROR(VLOOKUP(G27,Kontoplan!A:D,2,0)),\"Konto findes ikke!\",VLOOKUP(G27,Kontoplan!A:D,2,0)))","v":"Bank konto"}]
[{"$f":"IF(B28>=T!C$4,IF(B28<=T!C$5,Bogføring!G28,\"\"),\"\")","v":""},"2021-01-25",10,null,null,null,2190,3170,null,{"$f":"IF(G28=\"\",\"\",IF(ISERROR(VLOOKUP(G28,Kontoplan!A:D,2,0)),\"Konto findes ikke!\",VLOOKUP(G28,Kontoplan!A:D,2,0)))","v":"Diverse Udgifter"}]
[{"$f":"IF(B29>=T!C$4,IF(B29<=T!C$5,Bogføring!G29,\"\"),\"\")","v":""},"2021-01-29",11,null,null,null,12310,null,4477,{"$f":"IF(G29=\"\",\"\",IF(ISERROR(VLOOKUP(G29,Kontoplan!A:D,2,0)),\"Konto findes ikke!\",VLOOKUP(G29,Kontoplan!A:D,2,0)))","v":"Bank konto"}]
[{"$f":"IF(B30>=T!C$4,IF(B30<=T!C$5,Bogføring!G30,\"\"),\"\")","v":""},"2021-01-29",11,null,null,null,3110,4477,null,{"$f":"IF(G30=\"\",\"\",IF(ISERROR(VLOOKUP(G30,Kontoplan!A:D,2,0)),\"Konto findes ikke!\",VLOOKUP(G30,Kontoplan!A:D,2,0)))","v":"Lønninger incl ATP -AM"},"skulle være trukket på skyldig skat"]
[{"$f":"IF(B31>=T!C$4,IF(B31<=T!C$5,Bogføring!G31,\"\"),\"\")","v":""},"2021-01-29",12,null,null,null,12310,null,1.5,{"$f":"IF(G31=\"\",\"\",IF(ISERROR(VLOOKUP(G31,Kontoplan!A:D,2,0)),\"Konto findes ikke!\",VLOOKUP(G31,Kontoplan!A:D,2,0)))","v":"Bank konto"}]
[{"$f":"IF(B32>=T!C$4,IF(B32<=T!C$5,Bogføring!G32,\"\"),\"\")","v":""},"2021-01-29",12,null,null,null,2000,1.5,null,{"$f":"IF(G32=\"\",\"\",IF(ISERROR(VLOOKUP(G32,Kontoplan!A:D,2,0)),\"Konto findes ikke!\",VLOOKUP(G32,Kontoplan!A:D,2,0)))","v":"Bankgebyr"}]
[{"$f":"IF(B33>=T!C$4,IF(B33<=T!C$5,Bogføring!G33,\"\"),\"\")","v":""},"2021-02-01",13,null,null,null,12310,null,192.5,{"$f":"IF(G33=\"\",\"\",IF(ISERROR(VLOOKUP(G33,Kontoplan!A:D,2,0)),\"Konto findes ikke!\",VLOOKUP(G33,Kontoplan!A:D,2,0)))","v":"Bank konto"}]
[{"$f":"IF(B34>=T!C$4,IF(B34<=T!C$5,Bogføring!G34,\"\"),\"\")","v":""},"2021-02-01",13,null,null,null,2010,192.5,null,{"$f":"IF(G34=\"\",\"\",IF(ISERROR(VLOOKUP(G34,Kontoplan!A:D,2,0)),\"Konto findes ikke!\",VLOOKUP(G34,Kontoplan!A:D,2,0)))","v":"Danløn"}]
[{"$f":"IF(B35>=T!C$4,IF(B35<=T!C$5,Bogføring!G35,\"\"),\"\")","v":""},"2021-02-01",14,null,null,null,12310,null,3316.9,{"$f":"IF(G35=\"\",\"\",IF(ISERROR(VLOOKUP(G35,Kontoplan!A:D,2,0)),\"Konto findes ikke!\",VLOOKUP(G35,Kontoplan!A:D,2,0)))","v":"Bank konto"}]
[{"$f":"IF(B36>=T!C$4,IF(B36<=T!C$5,Bogføring!G36,\"\"),\"\")","v":""},"2021-02-01",14,null,null,null,2040,3316.9,null,{"$f":"IF(G36=\"\",\"\",IF(ISERROR(VLOOKUP(G36,Kontoplan!A:D,2,0)),\"Konto findes ikke!\",VLOOKUP(G36,Kontoplan!A:D,2,0)))","v":"El, Vand og Varme"}]
[{"$f":"IF(B37>=T!C$4,IF(B37<=T!C$5,Bogføring!G37,\"\"),\"\")","v":""},"2021-02-01",15,null,null,null,12310,null,2064.17,{"$f":"IF(G37=\"\",\"\",IF(ISERROR(VLOOKUP(G37,Kontoplan!A:D,2,0)),\"Konto findes ikke!\",VLOOKUP(G37,Kontoplan!A:D,2,0)))","v":"Bank konto"}]
[{"$f":"IF(B38>=T!C$4,IF(B38<=T!C$5,Bogføring!G38,\"\"),\"\")","v":""},"2021-02-01",15,null,null,null,2040,2064.17,null,{"$f":"IF(G38=\"\",\"\",IF(ISERROR(VLOOKUP(G38,Kontoplan!A:D,2,0)),\"Konto findes ikke!\",VLOOKUP(G38,Kontoplan!A:D,2,0)))","v":"El, Vand og Varme"}]
[{"$f":"IF(B39>=T!C$4,IF(B39<=T!C$5,Bogføring!G39,\"\"),\"\")","v":""},"2021-02-01",16,null,null,null,12310,null,377.75,{"$f":"IF(G39=\"\",\"\",IF(ISERROR(VLOOKUP(G39,Kontoplan!A:D,2,0)),\"Konto findes ikke!\",VLOOKUP(G39,Kontoplan!A:D,2,0)))","v":"Bank konto"}]
[{"$f":"IF(B40>=T!C$4,IF(B40<=T!C$5,Bogføring!G40,\"\"),\"\")","v":""},"2021-02-01",16,null,null,null,2060,377.75,null,{"$f":"IF(G40=\"\",\"\",IF(ISERROR(VLOOKUP(G40,Kontoplan!A:D,2,0)),\"Konto findes ikke!\",VLOOKUP(G40,Kontoplan!A:D,2,0)))","v":"Internet, mobiltelefon, Forsik."}]
[{"$f":"IF(B41>=T!C$4,IF(B41<=T!C$5,Bogføring!G41,\"\"),\"\")","v":""},"2021-02-08",17,null,null,null,12310,null,6000,{"$f":"IF(G41=\"\",\"\",IF(ISERROR(VLOOKUP(G41,Kontoplan!A:D,2,0)),\"Konto findes ikke!\",VLOOKUP(G41,Kontoplan!A:D,2,0)))","v":"Bank konto"}]
[{"$f":"IF(B42>=T!C$4,IF(B42<=T!C$5,Bogføring!G42,\"\"),\"\")","v":""},"2021-02-08",17,null,null,null,2030,6000,null,{"$f":"IF(G42=\"\",\"\",IF(ISERROR(VLOOKUP(G42,Kontoplan!A:D,2,0)),\"Konto findes ikke!\",VLOOKUP(G42,Kontoplan!A:D,2,0)))","v":"Bygnings vedligehold"}]
[{"$f":"IF(B43>=T!C$4,IF(B43<=T!C$5,Bogføring!G43,\"\"),\"\")","v":""},"2021-02-08",18,null,null,null,12310,null,284,{"$f":"IF(G43=\"\",\"\",IF(ISERROR(VLOOKUP(G43,Kontoplan!A:D,2,0)),\"Konto findes ikke!\",VLOOKUP(G43,Kontoplan!A:D,2,0)))","v":"Bank konto"}]
[{"$f":"IF(B44>=T!C$4,IF(B44<=T!C$5,Bogføring!G44,\"\"),\"\")","v":""},"2021-02-08",18,null,null,null,3110,284,null,{"$f":"IF(G44=\"\",\"\",IF(ISERROR(VLOOKUP(G44,Kontoplan!A:D,2,0)),\"Konto findes ikke!\",VLOOKUP(G44,Kontoplan!A:D,2,0)))","v":"Lønninger incl ATP -AM"}]
[{"$f":"IF(B45>=T!C$4,IF(B45<=T!C$5,Bogføring!G45,\"\"),\"\")","v":""},"2021-02-24",19,null,null,null,12310,null,947.14,{"$f":"IF(G45=\"\",\"\",IF(ISERROR(VLOOKUP(G45,Kontoplan!A:D,2,0)),\"Konto findes ikke!\",VLOOKUP(G45,Kontoplan!A:D,2,0)))","v":"Bank konto"}]
[{"$f":"IF(B46>=T!C$4,IF(B46<=T!C$5,Bogføring!G46,\"\"),\"\")","v":""},"2021-02-24",19,null,null,null,2120,947.14,null,{"$f":"IF(G46=\"\",\"\",IF(ISERROR(VLOOKUP(G46,Kontoplan!A:D,2,0)),\"Konto findes ikke!\",VLOOKUP(G46,Kontoplan!A:D,2,0)))","v":"Hjemmeside"}]
[{"$f":"IF(B47>=T!C$4,IF(B47<=T!C$5,Bogføring!G47,\"\"),\"\")","v":""},"2021-03-01",20,null,null,null,12310,null,1,{"$f":"IF(G47=\"\",\"\",IF(ISERROR(VLOOKUP(G47,Kontoplan!A:D,2,0)),\"Konto findes ikke!\",VLOOKUP(G47,Kontoplan!A:D,2,0)))","v":"Bank konto"}]
[{"$f":"IF(B48>=T!C$4,IF(B48<=T!C$5,Bogføring!G48,\"\"),\"\")","v":""},"2021-03-01",20,null,null,null,2000,1,null,{"$f":"IF(G48=\"\",\"\",IF(ISERROR(VLOOKUP(G48,Kontoplan!A:D,2,0)),\"Konto findes ikke!\",VLOOKUP(G48,Kontoplan!A:D,2,0)))","v":"Bankgebyr"}]
[{"$f":"IF(B49>=T!C$4,IF(B49<=T!C$5,Bogføring!G49,\"\"),\"\")","v":""},"2021-03-01",21,null,null,null,12310,null,456.05,{"$f":"IF(G49=\"\",\"\",IF(ISERROR(VLOOKUP(G49,Kontoplan!A:D,2,0)),\"Konto findes ikke!\",VLOOKUP(G49,Kontoplan!A:D,2,0)))","v":"Bank konto"}]
[{"$f":"IF(B50>=T!C$4,IF(B50<=T!C$5,Bogføring!G50,\"\"),\"\")","v":""},"2021-03-01",21,null,null,null,2060,456.05,null,{"$f":"IF(G50=\"\",\"\",IF(ISERROR(VLOOKUP(G50,Kontoplan!A:D,2,0)),\"Konto findes ikke!\",VLOOKUP(G50,Kontoplan!A:D,2,0)))","v":"Internet, mobiltelefon, Forsik."}]
[{"$f":"IF(B51>=T!C$4,IF(B51<=T!C$5,Bogføring!G51,\"\"),\"\")","v":""},"2021-03-01",22,null,null,null,12310,null,192.5,{"$f":"IF(G51=\"\",\"\",IF(ISERROR(VLOOKUP(G51,Kontoplan!A:D,2,0)),\"Konto findes ikke!\",VLOOKUP(G51,Kontoplan!A:D,2,0)))","v":"Bank konto"}]
[{"$f":"IF(B52>=T!C$4,IF(B52<=T!C$5,Bogføring!G52,\"\"),\"\")","v":""},"2021-03-01",22,null,null,null,2010,192.5,null,{"$f":"IF(G52=\"\",\"\",IF(ISERROR(VLOOKUP(G52,Kontoplan!A:D,2,0)),\"Konto findes ikke!\",VLOOKUP(G52,Kontoplan!A:D,2,0)))","v":"Danløn"}]
[{"$f":"IF(B53>=T!C$4,IF(B53<=T!C$5,Bogføring!G53,\"\"),\"\")","v":""},"2021-03-03",23,null,null,null,12310,null,104.39,{"$f":"IF(G53=\"\",\"\",IF(ISERROR(VLOOKUP(G53,Kontoplan!A:D,2,0)),\"Konto findes ikke!\",VLOOKUP(G53,Kontoplan!A:D,2,0)))","v":"Bank konto"}]
[{"$f":"IF(B54>=T!C$4,IF(B54<=T!C$5,Bogføring!G54,\"\"),\"\")","v":""},"2021-03-03",23,null,null,null,2110,104.39,null,{"$f":"IF(G54=\"\",\"\",IF(ISERROR(VLOOKUP(G54,Kontoplan!A:D,2,0)),\"Konto findes ikke!\",VLOOKUP(G54,Kontoplan!A:D,2,0)))","v":"Kontorhold - Porto - IT"}]
[{"$f":"IF(B55>=T!C$4,IF(B55<=T!C$5,Bogføring!G55,\"\"),\"\")","v":""},"2021-03-05",24,null,null,null,12310,null,7316.64,{"$f":"IF(G55=\"\",\"\",IF(ISERROR(VLOOKUP(G55,Kontoplan!A:D,2,0)),\"Konto findes ikke!\",VLOOKUP(G55,Kontoplan!A:D,2,0)))","v":"Bank konto"}]
[{"$f":"IF(B56>=T!C$4,IF(B56<=T!C$5,Bogføring!G56,\"\"),\"\")","v":""},"2021-03-05",24,null,null,null,2060,7316.64,null,{"$f":"IF(G56=\"\",\"\",IF(ISERROR(VLOOKUP(G56,Kontoplan!A:D,2,0)),\"Konto findes ikke!\",VLOOKUP(G56,Kontoplan!A:D,2,0)))","v":"Internet, mobiltelefon, Forsik."}]
[{"$f":"IF(B57>=T!C$4,IF(B57<=T!C$5,Bogføring!G57,\"\"),\"\")","v":""},"2021-03-08",25,null,null,null,12310,null,12500,{"$f":"IF(G57=\"\",\"\",IF(ISERROR(VLOOKUP(G57,Kontoplan!A:D,2,0)),\"Konto findes ikke!\",VLOOKUP(G57,Kontoplan!A:D,2,0)))","v":"Bank konto"}]
[{"$f":"IF(B58>=T!C$4,IF(B58<=T!C$5,Bogføring!G58,\"\"),\"\")","v":""},"2021-03-08",25,null,null,null,2020,12500,null,{"$f":"IF(G58=\"\",\"\",IF(ISERROR(VLOOKUP(G58,Kontoplan!A:D,2,0)),\"Konto findes ikke!\",VLOOKUP(G58,Kontoplan!A:D,2,0)))","v":"Revision"}]
[{"$f":"IF(B59>=T!C$4,IF(B59<=T!C$5,Bogføring!G59,\"\"),\"\")","v":""},"2021-03-10",26,null,null,null,12310,null,514.25,{"$f":"IF(G59=\"\",\"\",IF(ISERROR(VLOOKUP(G59,Kontoplan!A:D,2,0)),\"Konto findes ikke!\",VLOOKUP(G59,Kontoplan!A:D,2,0)))","v":"Bank konto"}]
[{"$f":"IF(B60>=T!C$4,IF(B60<=T!C$5,Bogføring!G60,\"\"),\"\")","v":""},"2021-03-10",26,null,null,null,2040,514.25,null,{"$f":"IF(G60=\"\",\"\",IF(ISERROR(VLOOKUP(G60,Kontoplan!A:D,2,0)),\"Konto findes ikke!\",VLOOKUP(G60,Kontoplan!A:D,2,0)))","v":"El, Vand og Varme"}]
[{"$f":"IF(B61>=T!C$4,IF(B61<=T!C$5,Bogføring!G61,\"\"),\"\")","v":""},"2021-03-11",27,null,null,null,12310,null,550,{"$f":"IF(G61=\"\",\"\",IF(ISERROR(VLOOKUP(G61,Kontoplan!A:D,2,0)),\"Konto findes ikke!\",VLOOKUP(G61,Kontoplan!A:D,2,0)))","v":"Bank konto"}]
[{"$f":"IF(B62>=T!C$4,IF(B62<=T!C$5,Bogføring!G62,\"\"),\"\")","v":""},"2021-03-11",27,null,null,null,2090,550,null,{"$f":"IF(G62=\"\",\"\",IF(ISERROR(VLOOKUP(G62,Kontoplan!A:D,2,0)),\"Konto findes ikke!\",VLOOKUP(G62,Kontoplan!A:D,2,0)))","v":"Kontingent til andre Foreninger"}]
[{"$f":"IF(B63>=T!C$4,IF(B63<=T!C$5,Bogføring!G63,\"\"),\"\")","v":""},"2021-03-12",28,null,null,null,12310,10000,null,{"$f":"IF(G63=\"\",\"\",IF(ISERROR(VLOOKUP(G63,Kontoplan!A:D,2,0)),\"Konto findes ikke!\",VLOOKUP(G63,Kontoplan!A:D,2,0)))","v":"Bank konto"}]
[{"$f":"IF(B64>=T!C$4,IF(B64<=T!C$5,Bogføring!G64,\"\"),\"\")","v":""},"2021-03-12",28,null,null,null,1040,null,10000,{"$f":"IF(G64=\"\",\"\",IF(ISERROR(VLOOKUP(G64,Kontoplan!A:D,2,0)),\"Konto findes ikke!\",VLOOKUP(G64,Kontoplan!A:D,2,0)))","v":"Fonde/Gaver"}]
[{"$f":"IF(B65>=T!C$4,IF(B65<=T!C$5,Bogføring!G65,\"\"),\"\")","v":""},"2021-03-12",29,null,null,null,12310,null,16000,{"$f":"IF(G65=\"\",\"\",IF(ISERROR(VLOOKUP(G65,Kontoplan!A:D,2,0)),\"Konto findes ikke!\",VLOOKUP(G65,Kontoplan!A:D,2,0)))","v":"Bank konto"}]
[{"$f":"IF(B66>=T!C$4,IF(B66<=T!C$5,Bogføring!G66,\"\"),\"\")","v":""},"2021-03-12",29,null,null,null,2030,16000,null,{"$f":"IF(G66=\"\",\"\",IF(ISERROR(VLOOKUP(G66,Kontoplan!A:D,2,0)),\"Konto findes ikke!\",VLOOKUP(G66,Kontoplan!A:D,2,0)))","v":"Bygnings vedligehold"}]
[{"$f":"IF(B67>=T!C$4,IF(B67<=T!C$5,Bogføring!G67,\"\"),\"\")","v":""},"2021-03-12",30,null,null,null,12310,null,8125,{"$f":"IF(G67=\"\",\"\",IF(ISERROR(VLOOKUP(G67,Kontoplan!A:D,2,0)),\"Konto findes ikke!\",VLOOKUP(G67,Kontoplan!A:D,2,0)))","v":"Bank konto"}]
[{"$f":"IF(B68>=T!C$4,IF(B68<=T!C$5,Bogføring!G68,\"\"),\"\")","v":""},"2021-03-12",30,null,null,null,2030,8125,null,{"$f":"IF(G68=\"\",\"\",IF(ISERROR(VLOOKUP(G68,Kontoplan!A:D,2,0)),\"Konto findes ikke!\",VLOOKUP(G68,Kontoplan!A:D,2,0)))","v":"Bygnings vedligehold"}]
[{"$f":"IF(B69>=T!C$4,IF(B69<=T!C$5,Bogføring!G69,\"\"),\"\")","v":""},"2021-03-16",31,null,null,null,12310,84,null,{"$f":"IF(G69=\"\",\"\",IF(ISERROR(VLOOKUP(G69,Kontoplan!A:D,2,0)),\"Konto findes ikke!\",VLOOKUP(G69,Kontoplan!A:D,2,0)))","v":"Bank konto"}]
[{"$f":"IF(B70>=T!C$4,IF(B70<=T!C$5,Bogføring!G70,\"\"),\"\")","v":""},"2021-03-16",31,null,null,null,1080,null,84,{"$f":"IF(G70=\"\",\"\",IF(ISERROR(VLOOKUP(G70,Kontoplan!A:D,2,0)),\"Konto findes ikke!\",VLOOKUP(G70,Kontoplan!A:D,2,0)))","v":"Flaskepant retur"}]
[{"$f":"IF(B71>=T!C$4,IF(B71<=T!C$5,Bogføring!G71,\"\"),\"\")","v":""},"2021-03-23",32,null,null,null,12310,250,null,{"$f":"IF(G71=\"\",\"\",IF(ISERROR(VLOOKUP(G71,Kontoplan!A:D,2,0)),\"Konto findes ikke!\",VLOOKUP(G71,Kontoplan!A:D,2,0)))","v":"Bank konto"}]
[{"$f":"IF(B72>=T!C$4,IF(B72<=T!C$5,Bogføring!G72,\"\"),\"\")","v":""},"2021-03-23",32,null,null,null,1125,null,250,{"$f":"IF(G72=\"\",\"\",IF(ISERROR(VLOOKUP(G72,Kontoplan!A:D,2,0)),\"Konto findes ikke!\",VLOOKUP(G72,Kontoplan!A:D,2,0)))","v":"Salg af inventar"}]
[{"$f":"IF(B73>=T!C$4,IF(B73<=T!C$5,Bogføring!G73,\"\"),\"\")","v":""},"2021-03-27",33,null,null,null,12310,null,289,{"$f":"IF(G73=\"\",\"\",IF(ISERROR(VLOOKUP(G73,Kontoplan!A:D,2,0)),\"Konto findes ikke!\",VLOOKUP(G73,Kontoplan!A:D,2,0)))","v":"Bank konto"}]
[{"$f":"IF(B74>=T!C$4,IF(B74<=T!C$5,Bogføring!G74,\"\"),\"\")","v":""},"2021-03-27",33,null,null,null,2100,289,null,{"$f":"IF(G74=\"\",\"\",IF(ISERROR(VLOOKUP(G74,Kontoplan!A:D,2,0)),\"Konto findes ikke!\",VLOOKUP(G74,Kontoplan!A:D,2,0)))","v":"Forplejning til møder/Rejser"}]
[{"$f":"IF(B75>=T!C$4,IF(B75<=T!C$5,Bogføring!G75,\"\"),\"\")","v":""},"2021-03-31",34,null,null,null,12310,3350,null,{"$f":"IF(G75=\"\",\"\",IF(ISERROR(VLOOKUP(G75,Kontoplan!A:D,2,0)),\"Konto findes ikke!\",VLOOKUP(G75,Kontoplan!A:D,2,0)))","v":"Bank konto"}]
[{"$f":"IF(B76>=T!C$4,IF(B76<=T!C$5,Bogføring!G76,\"\"),\"\")","v":""},"2021-03-31",34,null,null,null,1125,null,3350,{"$f":"IF(G76=\"\",\"\",IF(ISERROR(VLOOKUP(G76,Kontoplan!A:D,2,0)),\"Konto findes ikke!\",VLOOKUP(G76,Kontoplan!A:D,2,0)))","v":"Salg af inventar"}]
[{"$f":"IF(B77>=T!C$4,IF(B77<=T!C$5,Bogføring!G77,\"\"),\"\")","v":""},"2021-03-31",35,null,null,null,12310,null,4477,{"$f":"IF(G77=\"\",\"\",IF(ISERROR(VLOOKUP(G77,Kontoplan!A:D,2,0)),\"Konto findes ikke!\",VLOOKUP(G77,Kontoplan!A:D,2,0)))","v":"Bank konto"}]
[{"$f":"IF(B78>=T!C$4,IF(B78<=T!C$5,Bogføring!G78,\"\"),\"\")","v":""},"2021-03-31",35,null,null,null,3110,4477,null,{"$f":"IF(G78=\"\",\"\",IF(ISERROR(VLOOKUP(G78,Kontoplan!A:D,2,0)),\"Konto findes ikke!\",VLOOKUP(G78,Kontoplan!A:D,2,0)))","v":"Lønninger incl ATP -AM"}]
[{"$f":"IF(B79>=T!C$4,IF(B79<=T!C$5,Bogføring!G79,\"\"),\"\")","v":""},"2021-03-31",36,null,null,null,12310,null,106,{"$f":"IF(G79=\"\",\"\",IF(ISERROR(VLOOKUP(G79,Kontoplan!A:D,2,0)),\"Konto findes ikke!\",VLOOKUP(G79,Kontoplan!A:D,2,0)))","v":"Bank konto"}]
[{"$f":"IF(B80>=T!C$4,IF(B80<=T!C$5,Bogføring!G80,\"\"),\"\")","v":""},"2021-03-31",36,null,null,null,2000,106,null,{"$f":"IF(G80=\"\",\"\",IF(ISERROR(VLOOKUP(G80,Kontoplan!A:D,2,0)),\"Konto findes ikke!\",VLOOKUP(G80,Kontoplan!A:D,2,0)))","v":"Bankgebyr"}]
[{"$f":"IF(B81>=T!C$4,IF(B81<=T!C$5,Bogføring!G81,\"\"),\"\")","v":""},"2021-04-06",37,null,null,null,12310,null,414,{"$f":"IF(G81=\"\",\"\",IF(ISERROR(VLOOKUP(G81,Kontoplan!A:D,2,0)),\"Konto findes ikke!\",VLOOKUP(G81,Kontoplan!A:D,2,0)))","v":"Bank konto"}]
[{"$f":"IF(B82>=T!C$4,IF(B82<=T!C$5,Bogføring!G82,\"\"),\"\")","v":""},"2021-04-06",37,null,null,null,2060,414,null,{"$f":"IF(G82=\"\",\"\",IF(ISERROR(VLOOKUP(G82,Kontoplan!A:D,2,0)),\"Konto findes ikke!\",VLOOKUP(G82,Kontoplan!A:D,2,0)))","v":"Internet, mobiltelefon, Forsik."}]
[{"$f":"IF(B83>=T!C$4,IF(B83<=T!C$5,Bogføring!G83,\"\"),\"\")","v":""},"2021-04-06",38,null,null,null,12310,null,7907.79,{"$f":"IF(G83=\"\",\"\",IF(ISERROR(VLOOKUP(G83,Kontoplan!A:D,2,0)),\"Konto findes ikke!\",VLOOKUP(G83,Kontoplan!A:D,2,0)))","v":"Bank konto"}]
[{"$f":"IF(B84>=T!C$4,IF(B84<=T!C$5,Bogføring!G84,\"\"),\"\")","v":""},"2021-04-06",38,null,null,null,2165,7907.79,null,{"$f":"IF(G84=\"\",\"\",IF(ISERROR(VLOOKUP(G84,Kontoplan!A:D,2,0)),\"Konto findes ikke!\",VLOOKUP(G84,Kontoplan!A:D,2,0)))","v":"G4S tyverialarm"}]
[{"$f":"IF(B85>=T!C$4,IF(B85<=T!C$5,Bogføring!G85,\"\"),\"\")","v":""},"2021-04-06",39,null,null,null,12310,null,192.5,{"$f":"IF(G85=\"\",\"\",IF(ISERROR(VLOOKUP(G85,Kontoplan!A:D,2,0)),\"Konto findes ikke!\",VLOOKUP(G85,Kontoplan!A:D,2,0)))","v":"Bank konto"}]
[{"$f":"IF(B86>=T!C$4,IF(B86<=T!C$5,Bogføring!G86,\"\"),\"\")","v":""},"2021-04-06",39,null,null,null,2010,192.5,null,{"$f":"IF(G86=\"\",\"\",IF(ISERROR(VLOOKUP(G86,Kontoplan!A:D,2,0)),\"Konto findes ikke!\",VLOOKUP(G86,Kontoplan!A:D,2,0)))","v":"Danløn"}]
[{"$f":"IF(B87>=T!C$4,IF(B87<=T!C$5,Bogføring!G87,\"\"),\"\")","v":""},"2021-04-07",40,null,null,null,12310,7907.79,null,{"$f":"IF(G87=\"\",\"\",IF(ISERROR(VLOOKUP(G87,Kontoplan!A:D,2,0)),\"Konto findes ikke!\",VLOOKUP(G87,Kontoplan!A:D,2,0)))","v":"Bank konto"}]
[{"$f":"IF(B88>=T!C$4,IF(B88<=T!C$5,Bogføring!G88,\"\"),\"\")","v":""},"2021-04-07",40,null,null,null,2165,null,7907.79,{"$f":"IF(G88=\"\",\"\",IF(ISERROR(VLOOKUP(G88,Kontoplan!A:D,2,0)),\"Konto findes ikke!\",VLOOKUP(G88,Kontoplan!A:D,2,0)))","v":"G4S tyverialarm"}]
[{"$f":"IF(B89>=T!C$4,IF(B89<=T!C$5,Bogføring!G89,\"\"),\"\")","v":""},"2021-04-08",41,null,null,null,12310,null,1337.06,{"$f":"IF(G89=\"\",\"\",IF(ISERROR(VLOOKUP(G89,Kontoplan!A:D,2,0)),\"Konto findes ikke!\",VLOOKUP(G89,Kontoplan!A:D,2,0)))","v":"Bank konto"}]
[{"$f":"IF(B90>=T!C$4,IF(B90<=T!C$5,Bogføring!G90,\"\"),\"\")","v":""},"2021-04-08",41,null,null,null,2165,1337.06,null,{"$f":"IF(G90=\"\",\"\",IF(ISERROR(VLOOKUP(G90,Kontoplan!A:D,2,0)),\"Konto findes ikke!\",VLOOKUP(G90,Kontoplan!A:D,2,0)))","v":"G4S tyverialarm"}]
[{"$f":"IF(B91>=T!C$4,IF(B91<=T!C$5,Bogføring!G91,\"\"),\"\")","v":""},"2021-04-08",42,null,null,null,12310,null,105.05,{"$f":"IF(G91=\"\",\"\",IF(ISERROR(VLOOKUP(G91,Kontoplan!A:D,2,0)),\"Konto findes ikke!\",VLOOKUP(G91,Kontoplan!A:D,2,0)))","v":"Bank konto"}]
[{"$f":"IF(B92>=T!C$4,IF(B92<=T!C$5,Bogføring!G92,\"\"),\"\")","v":""},"2021-04-08",42,null,null,null,2100,105.05,null,{"$f":"IF(G92=\"\",\"\",IF(ISERROR(VLOOKUP(G92,Kontoplan!A:D,2,0)),\"Konto findes ikke!\",VLOOKUP(G92,Kontoplan!A:D,2,0)))","v":"Forplejning til møder/Rejser"}]
[{"$f":"IF(B93>=T!C$4,IF(B93<=T!C$5,Bogføring!G93,\"\"),\"\")","v":""},"2021-04-08",43,null,null,null,12310,null,477.75,{"$f":"IF(G93=\"\",\"\",IF(ISERROR(VLOOKUP(G93,Kontoplan!A:D,2,0)),\"Konto findes ikke!\",VLOOKUP(G93,Kontoplan!A:D,2,0)))","v":"Bank konto"}]
[{"$f":"IF(B94>=T!C$4,IF(B94<=T!C$5,Bogføring!G94,\"\"),\"\")","v":""},"2021-04-08",43,null,null,null,2035,477.75,null,{"$f":"IF(G94=\"\",\"\",IF(ISERROR(VLOOKUP(G94,Kontoplan!A:D,2,0)),\"Konto findes ikke!\",VLOOKUP(G94,Kontoplan!A:D,2,0)))","v":"Grønne områder"}]
[{"$f":"IF(B95>=T!C$4,IF(B95<=T!C$5,Bogføring!G95,\"\"),\"\")","v":""},"2021-04-12",44,null,null,null,12310,null,73.13,{"$f":"IF(G95=\"\",\"\",IF(ISERROR(VLOOKUP(G95,Kontoplan!A:D,2,0)),\"Konto findes ikke!\",VLOOKUP(G95,Kontoplan!A:D,2,0)))","v":"Bank konto"}]
[{"$f":"IF(B96>=T!C$4,IF(B96<=T!C$5,Bogføring!G96,\"\"),\"\")","v":""},"2021-04-12",44,null,null,null,2190,73.13,null,{"$f":"IF(G96=\"\",\"\",IF(ISERROR(VLOOKUP(G96,Kontoplan!A:D,2,0)),\"Konto findes ikke!\",VLOOKUP(G96,Kontoplan!A:D,2,0)))","v":"Diverse Udgifter"}]
[{"$f":"IF(B97>=T!C$4,IF(B97<=T!C$5,Bogføring!G97,\"\"),\"\")","v":""},"2021-04-14",45,null,null,null,12310,30000,null,{"$f":"IF(G97=\"\",\"\",IF(ISERROR(VLOOKUP(G97,Kontoplan!A:D,2,0)),\"Konto findes ikke!\",VLOOKUP(G97,Kontoplan!A:D,2,0)))","v":"Bank konto"}]
[{"$f":"IF(B98>=T!C$4,IF(B98<=T!C$5,Bogføring!G98,\"\"),\"\")","v":""},"2021-04-14",45,null,null,null,1025,null,30000,{"$f":"IF(G98=\"\",\"\",IF(ISERROR(VLOOKUP(G98,Kontoplan!A:D,2,0)),\"Konto findes ikke!\",VLOOKUP(G98,Kontoplan!A:D,2,0)))","v":"Tilskud fra BRK "}]
[{"$f":"IF(B99>=T!C$4,IF(B99<=T!C$5,Bogføring!G99,\"\"),\"\")","v":""},"2021-04-14",46,null,null,null,12310,null,194.39,{"$f":"IF(G99=\"\",\"\",IF(ISERROR(VLOOKUP(G99,Kontoplan!A:D,2,0)),\"Konto findes ikke!\",VLOOKUP(G99,Kontoplan!A:D,2,0)))","v":"Bank konto"}]
[{"$f":"IF(B100>=T!C$4,IF(B100<=T!C$5,Bogføring!G100,\"\"),\"\")","v":""},"2021-04-14",46,null,null,null,3110,194.39,null,{"$f":"IF(G100=\"\",\"\",IF(ISERROR(VLOOKUP(G100,Kontoplan!A:D,2,0)),\"Konto findes ikke!\",VLOOKUP(G100,Kontoplan!A:D,2,0)))","v":"Lønninger incl ATP -AM"}]
[{"$f":"IF(B101>=T!C$4,IF(B101<=T!C$5,Bogføring!G101,\"\"),\"\")","v":""},"2021-04-15",47,null,null,null,12310,400,null,{"$f":"IF(G101=\"\",\"\",IF(ISERROR(VLOOKUP(G101,Kontoplan!A:D,2,0)),\"Konto findes ikke!\",VLOOKUP(G101,Kontoplan!A:D,2,0)))","v":"Bank konto"}]
[{"$f":"IF(B102>=T!C$4,IF(B102<=T!C$5,Bogføring!G102,\"\"),\"\")","v":""},"2021-04-15",47,null,null,null,1125,null,400,{"$f":"IF(G102=\"\",\"\",IF(ISERROR(VLOOKUP(G102,Kontoplan!A:D,2,0)),\"Konto findes ikke!\",VLOOKUP(G102,Kontoplan!A:D,2,0)))","v":"Salg af inventar"}]
[{"$f":"IF(B103>=T!C$4,IF(B103<=T!C$5,Bogføring!G103,\"\"),\"\")","v":""},"2021-04-22",48,null,null,null,12310,null,464.69,{"$f":"IF(G103=\"\",\"\",IF(ISERROR(VLOOKUP(G103,Kontoplan!A:D,2,0)),\"Konto findes ikke!\",VLOOKUP(G103,Kontoplan!A:D,2,0)))","v":"Bank konto"}]
[{"$f":"IF(B104>=T!C$4,IF(B104<=T!C$5,Bogføring!G104,\"\"),\"\")","v":""},"2021-04-22",48,null,null,null,2165,464.69,null,{"$f":"IF(G104=\"\",\"\",IF(ISERROR(VLOOKUP(G104,Kontoplan!A:D,2,0)),\"Konto findes ikke!\",VLOOKUP(G104,Kontoplan!A:D,2,0)))","v":"G4S tyverialarm"}]
[{"$f":"IF(B105>=T!C$4,IF(B105<=T!C$5,Bogføring!G105,\"\"),\"\")","v":""},"2021-04-22",49,null,null,null,12310,null,1337.06,{"$f":"IF(G105=\"\",\"\",IF(ISERROR(VLOOKUP(G105,Kontoplan!A:D,2,0)),\"Konto findes ikke!\",VLOOKUP(G105,Kontoplan!A:D,2,0)))","v":"Bank konto"}]
[{"$f":"IF(B106>=T!C$4,IF(B106<=T!C$5,Bogføring!G106,\"\"),\"\")","v":""},"2021-04-22",49,null,null,null,2165,1337.06,null,{"$f":"IF(G106=\"\",\"\",IF(ISERROR(VLOOKUP(G106,Kontoplan!A:D,2,0)),\"Konto findes ikke!\",VLOOKUP(G106,Kontoplan!A:D,2,0)))","v":"G4S tyverialarm"}]
[{"$f":"IF(B107>=T!C$4,IF(B107<=T!C$5,Bogføring!G107,\"\"),\"\")","v":""},"2021-04-24",50,null,null,null,12310,null,65,{"$f":"IF(G107=\"\",\"\",IF(ISERROR(VLOOKUP(G107,Kontoplan!A:D,2,0)),\"Konto findes ikke!\",VLOOKUP(G107,Kontoplan!A:D,2,0)))","v":"Bank konto"}]
[{"$f":"IF(B108>=T!C$4,IF(B108<=T!C$5,Bogføring!G108,\"\"),\"\")","v":""},"2021-04-24",50,null,null,null,2100,65,null,{"$f":"IF(G108=\"\",\"\",IF(ISERROR(VLOOKUP(G108,Kontoplan!A:D,2,0)),\"Konto findes ikke!\",VLOOKUP(G108,Kontoplan!A:D,2,0)))","v":"Forplejning til møder/Rejser"}]
[{"$f":"IF(B109>=T!C$4,IF(B109<=T!C$5,Bogføring!G109,\"\"),\"\")","v":""},"2021-04-29",51,null,null,null,12310,null,7000,{"$f":"IF(G109=\"\",\"\",IF(ISERROR(VLOOKUP(G109,Kontoplan!A:D,2,0)),\"Konto findes ikke!\",VLOOKUP(G109,Kontoplan!A:D,2,0)))","v":"Bank konto"}]
[{"$f":"IF(B110>=T!C$4,IF(B110<=T!C$5,Bogføring!G110,\"\"),\"\")","v":""},"2021-04-29",51,null,null,null,3110,7000,null,{"$f":"IF(G110=\"\",\"\",IF(ISERROR(VLOOKUP(G110,Kontoplan!A:D,2,0)),\"Konto findes ikke!\",VLOOKUP(G110,Kontoplan!A:D,2,0)))","v":"Lønninger incl ATP -AM"}]
[{"$f":"IF(B111>=T!C$4,IF(B111<=T!C$5,Bogføring!G111,\"\"),\"\")","v":""},"2021-04-29",52,null,null,null,12310,null,71,{"$f":"IF(G111=\"\",\"\",IF(ISERROR(VLOOKUP(G111,Kontoplan!A:D,2,0)),\"Konto findes ikke!\",VLOOKUP(G111,Kontoplan!A:D,2,0)))","v":"Bank konto"}]
[{"$f":"IF(B112>=T!C$4,IF(B112<=T!C$5,Bogføring!G112,\"\"),\"\")","v":""},"2021-04-29",52,null,null,null,2190,71,null,{"$f":"IF(G112=\"\",\"\",IF(ISERROR(VLOOKUP(G112,Kontoplan!A:D,2,0)),\"Konto findes ikke!\",VLOOKUP(G112,Kontoplan!A:D,2,0)))","v":"Diverse Udgifter"}]
[{"$f":"IF(B113>=T!C$4,IF(B113<=T!C$5,Bogføring!G113,\"\"),\"\")","v":""},"2021-05-01",53,null,null,null,12310,null,1,{"$f":"IF(G113=\"\",\"\",IF(ISERROR(VLOOKUP(G113,Kontoplan!A:D,2,0)),\"Konto findes ikke!\",VLOOKUP(G113,Kontoplan!A:D,2,0)))","v":"Bank konto"}]
[{"$f":"IF(B114>=T!C$4,IF(B114<=T!C$5,Bogføring!G114,\"\"),\"\")","v":""},"2021-05-01",53,null,null,null,2000,1,null,{"$f":"IF(G114=\"\",\"\",IF(ISERROR(VLOOKUP(G114,Kontoplan!A:D,2,0)),\"Konto findes ikke!\",VLOOKUP(G114,Kontoplan!A:D,2,0)))","v":"Bankgebyr"}]
[{"$f":"IF(B115>=T!C$4,IF(B115<=T!C$5,Bogføring!G115,\"\"),\"\")","v":""},"2021-05-03",54,null,null,null,12310,null,15121.69,{"$f":"IF(G115=\"\",\"\",IF(ISERROR(VLOOKUP(G115,Kontoplan!A:D,2,0)),\"Konto findes ikke!\",VLOOKUP(G115,Kontoplan!A:D,2,0)))","v":"Bank konto"}]
[{"$f":"IF(B116>=T!C$4,IF(B116<=T!C$5,Bogføring!G116,\"\"),\"\")","v":""},"2021-05-03",54,null,null,null,2040,15121.69,null,{"$f":"IF(G116=\"\",\"\",IF(ISERROR(VLOOKUP(G116,Kontoplan!A:D,2,0)),\"Konto findes ikke!\",VLOOKUP(G116,Kontoplan!A:D,2,0)))","v":"El, Vand og Varme"}]
[{"$f":"IF(B117>=T!C$4,IF(B117<=T!C$5,Bogføring!G117,\"\"),\"\")","v":""},"2021-05-03",55,null,null,null,12310,null,3449.73,{"$f":"IF(G117=\"\",\"\",IF(ISERROR(VLOOKUP(G117,Kontoplan!A:D,2,0)),\"Konto findes ikke!\",VLOOKUP(G117,Kontoplan!A:D,2,0)))","v":"Bank konto"}]
[{"$f":"IF(B118>=T!C$4,IF(B118<=T!C$5,Bogføring!G118,\"\"),\"\")","v":""},"2021-05-03",55,null,null,null,2040,3449.73,null,{"$f":"IF(G118=\"\",\"\",IF(ISERROR(VLOOKUP(G118,Kontoplan!A:D,2,0)),\"Konto findes ikke!\",VLOOKUP(G118,Kontoplan!A:D,2,0)))","v":"El, Vand og Varme"}]
[{"$f":"IF(B119>=T!C$4,IF(B119<=T!C$5,Bogføring!G119,\"\"),\"\")","v":""},"2021-05-03",56,null,null,null,12310,null,414,{"$f":"IF(G119=\"\",\"\",IF(ISERROR(VLOOKUP(G119,Kontoplan!A:D,2,0)),\"Konto findes ikke!\",VLOOKUP(G119,Kontoplan!A:D,2,0)))","v":"Bank konto"}]
[{"$f":"IF(B120>=T!C$4,IF(B120<=T!C$5,Bogføring!G120,\"\"),\"\")","v":""},"2021-05-03",56,null,null,null,2060,414,null,{"$f":"IF(G120=\"\",\"\",IF(ISERROR(VLOOKUP(G120,Kontoplan!A:D,2,0)),\"Konto findes ikke!\",VLOOKUP(G120,Kontoplan!A:D,2,0)))","v":"Internet, mobiltelefon, Forsik."}]
[{"$f":"IF(B121>=T!C$4,IF(B121<=T!C$5,Bogføring!G121,\"\"),\"\")","v":""},"2021-05-03",57,null,null,null,12310,null,345,{"$f":"IF(G121=\"\",\"\",IF(ISERROR(VLOOKUP(G121,Kontoplan!A:D,2,0)),\"Konto findes ikke!\",VLOOKUP(G121,Kontoplan!A:D,2,0)))","v":"Bank konto"}]
[{"$f":"IF(B122>=T!C$4,IF(B122<=T!C$5,Bogføring!G122,\"\"),\"\")","v":""},"2021-05-03",57,null,null,null,2065,345,null,{"$f":"IF(G122=\"\",\"\",IF(ISERROR(VLOOKUP(G122,Kontoplan!A:D,2,0)),\"Konto findes ikke!\",VLOOKUP(G122,Kontoplan!A:D,2,0)))","v":"Udstilling"}]
[{"$f":"IF(B123>=T!C$4,IF(B123<=T!C$5,Bogføring!G123,\"\"),\"\")","v":""},"2021-05-03",58,null,null,null,12310,null,192.5,{"$f":"IF(G123=\"\",\"\",IF(ISERROR(VLOOKUP(G123,Kontoplan!A:D,2,0)),\"Konto findes ikke!\",VLOOKUP(G123,Kontoplan!A:D,2,0)))","v":"Bank konto"}]
[{"$f":"IF(B124>=T!C$4,IF(B124<=T!C$5,Bogføring!G124,\"\"),\"\")","v":""},"2021-05-03",58,null,null,null,2010,192.5,null,{"$f":"IF(G124=\"\",\"\",IF(ISERROR(VLOOKUP(G124,Kontoplan!A:D,2,0)),\"Konto findes ikke!\",VLOOKUP(G124,Kontoplan!A:D,2,0)))","v":"Danløn"}]
[{"$f":"IF(B125>=T!C$4,IF(B125<=T!C$5,Bogføring!G125,\"\"),\"\")","v":""},"2021-05-07",59,null,null,null,12310,null,739.05,{"$f":"IF(G125=\"\",\"\",IF(ISERROR(VLOOKUP(G125,Kontoplan!A:D,2,0)),\"Konto findes ikke!\",VLOOKUP(G125,Kontoplan!A:D,2,0)))","v":"Bank konto"}]
[{"$f":"IF(B126>=T!C$4,IF(B126<=T!C$5,Bogføring!G126,\"\"),\"\")","v":""},"2021-05-07",59,null,null,null,2065,739.05,null,{"$f":"IF(G126=\"\",\"\",IF(ISERROR(VLOOKUP(G126,Kontoplan!A:D,2,0)),\"Konto findes ikke!\",VLOOKUP(G126,Kontoplan!A:D,2,0)))","v":"Udstilling"}]
[{"$f":"IF(B127>=T!C$4,IF(B127<=T!C$5,Bogføring!G127,\"\"),\"\")","v":""},"2021-05-08",60,null,null,null,12310,null,2349.2600000000002,{"$f":"IF(G127=\"\",\"\",IF(ISERROR(VLOOKUP(G127,Kontoplan!A:D,2,0)),\"Konto findes ikke!\",VLOOKUP(G127,Kontoplan!A:D,2,0)))","v":"Bank konto"}]
[{"$f":"IF(B128>=T!C$4,IF(B128<=T!C$5,Bogføring!G128,\"\"),\"\")","v":""},"2021-05-08",60,null,null,null,2037,2349.2600000000002,null,{"$f":"IF(G128=\"\",\"\",IF(ISERROR(VLOOKUP(G128,Kontoplan!A:D,2,0)),\"Konto findes ikke!\",VLOOKUP(G128,Kontoplan!A:D,2,0)))","v":"Rengørringsartikler"}]
[{"$f":"IF(B129>=T!C$4,IF(B129<=T!C$5,Bogføring!G129,\"\"),\"\")","v":""},"2021-05-08",61,null,null,null,12310,null,150,{"$f":"IF(G129=\"\",\"\",IF(ISERROR(VLOOKUP(G129,Kontoplan!A:D,2,0)),\"Konto findes ikke!\",VLOOKUP(G129,Kontoplan!A:D,2,0)))","v":"Bank konto"}]
[{"$f":"IF(B130>=T!C$4,IF(B130<=T!C$5,Bogføring!G130,\"\"),\"\")","v":""},"2021-05-08",61,null,null,null,2200,150,null,{"$f":"IF(G130=\"\",\"\",IF(ISERROR(VLOOKUP(G130,Kontoplan!A:D,2,0)),\"Konto findes ikke!\",VLOOKUP(G130,Kontoplan!A:D,2,0)))","v":"Kontingenter overført til KVB"}]
[{"$f":"IF(B131>=T!C$4,IF(B131<=T!C$5,Bogføring!G131,\"\"),\"\")","v":""},"2021-05-11",62,null,null,null,12310,1294.24,null,{"$f":"IF(G131=\"\",\"\",IF(ISERROR(VLOOKUP(G131,Kontoplan!A:D,2,0)),\"Konto findes ikke!\",VLOOKUP(G131,Kontoplan!A:D,2,0)))","v":"Bank konto"}]
[{"$f":"IF(B132>=T!C$4,IF(B132<=T!C$5,Bogføring!G132,\"\"),\"\")","v":""},"2021-05-11",62,null,null,null,1000,null,1294.24,{"$f":"IF(G132=\"\",\"\",IF(ISERROR(VLOOKUP(G132,Kontoplan!A:D,2,0)),\"Konto findes ikke!\",VLOOKUP(G132,Kontoplan!A:D,2,0)))","v":"Entre"}]
[{"$f":"IF(B133>=T!C$4,IF(B133<=T!C$5,Bogføring!G133,\"\"),\"\")","v":""},"2021-05-12",63,null,null,null,12310,null,1667.5,{"$f":"IF(G133=\"\",\"\",IF(ISERROR(VLOOKUP(G133,Kontoplan!A:D,2,0)),\"Konto findes ikke!\",VLOOKUP(G133,Kontoplan!A:D,2,0)))","v":"Bank konto"}]
[{"$f":"IF(B134>=T!C$4,IF(B134<=T!C$5,Bogføring!G134,\"\"),\"\")","v":""},"2021-05-12",63,null,null,null,2065,1667.5,null,{"$f":"IF(G134=\"\",\"\",IF(ISERROR(VLOOKUP(G134,Kontoplan!A:D,2,0)),\"Konto findes ikke!\",VLOOKUP(G134,Kontoplan!A:D,2,0)))","v":"Udstilling"}]
[{"$f":"IF(B135>=T!C$4,IF(B135<=T!C$5,Bogføring!G135,\"\"),\"\")","v":""},"2021-05-14",64,null,null,null,12310,null,100,{"$f":"IF(G135=\"\",\"\",IF(ISERROR(VLOOKUP(G135,Kontoplan!A:D,2,0)),\"Konto findes ikke!\",VLOOKUP(G135,Kontoplan!A:D,2,0)))","v":"Bank konto"}]
[{"$f":"IF(B136>=T!C$4,IF(B136<=T!C$5,Bogføring!G136,\"\"),\"\")","v":""},"2021-05-14",64,null,null,null,2065,100,null,{"$f":"IF(G136=\"\",\"\",IF(ISERROR(VLOOKUP(G136,Kontoplan!A:D,2,0)),\"Konto findes ikke!\",VLOOKUP(G136,Kontoplan!A:D,2,0)))","v":"Udstilling"}]
[{"$f":"IF(B137>=T!C$4,IF(B137<=T!C$5,Bogføring!G137,\"\"),\"\")","v":""},"2021-05-14",65,null,null,null,12310,null,150,{"$f":"IF(G137=\"\",\"\",IF(ISERROR(VLOOKUP(G137,Kontoplan!A:D,2,0)),\"Konto findes ikke!\",VLOOKUP(G137,Kontoplan!A:D,2,0)))","v":"Bank konto"}]
[{"$f":"IF(B138>=T!C$4,IF(B138<=T!C$5,Bogføring!G138,\"\"),\"\")","v":""},"2021-05-14",65,null,null,null,2200,150,null,{"$f":"IF(G138=\"\",\"\",IF(ISERROR(VLOOKUP(G138,Kontoplan!A:D,2,0)),\"Konto findes ikke!\",VLOOKUP(G138,Kontoplan!A:D,2,0)))","v":"Kontingenter overført til KVB"}]
[{"$f":"IF(B139>=T!C$4,IF(B139<=T!C$5,Bogføring!G139,\"\"),\"\")","v":""},"2021-05-14",66,null,null,null,12310,null,150,{"$f":"IF(G139=\"\",\"\",IF(ISERROR(VLOOKUP(G139,Kontoplan!A:D,2,0)),\"Konto findes ikke!\",VLOOKUP(G139,Kontoplan!A:D,2,0)))","v":"Bank konto"}]
[{"$f":"IF(B140>=T!C$4,IF(B140<=T!C$5,Bogføring!G140,\"\"),\"\")","v":""},"2021-05-14",66,null,null,null,2200,150,null,{"$f":"IF(G140=\"\",\"\",IF(ISERROR(VLOOKUP(G140,Kontoplan!A:D,2,0)),\"Konto findes ikke!\",VLOOKUP(G140,Kontoplan!A:D,2,0)))","v":"Kontingenter overført til KVB"}]
[{"$f":"IF(B141>=T!C$4,IF(B141<=T!C$5,Bogføring!G141,\"\"),\"\")","v":""},"2021-05-14",67,null,null,null,12310,null,150,{"$f":"IF(G141=\"\",\"\",IF(ISERROR(VLOOKUP(G141,Kontoplan!A:D,2,0)),\"Konto findes ikke!\",VLOOKUP(G141,Kontoplan!A:D,2,0)))","v":"Bank konto"}]
[{"$f":"IF(B142>=T!C$4,IF(B142<=T!C$5,Bogføring!G142,\"\"),\"\")","v":""},"2021-05-14",67,null,null,null,2200,150,null,{"$f":"IF(G142=\"\",\"\",IF(ISERROR(VLOOKUP(G142,Kontoplan!A:D,2,0)),\"Konto findes ikke!\",VLOOKUP(G142,Kontoplan!A:D,2,0)))","v":"Kontingenter overført til KVB"}]
[{"$f":"IF(B143>=T!C$4,IF(B143<=T!C$5,Bogføring!G143,\"\"),\"\")","v":""},"2021-05-18",68,null,null,null,12310,3142.44,null,{"$f":"IF(G143=\"\",\"\",IF(ISERROR(VLOOKUP(G143,Kontoplan!A:D,2,0)),\"Konto findes ikke!\",VLOOKUP(G143,Kontoplan!A:D,2,0)))","v":"Bank konto"}]
[{"$f":"IF(B144>=T!C$4,IF(B144<=T!C$5,Bogføring!G144,\"\"),\"\")","v":""},"2021-05-18",68,null,null,null,1000,null,3142.44,{"$f":"IF(G144=\"\",\"\",IF(ISERROR(VLOOKUP(G144,Kontoplan!A:D,2,0)),\"Konto findes ikke!\",VLOOKUP(G144,Kontoplan!A:D,2,0)))","v":"Entre"}]
[{"$f":"IF(B145>=T!C$4,IF(B145<=T!C$5,Bogføring!G145,\"\"),\"\")","v":""},"2021-05-21",69,null,null,null,12310,null,60,{"$f":"IF(G145=\"\",\"\",IF(ISERROR(VLOOKUP(G145,Kontoplan!A:D,2,0)),\"Konto findes ikke!\",VLOOKUP(G145,Kontoplan!A:D,2,0)))","v":"Bank konto"}]
[{"$f":"IF(B146>=T!C$4,IF(B146<=T!C$5,Bogføring!G146,\"\"),\"\")","v":""},"2021-05-21",69,null,null,null,2065,60,null,{"$f":"IF(G146=\"\",\"\",IF(ISERROR(VLOOKUP(G146,Kontoplan!A:D,2,0)),\"Konto findes ikke!\",VLOOKUP(G146,Kontoplan!A:D,2,0)))","v":"Udstilling"}]
[{"$f":"IF(B147>=T!C$4,IF(B147<=T!C$5,Bogføring!G147,\"\"),\"\")","v":""},"2021-05-21",70,null,null,null,12310,null,1899,{"$f":"IF(G147=\"\",\"\",IF(ISERROR(VLOOKUP(G147,Kontoplan!A:D,2,0)),\"Konto findes ikke!\",VLOOKUP(G147,Kontoplan!A:D,2,0)))","v":"Bank konto"}]
[{"$f":"IF(B148>=T!C$4,IF(B148<=T!C$5,Bogføring!G148,\"\"),\"\")","v":""},"2021-05-21",70,null,null,null,2035,1899,null,{"$f":"IF(G148=\"\",\"\",IF(ISERROR(VLOOKUP(G148,Kontoplan!A:D,2,0)),\"Konto findes ikke!\",VLOOKUP(G148,Kontoplan!A:D,2,0)))","v":"Grønne områder"}]
[{"$f":"IF(B149>=T!C$4,IF(B149<=T!C$5,Bogføring!G149,\"\"),\"\")","v":""},"2021-05-21",71,null,null,null,12310,null,1899,{"$f":"IF(G149=\"\",\"\",IF(ISERROR(VLOOKUP(G149,Kontoplan!A:D,2,0)),\"Konto findes ikke!\",VLOOKUP(G149,Kontoplan!A:D,2,0)))","v":"Bank konto"}]
[{"$f":"IF(B150>=T!C$4,IF(B150<=T!C$5,Bogføring!G150,\"\"),\"\")","v":""},"2021-05-21",71,null,null,null,2035,1899,null,{"$f":"IF(G150=\"\",\"\",IF(ISERROR(VLOOKUP(G150,Kontoplan!A:D,2,0)),\"Konto findes ikke!\",VLOOKUP(G150,Kontoplan!A:D,2,0)))","v":"Grønne områder"}]
[{"$f":"IF(B151>=T!C$4,IF(B151<=T!C$5,Bogføring!G151,\"\"),\"\")","v":""},"2021-05-21",72,null,null,null,12310,null,150,{"$f":"IF(G151=\"\",\"\",IF(ISERROR(VLOOKUP(G151,Kontoplan!A:D,2,0)),\"Konto findes ikke!\",VLOOKUP(G151,Kontoplan!A:D,2,0)))","v":"Bank konto"}]
[{"$f":"IF(B152>=T!C$4,IF(B152<=T!C$5,Bogføring!G152,\"\"),\"\")","v":""},"2021-05-21",72,null,null,null,2200,150,null,{"$f":"IF(G152=\"\",\"\",IF(ISERROR(VLOOKUP(G152,Kontoplan!A:D,2,0)),\"Konto findes ikke!\",VLOOKUP(G152,Kontoplan!A:D,2,0)))","v":"Kontingenter overført til KVB"}]
[{"$f":"IF(B153>=T!C$4,IF(B153<=T!C$5,Bogføring!G153,\"\"),\"\")","v":""},"2021-05-26",73,null,null,null,12310,1843.27,null,{"$f":"IF(G153=\"\",\"\",IF(ISERROR(VLOOKUP(G153,Kontoplan!A:D,2,0)),\"Konto findes ikke!\",VLOOKUP(G153,Kontoplan!A:D,2,0)))","v":"Bank konto"}]
[{"$f":"IF(B154>=T!C$4,IF(B154<=T!C$5,Bogføring!G154,\"\"),\"\")","v":""},"2021-05-26",73,null,null,null,1000,null,1843.27,{"$f":"IF(G154=\"\",\"\",IF(ISERROR(VLOOKUP(G154,Kontoplan!A:D,2,0)),\"Konto findes ikke!\",VLOOKUP(G154,Kontoplan!A:D,2,0)))","v":"Entre"}]
[{"$f":"IF(B155>=T!C$4,IF(B155<=T!C$5,Bogføring!G155,\"\"),\"\")","v":""},"2021-05-26",74,null,null,null,12310,3000,null,{"$f":"IF(G155=\"\",\"\",IF(ISERROR(VLOOKUP(G155,Kontoplan!A:D,2,0)),\"Konto findes ikke!\",VLOOKUP(G155,Kontoplan!A:D,2,0)))","v":"Bank konto"}]
[{"$f":"IF(B156>=T!C$4,IF(B156<=T!C$5,Bogføring!G156,\"\"),\"\")","v":""},"2021-05-26",74,null,null,null,1130,null,3000,{"$f":"IF(G156=\"\",\"\",IF(ISERROR(VLOOKUP(G156,Kontoplan!A:D,2,0)),\"Konto findes ikke!\",VLOOKUP(G156,Kontoplan!A:D,2,0)))","v":"Diverse Indtægter"}]
[{"$f":"IF(B157>=T!C$4,IF(B157<=T!C$5,Bogføring!G157,\"\"),\"\")","v":""},"2021-05-26",75,null,null,null,12310,null,3000,{"$f":"IF(G157=\"\",\"\",IF(ISERROR(VLOOKUP(G157,Kontoplan!A:D,2,0)),\"Konto findes ikke!\",VLOOKUP(G157,Kontoplan!A:D,2,0)))","v":"Bank konto"}]
[{"$f":"IF(B158>=T!C$4,IF(B158<=T!C$5,Bogføring!G158,\"\"),\"\")","v":""},"2021-05-26",75,null,null,null,2065,3000,null,{"$f":"IF(G158=\"\",\"\",IF(ISERROR(VLOOKUP(G158,Kontoplan!A:D,2,0)),\"Konto findes ikke!\",VLOOKUP(G158,Kontoplan!A:D,2,0)))","v":"Udstilling"}]
[{"$f":"IF(B159>=T!C$4,IF(B159<=T!C$5,Bogføring!G159,\"\"),\"\")","v":""},"2021-05-27",76,null,null,null,12310,null,300,{"$f":"IF(G159=\"\",\"\",IF(ISERROR(VLOOKUP(G159,Kontoplan!A:D,2,0)),\"Konto findes ikke!\",VLOOKUP(G159,Kontoplan!A:D,2,0)))","v":"Bank konto"}]
[{"$f":"IF(B160>=T!C$4,IF(B160<=T!C$5,Bogføring!G160,\"\"),\"\")","v":""},"2021-05-27",76,null,null,null,3100,300,null,{"$f":"IF(G160=\"\",\"\",IF(ISERROR(VLOOKUP(G160,Kontoplan!A:D,2,0)),\"Konto findes ikke!\",VLOOKUP(G160,Kontoplan!A:D,2,0)))","v":"Lønomkostninger"}]
[{"$f":"IF(B161>=T!C$4,IF(B161<=T!C$5,Bogføring!G161,\"\"),\"\")","v":""},"2021-05-26",77,null,null,null,12310,null,799,{"$f":"IF(G161=\"\",\"\",IF(ISERROR(VLOOKUP(G161,Kontoplan!A:D,2,0)),\"Konto findes ikke!\",VLOOKUP(G161,Kontoplan!A:D,2,0)))","v":"Bank konto"}]
[{"$f":"IF(B162>=T!C$4,IF(B162<=T!C$5,Bogføring!G162,\"\"),\"\")","v":""},"2021-05-26",77,null,null,null,2060,799,null,{"$f":"IF(G162=\"\",\"\",IF(ISERROR(VLOOKUP(G162,Kontoplan!A:D,2,0)),\"Konto findes ikke!\",VLOOKUP(G162,Kontoplan!A:D,2,0)))","v":"Internet, mobiltelefon, Forsik."}]
[{"$f":"IF(B163>=T!C$4,IF(B163<=T!C$5,Bogføring!G163,\"\"),\"\")","v":""},"2021-05-28",78,null,null,null,12310,null,107.18,{"$f":"IF(G163=\"\",\"\",IF(ISERROR(VLOOKUP(G163,Kontoplan!A:D,2,0)),\"Konto findes ikke!\",VLOOKUP(G163,Kontoplan!A:D,2,0)))","v":"Bank konto"}]
[{"$f":"IF(B164>=T!C$4,IF(B164<=T!C$5,Bogføring!G164,\"\"),\"\")","v":""},"2021-05-28",78,null,null,null,2100,107.18,null,{"$f":"IF(G164=\"\",\"\",IF(ISERROR(VLOOKUP(G164,Kontoplan!A:D,2,0)),\"Konto findes ikke!\",VLOOKUP(G164,Kontoplan!A:D,2,0)))","v":"Forplejning til møder/Rejser"}]
[{"$f":"IF(B165>=T!C$4,IF(B165<=T!C$5,Bogføring!G165,\"\"),\"\")","v":""},"2021-05-31",79,null,null,null,12310,null,4436,{"$f":"IF(G165=\"\",\"\",IF(ISERROR(VLOOKUP(G165,Kontoplan!A:D,2,0)),\"Konto findes ikke!\",VLOOKUP(G165,Kontoplan!A:D,2,0)))","v":"Bank konto"}]
[{"$f":"IF(B166>=T!C$4,IF(B166<=T!C$5,Bogføring!G166,\"\"),\"\")","v":""},"2021-05-31",79,null,null,null,3100,4436,null,{"$f":"IF(G166=\"\",\"\",IF(ISERROR(VLOOKUP(G166,Kontoplan!A:D,2,0)),\"Konto findes ikke!\",VLOOKUP(G166,Kontoplan!A:D,2,0)))","v":"Lønomkostninger"}]
[{"$f":"IF(B167>=T!C$4,IF(B167<=T!C$5,Bogføring!G167,\"\"),\"\")","v":""},"2021-05-31",80,null,null,null,12310,null,370,{"$f":"IF(G167=\"\",\"\",IF(ISERROR(VLOOKUP(G167,Kontoplan!A:D,2,0)),\"Konto findes ikke!\",VLOOKUP(G167,Kontoplan!A:D,2,0)))","v":"Bank konto"}]
[{"$f":"IF(B168>=T!C$4,IF(B168<=T!C$5,Bogføring!G168,\"\"),\"\")","v":""},"2021-05-31",80,null,null,null,2035,370,null,{"$f":"IF(G168=\"\",\"\",IF(ISERROR(VLOOKUP(G168,Kontoplan!A:D,2,0)),\"Konto findes ikke!\",VLOOKUP(G168,Kontoplan!A:D,2,0)))","v":"Grønne områder"}]
[{"$f":"IF(B169>=T!C$4,IF(B169<=T!C$5,Bogføring!G169,\"\"),\"\")","v":""},"2021-05-31",81,null,null,null,12310,null,1733,{"$f":"IF(G169=\"\",\"\",IF(ISERROR(VLOOKUP(G169,Kontoplan!A:D,2,0)),\"Konto findes ikke!\",VLOOKUP(G169,Kontoplan!A:D,2,0)))","v":"Bank konto"}]
[{"$f":"IF(B170>=T!C$4,IF(B170<=T!C$5,Bogføring!G170,\"\"),\"\")","v":""},"2021-05-31",81,null,null,null,2110,44,null,{"$f":"IF(G170=\"\",\"\",IF(ISERROR(VLOOKUP(G170,Kontoplan!A:D,2,0)),\"Konto findes ikke!\",VLOOKUP(G170,Kontoplan!A:D,2,0)))","v":"Kontorhold - Porto - IT"}]
[{"$f":"IF(B171>=T!C$4,IF(B171<=T!C$5,Bogføring!G171,\"\"),\"\")","v":""},"2021-05-31",81,null,null,null,2035,1689,null,{"$f":"IF(G171=\"\",\"\",IF(ISERROR(VLOOKUP(G171,Kontoplan!A:D,2,0)),\"Konto findes ikke!\",VLOOKUP(G171,Kontoplan!A:D,2,0)))","v":"Grønne områder"}]
[{"$f":"IF(B172>=T!C$4,IF(B172<=T!C$5,Bogføring!G172,\"\"),\"\")","v":""},"2021-05-31",82,null,null,null,12310,null,45,{"$f":"IF(G172=\"\",\"\",IF(ISERROR(VLOOKUP(G172,Kontoplan!A:D,2,0)),\"Konto findes ikke!\",VLOOKUP(G172,Kontoplan!A:D,2,0)))","v":"Bank konto"}]
[{"$f":"IF(B173>=T!C$4,IF(B173<=T!C$5,Bogføring!G173,\"\"),\"\")","v":""},"2021-05-31",82,null,null,null,2065,45,null,{"$f":"IF(G173=\"\",\"\",IF(ISERROR(VLOOKUP(G173,Kontoplan!A:D,2,0)),\"Konto findes ikke!\",VLOOKUP(G173,Kontoplan!A:D,2,0)))","v":"Udstilling"}]
[{"$f":"IF(B174>=T!C$4,IF(B174<=T!C$5,Bogføring!G174,\"\"),\"\")","v":""},"2021-06-01",83,null,null,null,12310,null,1,{"$f":"IF(G174=\"\",\"\",IF(ISERROR(VLOOKUP(G174,Kontoplan!A:D,2,0)),\"Konto findes ikke!\",VLOOKUP(G174,Kontoplan!A:D,2,0)))","v":"Bank konto"}]
[{"$f":"IF(B175>=T!C$4,IF(B175<=T!C$5,Bogføring!G175,\"\"),\"\")","v":""},"2021-06-01",83,null,null,null,2000,1,null,{"$f":"IF(G175=\"\",\"\",IF(ISERROR(VLOOKUP(G175,Kontoplan!A:D,2,0)),\"Konto findes ikke!\",VLOOKUP(G175,Kontoplan!A:D,2,0)))","v":"Bankgebyr"}]
[{"$f":"IF(B176>=T!C$4,IF(B176<=T!C$5,Bogføring!G176,\"\"),\"\")","v":""},"2021-06-01",84,null,null,null,12310,1745.27,null,{"$f":"IF(G176=\"\",\"\",IF(ISERROR(VLOOKUP(G176,Kontoplan!A:D,2,0)),\"Konto findes ikke!\",VLOOKUP(G176,Kontoplan!A:D,2,0)))","v":"Bank konto"}]
[{"$f":"IF(B177>=T!C$4,IF(B177<=T!C$5,Bogføring!G177,\"\"),\"\")","v":""},"2021-06-01",84,null,null,null,1000,null,1745.27,{"$f":"IF(G177=\"\",\"\",IF(ISERROR(VLOOKUP(G177,Kontoplan!A:D,2,0)),\"Konto findes ikke!\",VLOOKUP(G177,Kontoplan!A:D,2,0)))","v":"Entre"}]
[{"$f":"IF(B178>=T!C$4,IF(B178<=T!C$5,Bogføring!G178,\"\"),\"\")","v":""},"2021-06-01",85,null,null,null,12310,null,414,{"$f":"IF(G178=\"\",\"\",IF(ISERROR(VLOOKUP(G178,Kontoplan!A:D,2,0)),\"Konto findes ikke!\",VLOOKUP(G178,Kontoplan!A:D,2,0)))","v":"Bank konto"}]
[{"$f":"IF(B179>=T!C$4,IF(B179<=T!C$5,Bogføring!G179,\"\"),\"\")","v":""},"2021-06-01",85,null,null,null,2060,414,null,{"$f":"IF(G179=\"\",\"\",IF(ISERROR(VLOOKUP(G179,Kontoplan!A:D,2,0)),\"Konto findes ikke!\",VLOOKUP(G179,Kontoplan!A:D,2,0)))","v":"Internet, mobiltelefon, Forsik."}]
[{"$f":"IF(B180>=T!C$4,IF(B180<=T!C$5,Bogføring!G180,\"\"),\"\")","v":""},"2021-06-01",86,null,null,null,12310,null,192.5,{"$f":"IF(G180=\"\",\"\",IF(ISERROR(VLOOKUP(G180,Kontoplan!A:D,2,0)),\"Konto findes ikke!\",VLOOKUP(G180,Kontoplan!A:D,2,0)))","v":"Bank konto"}]
[{"$f":"IF(B181>=T!C$4,IF(B181<=T!C$5,Bogføring!G181,\"\"),\"\")","v":""},"2021-06-01",86,null,null,null,2010,192.5,null,{"$f":"IF(G181=\"\",\"\",IF(ISERROR(VLOOKUP(G181,Kontoplan!A:D,2,0)),\"Konto findes ikke!\",VLOOKUP(G181,Kontoplan!A:D,2,0)))","v":"Danløn"}]
[{"$f":"IF(B182>=T!C$4,IF(B182<=T!C$5,Bogføring!G182,\"\"),\"\")","v":""},"2021-06-02",87,null,null,null,12310,550,null,{"$f":"IF(G182=\"\",\"\",IF(ISERROR(VLOOKUP(G182,Kontoplan!A:D,2,0)),\"Konto findes ikke!\",VLOOKUP(G182,Kontoplan!A:D,2,0)))","v":"Bank konto"}]
[{"$f":"IF(B183>=T!C$4,IF(B183<=T!C$5,Bogføring!G183,\"\"),\"\")","v":""},"2021-06-02",87,null,null,null,1125,null,550,{"$f":"IF(G183=\"\",\"\",IF(ISERROR(VLOOKUP(G183,Kontoplan!A:D,2,0)),\"Konto findes ikke!\",VLOOKUP(G183,Kontoplan!A:D,2,0)))","v":"Salg af inventar"}]
[{"$f":"IF(B184>=T!C$4,IF(B184<=T!C$5,Bogføring!G184,\"\"),\"\")","v":""},"2021-06-02",88,null,null,null,12310,null,7000,{"$f":"IF(G184=\"\",\"\",IF(ISERROR(VLOOKUP(G184,Kontoplan!A:D,2,0)),\"Konto findes ikke!\",VLOOKUP(G184,Kontoplan!A:D,2,0)))","v":"Bank konto"}]
[{"$f":"IF(B185>=T!C$4,IF(B185<=T!C$5,Bogføring!G185,\"\"),\"\")","v":""},"2021-06-02",88,null,null,null,3110,7000,null,{"$f":"IF(G185=\"\",\"\",IF(ISERROR(VLOOKUP(G185,Kontoplan!A:D,2,0)),\"Konto findes ikke!\",VLOOKUP(G185,Kontoplan!A:D,2,0)))","v":"Lønninger incl ATP -AM"}]
[{"$f":"IF(B186>=T!C$4,IF(B186<=T!C$5,Bogføring!G186,\"\"),\"\")","v":""},"2021-06-04",89,null,null,null,12310,null,1347.78,{"$f":"IF(G186=\"\",\"\",IF(ISERROR(VLOOKUP(G186,Kontoplan!A:D,2,0)),\"Konto findes ikke!\",VLOOKUP(G186,Kontoplan!A:D,2,0)))","v":"Bank konto"}]
[{"$f":"IF(B187>=T!C$4,IF(B187<=T!C$5,Bogføring!G187,\"\"),\"\")","v":""},"2021-06-04",89,null,null,null,2110,1347.78,null,{"$f":"IF(G187=\"\",\"\",IF(ISERROR(VLOOKUP(G187,Kontoplan!A:D,2,0)),\"Konto findes ikke!\",VLOOKUP(G187,Kontoplan!A:D,2,0)))","v":"Kontorhold - Porto - IT"}]
[{"$f":"IF(B188>=T!C$4,IF(B188<=T!C$5,Bogføring!G188,\"\"),\"\")","v":""},"2021-06-04",90,null,null,null,12310,null,374,{"$f":"IF(G188=\"\",\"\",IF(ISERROR(VLOOKUP(G188,Kontoplan!A:D,2,0)),\"Konto findes ikke!\",VLOOKUP(G188,Kontoplan!A:D,2,0)))","v":"Bank konto"}]
[{"$f":"IF(B189>=T!C$4,IF(B189<=T!C$5,Bogføring!G189,\"\"),\"\")","v":""},"2021-06-04",90,null,null,null,2065,374,null,{"$f":"IF(G189=\"\",\"\",IF(ISERROR(VLOOKUP(G189,Kontoplan!A:D,2,0)),\"Konto findes ikke!\",VLOOKUP(G189,Kontoplan!A:D,2,0)))","v":"Udstilling"}]
[{"$f":"IF(B190>=T!C$4,IF(B190<=T!C$5,Bogføring!G190,\"\"),\"\")","v":""},"2021-06-08",91,null,null,null,12310,2323.73,null,{"$f":"IF(G190=\"\",\"\",IF(ISERROR(VLOOKUP(G190,Kontoplan!A:D,2,0)),\"Konto findes ikke!\",VLOOKUP(G190,Kontoplan!A:D,2,0)))","v":"Bank konto"}]
[{"$f":"IF(B191>=T!C$4,IF(B191<=T!C$5,Bogføring!G191,\"\"),\"\")","v":""},"2021-06-08",91,null,null,null,1000,null,2323.73,{"$f":"IF(G191=\"\",\"\",IF(ISERROR(VLOOKUP(G191,Kontoplan!A:D,2,0)),\"Konto findes ikke!\",VLOOKUP(G191,Kontoplan!A:D,2,0)))","v":"Entre"}]
[{"$f":"IF(B192>=T!C$4,IF(B192<=T!C$5,Bogføring!G192,\"\"),\"\")","v":""},"2021-06-08",92,null,null,null,12310,1200,null,{"$f":"IF(G192=\"\",\"\",IF(ISERROR(VLOOKUP(G192,Kontoplan!A:D,2,0)),\"Konto findes ikke!\",VLOOKUP(G192,Kontoplan!A:D,2,0)))","v":"Bank konto"}]
[{"$f":"IF(B193>=T!C$4,IF(B193<=T!C$5,Bogføring!G193,\"\"),\"\")","v":""},"2021-06-08",92,null,null,null,1000,null,1200,{"$f":"IF(G193=\"\",\"\",IF(ISERROR(VLOOKUP(G193,Kontoplan!A:D,2,0)),\"Konto findes ikke!\",VLOOKUP(G193,Kontoplan!A:D,2,0)))","v":"Entre"}]
[{"$f":"IF(B194>=T!C$4,IF(B194<=T!C$5,Bogføring!G194,\"\"),\"\")","v":""},"2021-06-09",93,null,null,null,12310,1300,null,{"$f":"IF(G194=\"\",\"\",IF(ISERROR(VLOOKUP(G194,Kontoplan!A:D,2,0)),\"Konto findes ikke!\",VLOOKUP(G194,Kontoplan!A:D,2,0)))","v":"Bank konto"}]
[{"$f":"IF(B195>=T!C$4,IF(B195<=T!C$5,Bogføring!G195,\"\"),\"\")","v":""},"2021-06-09",93,null,null,null,1130,null,1300,{"$f":"IF(G195=\"\",\"\",IF(ISERROR(VLOOKUP(G195,Kontoplan!A:D,2,0)),\"Konto findes ikke!\",VLOOKUP(G195,Kontoplan!A:D,2,0)))","v":"Diverse Indtægter"}]
[{"$f":"IF(B196>=T!C$4,IF(B196<=T!C$5,Bogføring!G196,\"\"),\"\")","v":""},"2021-06-09",94,null,null,null,12310,294,null,{"$f":"IF(G196=\"\",\"\",IF(ISERROR(VLOOKUP(G196,Kontoplan!A:D,2,0)),\"Konto findes ikke!\",VLOOKUP(G196,Kontoplan!A:D,2,0)))","v":"Bank konto"}]
[{"$f":"IF(B197>=T!C$4,IF(B197<=T!C$5,Bogføring!G197,\"\"),\"\")","v":""},"2021-06-09",94,null,null,null,1130,null,294,{"$f":"IF(G197=\"\",\"\",IF(ISERROR(VLOOKUP(G197,Kontoplan!A:D,2,0)),\"Konto findes ikke!\",VLOOKUP(G197,Kontoplan!A:D,2,0)))","v":"Diverse Indtægter"}]
[{"$f":"IF(B198>=T!C$4,IF(B198<=T!C$5,Bogføring!G198,\"\"),\"\")","v":""},"2021-06-09",95,null,null,null,12310,null,208.78,{"$f":"IF(G198=\"\",\"\",IF(ISERROR(VLOOKUP(G198,Kontoplan!A:D,2,0)),\"Konto findes ikke!\",VLOOKUP(G198,Kontoplan!A:D,2,0)))","v":"Bank konto"}]
[{"$f":"IF(B199>=T!C$4,IF(B199<=T!C$5,Bogføring!G199,\"\"),\"\")","v":""},"2021-06-09",95,null,null,null,2110,208.78,null,{"$f":"IF(G199=\"\",\"\",IF(ISERROR(VLOOKUP(G199,Kontoplan!A:D,2,0)),\"Konto findes ikke!\",VLOOKUP(G199,Kontoplan!A:D,2,0)))","v":"Kontorhold - Porto - IT"}]
[{"$f":"IF(B200>=T!C$4,IF(B200<=T!C$5,Bogføring!G200,\"\"),\"\")","v":""},"2021-06-10",96,null,null,null,12310,null,601.1,{"$f":"IF(G200=\"\",\"\",IF(ISERROR(VLOOKUP(G200,Kontoplan!A:D,2,0)),\"Konto findes ikke!\",VLOOKUP(G200,Kontoplan!A:D,2,0)))","v":"Bank konto"}]
[{"$f":"IF(B201>=T!C$4,IF(B201<=T!C$5,Bogføring!G201,\"\"),\"\")","v":""},"2021-06-10",96,null,null,null,2040,601.1,null,{"$f":"IF(G201=\"\",\"\",IF(ISERROR(VLOOKUP(G201,Kontoplan!A:D,2,0)),\"Konto findes ikke!\",VLOOKUP(G201,Kontoplan!A:D,2,0)))","v":"El, Vand og Varme"}]
[{"$f":"IF(B202>=T!C$4,IF(B202<=T!C$5,Bogføring!G202,\"\"),\"\")","v":""},"2021-06-15",97,null,null,null,12310,1359.19,null,{"$f":"IF(G202=\"\",\"\",IF(ISERROR(VLOOKUP(G202,Kontoplan!A:D,2,0)),\"Konto findes ikke!\",VLOOKUP(G202,Kontoplan!A:D,2,0)))","v":"Bank konto"}]
[{"$f":"IF(B203>=T!C$4,IF(B203<=T!C$5,Bogføring!G203,\"\"),\"\")","v":""},"2021-06-15",97,null,null,null,1130,null,1359.19,{"$f":"IF(G203=\"\",\"\",IF(ISERROR(VLOOKUP(G203,Kontoplan!A:D,2,0)),\"Konto findes ikke!\",VLOOKUP(G203,Kontoplan!A:D,2,0)))","v":"Diverse Indtægter"}]
[{"$f":"IF(B204>=T!C$4,IF(B204<=T!C$5,Bogføring!G204,\"\"),\"\")","v":""},"2021-06-15",98,null,null,null,12310,3054.22,null,{"$f":"IF(G204=\"\",\"\",IF(ISERROR(VLOOKUP(G204,Kontoplan!A:D,2,0)),\"Konto findes ikke!\",VLOOKUP(G204,Kontoplan!A:D,2,0)))","v":"Bank konto"}]
[{"$f":"IF(B205>=T!C$4,IF(B205<=T!C$5,Bogføring!G205,\"\"),\"\")","v":""},"2021-06-15",98,null,null,null,1000,null,3054.22,{"$f":"IF(G205=\"\",\"\",IF(ISERROR(VLOOKUP(G205,Kontoplan!A:D,2,0)),\"Konto findes ikke!\",VLOOKUP(G205,Kontoplan!A:D,2,0)))","v":"Entre"}]
[{"$f":"IF(B206>=T!C$4,IF(B206<=T!C$5,Bogføring!G206,\"\"),\"\")","v":""},"2021-06-15",99,null,null,null,12310,350,null,{"$f":"IF(G206=\"\",\"\",IF(ISERROR(VLOOKUP(G206,Kontoplan!A:D,2,0)),\"Konto findes ikke!\",VLOOKUP(G206,Kontoplan!A:D,2,0)))","v":"Bank konto"}]
[{"$f":"IF(B207>=T!C$4,IF(B207<=T!C$5,Bogføring!G207,\"\"),\"\")","v":""},"2021-06-15",99,null,null,null,1125,null,350,{"$f":"IF(G207=\"\",\"\",IF(ISERROR(VLOOKUP(G207,Kontoplan!A:D,2,0)),\"Konto findes ikke!\",VLOOKUP(G207,Kontoplan!A:D,2,0)))","v":"Salg af inventar"}]
[{"$f":"IF(B208>=T!C$4,IF(B208<=T!C$5,Bogføring!G208,\"\"),\"\")","v":""},"2021-06-16",100,null,null,null,12310,null,115.85,{"$f":"IF(G208=\"\",\"\",IF(ISERROR(VLOOKUP(G208,Kontoplan!A:D,2,0)),\"Konto findes ikke!\",VLOOKUP(G208,Kontoplan!A:D,2,0)))","v":"Bank konto"}]
[{"$f":"IF(B209>=T!C$4,IF(B209<=T!C$5,Bogføring!G209,\"\"),\"\")","v":""},"2021-06-16",100,null,null,null,2055,115.85,null,{"$f":"IF(G209=\"\",\"\",IF(ISERROR(VLOOKUP(G209,Kontoplan!A:D,2,0)),\"Konto findes ikke!\",VLOOKUP(G209,Kontoplan!A:D,2,0)))","v":"Indkøb af øl + vand"}]
[{"$f":"IF(B210>=T!C$4,IF(B210<=T!C$5,Bogføring!G210,\"\"),\"\")","v":""},"2021-06-16",101,null,null,null,12320,null,543,{"$f":"IF(G210=\"\",\"\",IF(ISERROR(VLOOKUP(G210,Kontoplan!A:D,2,0)),\"Konto findes ikke!\",VLOOKUP(G210,Kontoplan!A:D,2,0)))","v":"Kasse"}]
[{"$f":"IF(B211>=T!C$4,IF(B211<=T!C$5,Bogføring!G211,\"\"),\"\")","v":""},"2021-06-16",101,null,null,null,2140,543,null,{"$f":"IF(G211=\"\",\"\",IF(ISERROR(VLOOKUP(G211,Kontoplan!A:D,2,0)),\"Konto findes ikke!\",VLOOKUP(G211,Kontoplan!A:D,2,0)))","v":"Kassedifferance"},"Opgørelse af kassen ved start af kasserapport"]
[{"$f":"IF(B212>=T!C$4,IF(B212<=T!C$5,Bogføring!G212,\"\"),\"\")","v":""},"2021-06-16",102,null,null,null,1010,null,204,{"$f":"IF(G212=\"\",\"\",IF(ISERROR(VLOOKUP(G212,Kontoplan!A:D,2,0)),\"Konto findes ikke!\",VLOOKUP(G212,Kontoplan!A:D,2,0)))","v":"Kiosk salg"}]
[{"$f":"IF(B213>=T!C$4,IF(B213<=T!C$5,Bogføring!G213,\"\"),\"\")","v":""},"2021-06-16",102,null,null,null,12320,204,null,{"$f":"IF(G213=\"\",\"\",IF(ISERROR(VLOOKUP(G213,Kontoplan!A:D,2,0)),\"Konto findes ikke!\",VLOOKUP(G213,Kontoplan!A:D,2,0)))","v":"Kasse"}]
[{"$f":"IF(B214>=T!C$4,IF(B214<=T!C$5,Bogføring!G214,\"\"),\"\")","v":""},"2021-06-17",103,null,null,null,12310,null,1500,{"$f":"IF(G214=\"\",\"\",IF(ISERROR(VLOOKUP(G214,Kontoplan!A:D,2,0)),\"Konto findes ikke!\",VLOOKUP(G214,Kontoplan!A:D,2,0)))","v":"Bank konto"}]
[{"$f":"IF(B215>=T!C$4,IF(B215<=T!C$5,Bogføring!G215,\"\"),\"\")","v":""},"2021-06-17",103,null,null,null,2090,1500,null,{"$f":"IF(G215=\"\",\"\",IF(ISERROR(VLOOKUP(G215,Kontoplan!A:D,2,0)),\"Konto findes ikke!\",VLOOKUP(G215,Kontoplan!A:D,2,0)))","v":"Kontingent til andre Foreninger"}]
[{"$f":"IF(B216>=T!C$4,IF(B216<=T!C$5,Bogføring!G216,\"\"),\"\")","v":""},"2021-06-17",104,null,null,null,1010,null,280,{"$f":"IF(G216=\"\",\"\",IF(ISERROR(VLOOKUP(G216,Kontoplan!A:D,2,0)),\"Konto findes ikke!\",VLOOKUP(G216,Kontoplan!A:D,2,0)))","v":"Kiosk salg"}]
[{"$f":"IF(B217>=T!C$4,IF(B217<=T!C$5,Bogføring!G217,\"\"),\"\")","v":""},"2021-06-17",104,null,null,null,12320,280,null,{"$f":"IF(G217=\"\",\"\",IF(ISERROR(VLOOKUP(G217,Kontoplan!A:D,2,0)),\"Konto findes ikke!\",VLOOKUP(G217,Kontoplan!A:D,2,0)))","v":"Kasse"}]
[{"$f":"IF(B218>=T!C$4,IF(B218<=T!C$5,Bogføring!G218,\"\"),\"\")","v":""},"2021-06-18",105,null,null,null,1010,null,125,{"$f":"IF(G218=\"\",\"\",IF(ISERROR(VLOOKUP(G218,Kontoplan!A:D,2,0)),\"Konto findes ikke!\",VLOOKUP(G218,Kontoplan!A:D,2,0)))","v":"Kiosk salg"}]
[{"$f":"IF(B219>=T!C$4,IF(B219<=T!C$5,Bogføring!G219,\"\"),\"\")","v":""},"2021-06-18",105,null,null,null,12320,125,null,{"$f":"IF(G219=\"\",\"\",IF(ISERROR(VLOOKUP(G219,Kontoplan!A:D,2,0)),\"Konto findes ikke!\",VLOOKUP(G219,Kontoplan!A:D,2,0)))","v":"Kasse"}]
[{"$f":"IF(B220>=T!C$4,IF(B220<=T!C$5,Bogføring!G220,\"\"),\"\")","v":""},"2021-06-19",106,null,null,null,1010,null,560,{"$f":"IF(G220=\"\",\"\",IF(ISERROR(VLOOKUP(G220,Kontoplan!A:D,2,0)),\"Konto findes ikke!\",VLOOKUP(G220,Kontoplan!A:D,2,0)))","v":"Kiosk salg"}]
[{"$f":"IF(B221>=T!C$4,IF(B221<=T!C$5,Bogføring!G221,\"\"),\"\")","v":""},"2021-06-19",106,null,null,null,12320,560,null,{"$f":"IF(G221=\"\",\"\",IF(ISERROR(VLOOKUP(G221,Kontoplan!A:D,2,0)),\"Konto findes ikke!\",VLOOKUP(G221,Kontoplan!A:D,2,0)))","v":"Kasse"}]
[{"$f":"IF(B222>=T!C$4,IF(B222<=T!C$5,Bogføring!G222,\"\"),\"\")","v":""},"2021-06-22",107,null,null,null,12310,2529.62,null,{"$f":"IF(G222=\"\",\"\",IF(ISERROR(VLOOKUP(G222,Kontoplan!A:D,2,0)),\"Konto findes ikke!\",VLOOKUP(G222,Kontoplan!A:D,2,0)))","v":"Bank konto"}]
[{"$f":"IF(B223>=T!C$4,IF(B223<=T!C$5,Bogføring!G223,\"\"),\"\")","v":""},"2021-06-22",107,null,null,null,1000,null,2529.62,{"$f":"IF(G223=\"\",\"\",IF(ISERROR(VLOOKUP(G223,Kontoplan!A:D,2,0)),\"Konto findes ikke!\",VLOOKUP(G223,Kontoplan!A:D,2,0)))","v":"Entre"}]
[{"$f":"IF(B224>=T!C$4,IF(B224<=T!C$5,Bogføring!G224,\"\"),\"\")","v":""},"2021-06-23",108,null,null,null,12320,235,null,{"$f":"IF(G224=\"\",\"\",IF(ISERROR(VLOOKUP(G224,Kontoplan!A:D,2,0)),\"Konto findes ikke!\",VLOOKUP(G224,Kontoplan!A:D,2,0)))","v":"Kasse"}]
[{"$f":"IF(B225>=T!C$4,IF(B225<=T!C$5,Bogføring!G225,\"\"),\"\")","v":""},"2021-06-23",108,null,null,null,1010,null,235,{"$f":"IF(G225=\"\",\"\",IF(ISERROR(VLOOKUP(G225,Kontoplan!A:D,2,0)),\"Konto findes ikke!\",VLOOKUP(G225,Kontoplan!A:D,2,0)))","v":"Kiosk salg"}]
[{"$f":"IF(B226>=T!C$4,IF(B226<=T!C$5,Bogføring!G226,\"\"),\"\")","v":""},"2021-06-23",109,null,null,null,12310,null,828.75,{"$f":"IF(G226=\"\",\"\",IF(ISERROR(VLOOKUP(G226,Kontoplan!A:D,2,0)),\"Konto findes ikke!\",VLOOKUP(G226,Kontoplan!A:D,2,0)))","v":"Bank konto"}]
[{"$f":"IF(B227>=T!C$4,IF(B227<=T!C$5,Bogføring!G227,\"\"),\"\")","v":""},"2021-06-23",109,null,null,null,2070,828.75,null,{"$f":"IF(G227=\"\",\"\",IF(ISERROR(VLOOKUP(G227,Kontoplan!A:D,2,0)),\"Konto findes ikke!\",VLOOKUP(G227,Kontoplan!A:D,2,0)))","v":"Tin og sortkrudt"}]
[{"$f":"IF(B228>=T!C$4,IF(B228<=T!C$5,Bogføring!G228,\"\"),\"\")","v":""},"2021-06-24",110,null,null,null,12320,410,null,{"$f":"IF(G228=\"\",\"\",IF(ISERROR(VLOOKUP(G228,Kontoplan!A:D,2,0)),\"Konto findes ikke!\",VLOOKUP(G228,Kontoplan!A:D,2,0)))","v":"Kasse"}]
[{"$f":"IF(B229>=T!C$4,IF(B229<=T!C$5,Bogføring!G229,\"\"),\"\")","v":""},"2021-06-24",110,null,null,null,1010,null,410,{"$f":"IF(G229=\"\",\"\",IF(ISERROR(VLOOKUP(G229,Kontoplan!A:D,2,0)),\"Konto findes ikke!\",VLOOKUP(G229,Kontoplan!A:D,2,0)))","v":"Kiosk salg"}]
[{"$f":"IF(B230>=T!C$4,IF(B230<=T!C$5,Bogføring!G230,\"\"),\"\")","v":""},"2021-06-25",111,null,null,null,12320,805,null,{"$f":"IF(G230=\"\",\"\",IF(ISERROR(VLOOKUP(G230,Kontoplan!A:D,2,0)),\"Konto findes ikke!\",VLOOKUP(G230,Kontoplan!A:D,2,0)))","v":"Kasse"}]
[{"$f":"IF(B231>=T!C$4,IF(B231<=T!C$5,Bogføring!G231,\"\"),\"\")","v":""},"2021-06-25",111,null,null,null,1010,null,805,{"$f":"IF(G231=\"\",\"\",IF(ISERROR(VLOOKUP(G231,Kontoplan!A:D,2,0)),\"Konto findes ikke!\",VLOOKUP(G231,Kontoplan!A:D,2,0)))","v":"Kiosk salg"}]
[{"$f":"IF(B232>=T!C$4,IF(B232<=T!C$5,Bogføring!G232,\"\"),\"\")","v":""},"2021-06-26",112,null,null,null,12320,520,null,{"$f":"IF(G232=\"\",\"\",IF(ISERROR(VLOOKUP(G232,Kontoplan!A:D,2,0)),\"Konto findes ikke!\",VLOOKUP(G232,Kontoplan!A:D,2,0)))","v":"Kasse"}]
[{"$f":"IF(B233>=T!C$4,IF(B233<=T!C$5,Bogføring!G233,\"\"),\"\")","v":""},"2021-06-26",112,null,null,null,1010,null,520,{"$f":"IF(G233=\"\",\"\",IF(ISERROR(VLOOKUP(G233,Kontoplan!A:D,2,0)),\"Konto findes ikke!\",VLOOKUP(G233,Kontoplan!A:D,2,0)))","v":"Kiosk salg"}]
[{"$f":"IF(B234>=T!C$4,IF(B234<=T!C$5,Bogføring!G234,\"\"),\"\")","v":""},"2021-06-29",113,null,null,null,12310,4279.7700000000004,null,{"$f":"IF(G234=\"\",\"\",IF(ISERROR(VLOOKUP(G234,Kontoplan!A:D,2,0)),\"Konto findes ikke!\",VLOOKUP(G234,Kontoplan!A:D,2,0)))","v":"Bank konto"}]
[{"$f":"IF(B235>=T!C$4,IF(B235<=T!C$5,Bogføring!G235,\"\"),\"\")","v":""},"2021-06-29",113,null,null,null,1000,null,4279.7700000000004,{"$f":"IF(G235=\"\",\"\",IF(ISERROR(VLOOKUP(G235,Kontoplan!A:D,2,0)),\"Konto findes ikke!\",VLOOKUP(G235,Kontoplan!A:D,2,0)))","v":"Entre"}]
[{"$f":"IF(B236>=T!C$4,IF(B236<=T!C$5,Bogføring!G236,\"\"),\"\")","v":""},"2021-06-30",114,null,null,null,12310,null,1351.74,{"$f":"IF(G236=\"\",\"\",IF(ISERROR(VLOOKUP(G236,Kontoplan!A:D,2,0)),\"Konto findes ikke!\",VLOOKUP(G236,Kontoplan!A:D,2,0)))","v":"Bank konto"}]
[{"$f":"IF(B237>=T!C$4,IF(B237<=T!C$5,Bogføring!G237,\"\"),\"\")","v":""},"2021-06-30",114,null,null,null,2030,1351.74,null,{"$f":"IF(G237=\"\",\"\",IF(ISERROR(VLOOKUP(G237,Kontoplan!A:D,2,0)),\"Konto findes ikke!\",VLOOKUP(G237,Kontoplan!A:D,2,0)))","v":"Bygnings vedligehold"}]
[{"$f":"IF(B238>=T!C$4,IF(B238<=T!C$5,Bogføring!G238,\"\"),\"\")","v":""},"2021-06-30",115,null,null,null,12310,null,300,{"$f":"IF(G238=\"\",\"\",IF(ISERROR(VLOOKUP(G238,Kontoplan!A:D,2,0)),\"Konto findes ikke!\",VLOOKUP(G238,Kontoplan!A:D,2,0)))","v":"Bank konto"}]
[{"$f":"IF(B239>=T!C$4,IF(B239<=T!C$5,Bogføring!G239,\"\"),\"\")","v":""},"2021-06-30",115,null,null,null,2200,300,null,{"$f":"IF(G239=\"\",\"\",IF(ISERROR(VLOOKUP(G239,Kontoplan!A:D,2,0)),\"Konto findes ikke!\",VLOOKUP(G239,Kontoplan!A:D,2,0)))","v":"Kontingenter overført til KVB"}]
[{"$f":"IF(B240>=T!C$4,IF(B240<=T!C$5,Bogføring!G240,\"\"),\"\")","v":""},"2021-06-30",116,null,null,null,12320,317,null,{"$f":"IF(G240=\"\",\"\",IF(ISERROR(VLOOKUP(G240,Kontoplan!A:D,2,0)),\"Konto findes ikke!\",VLOOKUP(G240,Kontoplan!A:D,2,0)))","v":"Kasse"}]
[{"$f":"IF(B241>=T!C$4,IF(B241<=T!C$5,Bogføring!G241,\"\"),\"\")","v":""},"2021-06-30",116,null,null,null,1010,null,317,{"$f":"IF(G241=\"\",\"\",IF(ISERROR(VLOOKUP(G241,Kontoplan!A:D,2,0)),\"Konto findes ikke!\",VLOOKUP(G241,Kontoplan!A:D,2,0)))","v":"Kiosk salg"}]
[{"$f":"IF(B242>=T!C$4,IF(B242<=T!C$5,Bogføring!G242,\"\"),\"\")","v":""},"2021-07-01",117,null,null,null,12310,null,105.5,{"$f":"IF(G242=\"\",\"\",IF(ISERROR(VLOOKUP(G242,Kontoplan!A:D,2,0)),\"Konto findes ikke!\",VLOOKUP(G242,Kontoplan!A:D,2,0)))","v":"Bank konto"}]
[{"$f":"IF(B243>=T!C$4,IF(B243<=T!C$5,Bogføring!G243,\"\"),\"\")","v":""},"2021-07-01",117,null,null,null,2000,105.5,null,{"$f":"IF(G243=\"\",\"\",IF(ISERROR(VLOOKUP(G243,Kontoplan!A:D,2,0)),\"Konto findes ikke!\",VLOOKUP(G243,Kontoplan!A:D,2,0)))","v":"Bankgebyr"}]
[{"$f":"IF(B244>=T!C$4,IF(B244<=T!C$5,Bogføring!G244,\"\"),\"\")","v":""},"2021-07-01",118,null,null,null,12310,null,414,{"$f":"IF(G244=\"\",\"\",IF(ISERROR(VLOOKUP(G244,Kontoplan!A:D,2,0)),\"Konto findes ikke!\",VLOOKUP(G244,Kontoplan!A:D,2,0)))","v":"Bank konto"}]
[{"$f":"IF(B245>=T!C$4,IF(B245<=T!C$5,Bogføring!G245,\"\"),\"\")","v":""},"2021-07-01",118,null,null,null,2060,414,null,{"$f":"IF(G245=\"\",\"\",IF(ISERROR(VLOOKUP(G245,Kontoplan!A:D,2,0)),\"Konto findes ikke!\",VLOOKUP(G245,Kontoplan!A:D,2,0)))","v":"Internet, mobiltelefon, Forsik."}]
[{"$f":"IF(B246>=T!C$4,IF(B246<=T!C$5,Bogføring!G246,\"\"),\"\")","v":""},"2021-07-01",119,null,null,null,12310,null,192.5,{"$f":"IF(G246=\"\",\"\",IF(ISERROR(VLOOKUP(G246,Kontoplan!A:D,2,0)),\"Konto findes ikke!\",VLOOKUP(G246,Kontoplan!A:D,2,0)))","v":"Bank konto"}]
[{"$f":"IF(B247>=T!C$4,IF(B247<=T!C$5,Bogføring!G247,\"\"),\"\")","v":""},"2021-07-01",119,null,null,null,2010,192.5,null,{"$f":"IF(G247=\"\",\"\",IF(ISERROR(VLOOKUP(G247,Kontoplan!A:D,2,0)),\"Konto findes ikke!\",VLOOKUP(G247,Kontoplan!A:D,2,0)))","v":"Danløn"}]
[{"$f":"IF(B248>=T!C$4,IF(B248<=T!C$5,Bogføring!G248,\"\"),\"\")","v":""},"2021-07-01",120,null,null,null,12320,410,null,{"$f":"IF(G248=\"\",\"\",IF(ISERROR(VLOOKUP(G248,Kontoplan!A:D,2,0)),\"Konto findes ikke!\",VLOOKUP(G248,Kontoplan!A:D,2,0)))","v":"Kasse"}]
[{"$f":"IF(B249>=T!C$4,IF(B249<=T!C$5,Bogføring!G249,\"\"),\"\")","v":""},"2021-07-01",120,null,null,null,1010,null,410,{"$f":"IF(G249=\"\",\"\",IF(ISERROR(VLOOKUP(G249,Kontoplan!A:D,2,0)),\"Konto findes ikke!\",VLOOKUP(G249,Kontoplan!A:D,2,0)))","v":"Kiosk salg"}]
[{"$f":"IF(B250>=T!C$4,IF(B250<=T!C$5,Bogføring!G250,\"\"),\"\")","v":""},"2021-07-02",121,null,null,null,12320,430,null,{"$f":"IF(G250=\"\",\"\",IF(ISERROR(VLOOKUP(G250,Kontoplan!A:D,2,0)),\"Konto findes ikke!\",VLOOKUP(G250,Kontoplan!A:D,2,0)))","v":"Kasse"}]
[{"$f":"IF(B251>=T!C$4,IF(B251<=T!C$5,Bogføring!G251,\"\"),\"\")","v":""},"2021-07-02",121,null,null,null,1010,null,430,{"$f":"IF(G251=\"\",\"\",IF(ISERROR(VLOOKUP(G251,Kontoplan!A:D,2,0)),\"Konto findes ikke!\",VLOOKUP(G251,Kontoplan!A:D,2,0)))","v":"Kiosk salg"}]
[{"$f":"IF(B252>=T!C$4,IF(B252<=T!C$5,Bogføring!G252,\"\"),\"\")","v":""},"2021-07-02",122,null,null,null,12320,null,3346,{"$f":"IF(G252=\"\",\"\",IF(ISERROR(VLOOKUP(G252,Kontoplan!A:D,2,0)),\"Konto findes ikke!\",VLOOKUP(G252,Kontoplan!A:D,2,0)))","v":"Kasse"}]
[{"$f":"IF(B253>=T!C$4,IF(B253<=T!C$5,Bogføring!G253,\"\"),\"\")","v":""},"2021-07-02",122,null,null,null,12310,3346,null,{"$f":"IF(G253=\"\",\"\",IF(ISERROR(VLOOKUP(G253,Kontoplan!A:D,2,0)),\"Konto findes ikke!\",VLOOKUP(G253,Kontoplan!A:D,2,0)))","v":"Bank konto"}]
[{"$f":"IF(B254>=T!C$4,IF(B254<=T!C$5,Bogføring!G254,\"\"),\"\")","v":""},"2021-07-02",123,null,null,null,12310,null,118.35,{"$f":"IF(G254=\"\",\"\",IF(ISERROR(VLOOKUP(G254,Kontoplan!A:D,2,0)),\"Konto findes ikke!\",VLOOKUP(G254,Kontoplan!A:D,2,0)))","v":"Bank konto"}]
[{"$f":"IF(B255>=T!C$4,IF(B255<=T!C$5,Bogføring!G255,\"\"),\"\")","v":""},"2021-07-02",123,null,null,null,2055,118.35,null,{"$f":"IF(G255=\"\",\"\",IF(ISERROR(VLOOKUP(G255,Kontoplan!A:D,2,0)),\"Konto findes ikke!\",VLOOKUP(G255,Kontoplan!A:D,2,0)))","v":"Indkøb af øl + vand"}]
[{"$f":"IF(B256>=T!C$4,IF(B256<=T!C$5,Bogføring!G256,\"\"),\"\")","v":""},"2021-07-03",124,null,null,null,12310,null,360.94,{"$f":"IF(G256=\"\",\"\",IF(ISERROR(VLOOKUP(G256,Kontoplan!A:D,2,0)),\"Konto findes ikke!\",VLOOKUP(G256,Kontoplan!A:D,2,0)))","v":"Bank konto"}]
[{"$f":"IF(B257>=T!C$4,IF(B257<=T!C$5,Bogføring!G257,\"\"),\"\")","v":""},"2021-07-03",124,null,null,null,2025,360.94,null,{"$f":"IF(G257=\"\",\"\",IF(ISERROR(VLOOKUP(G257,Kontoplan!A:D,2,0)),\"Konto findes ikke!\",VLOOKUP(G257,Kontoplan!A:D,2,0)))","v":"Regnskabsservice"}]
[{"$f":"IF(B258>=T!C$4,IF(B258<=T!C$5,Bogføring!G258,\"\"),\"\")","v":""},"2021-07-03",125,null,null,null,12320,330,null,{"$f":"IF(G258=\"\",\"\",IF(ISERROR(VLOOKUP(G258,Kontoplan!A:D,2,0)),\"Konto findes ikke!\",VLOOKUP(G258,Kontoplan!A:D,2,0)))","v":"Kasse"}]
[{"$f":"IF(B259>=T!C$4,IF(B259<=T!C$5,Bogføring!G259,\"\"),\"\")","v":""},"2021-07-03",125,null,null,null,1010,null,330,{"$f":"IF(G259=\"\",\"\",IF(ISERROR(VLOOKUP(G259,Kontoplan!A:D,2,0)),\"Konto findes ikke!\",VLOOKUP(G259,Kontoplan!A:D,2,0)))","v":"Kiosk salg"}]
[{"$f":"IF(B260>=T!C$4,IF(B260<=T!C$5,Bogføring!G260,\"\"),\"\")","v":""},"2021-07-05",126,null,null,null,12310,null,19,{"$f":"IF(G260=\"\",\"\",IF(ISERROR(VLOOKUP(G260,Kontoplan!A:D,2,0)),\"Konto findes ikke!\",VLOOKUP(G260,Kontoplan!A:D,2,0)))","v":"Bank konto"}]
[{"$f":"IF(B261>=T!C$4,IF(B261<=T!C$5,Bogføring!G261,\"\"),\"\")","v":""},"2021-07-05",126,null,null,null,2060,19,null,{"$f":"IF(G261=\"\",\"\",IF(ISERROR(VLOOKUP(G261,Kontoplan!A:D,2,0)),\"Konto findes ikke!\",VLOOKUP(G261,Kontoplan!A:D,2,0)))","v":"Internet, mobiltelefon, Forsik."}]
[{"$f":"IF(B262>=T!C$4,IF(B262<=T!C$5,Bogføring!G262,\"\"),\"\")","v":""},"2021-07-06",127,null,null,null,12310,9995.14,null,{"$f":"IF(G262=\"\",\"\",IF(ISERROR(VLOOKUP(G262,Kontoplan!A:D,2,0)),\"Konto findes ikke!\",VLOOKUP(G262,Kontoplan!A:D,2,0)))","v":"Bank konto"}]
[{"$f":"IF(B263>=T!C$4,IF(B263<=T!C$5,Bogføring!G263,\"\"),\"\")","v":""},"2021-07-06",127,null,null,null,1000,null,9995.14,{"$f":"IF(G263=\"\",\"\",IF(ISERROR(VLOOKUP(G263,Kontoplan!A:D,2,0)),\"Konto findes ikke!\",VLOOKUP(G263,Kontoplan!A:D,2,0)))","v":"Entre"}]
[{"$f":"IF(B264>=T!C$4,IF(B264<=T!C$5,Bogføring!G264,\"\"),\"\")","v":""},"2021-07-06",128,null,null,null,12310,null,6230.35,{"$f":"IF(G264=\"\",\"\",IF(ISERROR(VLOOKUP(G264,Kontoplan!A:D,2,0)),\"Konto findes ikke!\",VLOOKUP(G264,Kontoplan!A:D,2,0)))","v":"Bank konto"}]
[{"$f":"IF(B265>=T!C$4,IF(B265<=T!C$5,Bogføring!G265,\"\"),\"\")","v":""},"2021-07-06",128,null,null,null,3110,6230.35,null,{"$f":"IF(G265=\"\",\"\",IF(ISERROR(VLOOKUP(G265,Kontoplan!A:D,2,0)),\"Konto findes ikke!\",VLOOKUP(G265,Kontoplan!A:D,2,0)))","v":"Lønninger incl ATP -AM"}]
[{"$f":"IF(B266>=T!C$4,IF(B266<=T!C$5,Bogføring!G266,\"\"),\"\")","v":""},"2021-07-07",129,null,null,null,12320,860,null,{"$f":"IF(G266=\"\",\"\",IF(ISERROR(VLOOKUP(G266,Kontoplan!A:D,2,0)),\"Konto findes ikke!\",VLOOKUP(G266,Kontoplan!A:D,2,0)))","v":"Kasse"}]
[{"$f":"IF(B267>=T!C$4,IF(B267<=T!C$5,Bogføring!G267,\"\"),\"\")","v":""},"2021-07-07",129,null,null,null,1010,null,860,{"$f":"IF(G267=\"\",\"\",IF(ISERROR(VLOOKUP(G267,Kontoplan!A:D,2,0)),\"Konto findes ikke!\",VLOOKUP(G267,Kontoplan!A:D,2,0)))","v":"Kiosk salg"}]
[{"$f":"IF(B268>=T!C$4,IF(B268<=T!C$5,Bogføring!G268,\"\"),\"\")","v":""},"2021-07-08",130,null,null,null,12320,345,null,{"$f":"IF(G268=\"\",\"\",IF(ISERROR(VLOOKUP(G268,Kontoplan!A:D,2,0)),\"Konto findes ikke!\",VLOOKUP(G268,Kontoplan!A:D,2,0)))","v":"Kasse"}]
[{"$f":"IF(B269>=T!C$4,IF(B269<=T!C$5,Bogføring!G269,\"\"),\"\")","v":""},"2021-07-08",130,null,null,null,1010,null,345,{"$f":"IF(G269=\"\",\"\",IF(ISERROR(VLOOKUP(G269,Kontoplan!A:D,2,0)),\"Konto findes ikke!\",VLOOKUP(G269,Kontoplan!A:D,2,0)))","v":"Kiosk salg"}]
[{"$f":"IF(B270>=T!C$4,IF(B270<=T!C$5,Bogføring!G270,\"\"),\"\")","v":""},"2021-07-08",131,null,null,null,12310,null,1401.19,{"$f":"IF(G270=\"\",\"\",IF(ISERROR(VLOOKUP(G270,Kontoplan!A:D,2,0)),\"Konto findes ikke!\",VLOOKUP(G270,Kontoplan!A:D,2,0)))","v":"Bank konto"}]
[{"$f":"IF(B271>=T!C$4,IF(B271<=T!C$5,Bogføring!G271,\"\"),\"\")","v":""},"2021-07-08",131,null,null,null,2165,1401.19,null,{"$f":"IF(G271=\"\",\"\",IF(ISERROR(VLOOKUP(G271,Kontoplan!A:D,2,0)),\"Konto findes ikke!\",VLOOKUP(G271,Kontoplan!A:D,2,0)))","v":"G4S tyverialarm"}]
[{"$f":"IF(B272>=T!C$4,IF(B272<=T!C$5,Bogføring!G272,\"\"),\"\")","v":""},"2021-07-08",132,null,null,null,12310,null,150,{"$f":"IF(G272=\"\",\"\",IF(ISERROR(VLOOKUP(G272,Kontoplan!A:D,2,0)),\"Konto findes ikke!\",VLOOKUP(G272,Kontoplan!A:D,2,0)))","v":"Bank konto"}]
[{"$f":"IF(B273>=T!C$4,IF(B273<=T!C$5,Bogføring!G273,\"\"),\"\")","v":""},"2021-07-08",132,null,null,null,2060,150,null,{"$f":"IF(G273=\"\",\"\",IF(ISERROR(VLOOKUP(G273,Kontoplan!A:D,2,0)),\"Konto findes ikke!\",VLOOKUP(G273,Kontoplan!A:D,2,0)))","v":"Internet, mobiltelefon, Forsik."}]
[{"$f":"IF(B274>=T!C$4,IF(B274<=T!C$5,Bogføring!G274,\"\"),\"\")","v":""},"2021-07-09",133,null,null,null,12320,185,null,{"$f":"IF(G274=\"\",\"\",IF(ISERROR(VLOOKUP(G274,Kontoplan!A:D,2,0)),\"Konto findes ikke!\",VLOOKUP(G274,Kontoplan!A:D,2,0)))","v":"Kasse"}]
[{"$f":"IF(B275>=T!C$4,IF(B275<=T!C$5,Bogføring!G275,\"\"),\"\")","v":""},"2021-07-09",133,null,null,null,1010,null,185,{"$f":"IF(G275=\"\",\"\",IF(ISERROR(VLOOKUP(G275,Kontoplan!A:D,2,0)),\"Konto findes ikke!\",VLOOKUP(G275,Kontoplan!A:D,2,0)))","v":"Kiosk salg"}]
[{"$f":"IF(B276>=T!C$4,IF(B276<=T!C$5,Bogføring!G276,\"\"),\"\")","v":""},"2021-07-10",134,null,null,null,12310,null,300,{"$f":"IF(G276=\"\",\"\",IF(ISERROR(VLOOKUP(G276,Kontoplan!A:D,2,0)),\"Konto findes ikke!\",VLOOKUP(G276,Kontoplan!A:D,2,0)))","v":"Bank konto"}]
[{"$f":"IF(B277>=T!C$4,IF(B277<=T!C$5,Bogføring!G277,\"\"),\"\")","v":""},"2021-07-10",134,null,null,null,2200,300,null,{"$f":"IF(G277=\"\",\"\",IF(ISERROR(VLOOKUP(G277,Kontoplan!A:D,2,0)),\"Konto findes ikke!\",VLOOKUP(G277,Kontoplan!A:D,2,0)))","v":"Kontingenter overført til KVB"}]
[{"$f":"IF(B278>=T!C$4,IF(B278<=T!C$5,Bogføring!G278,\"\"),\"\")","v":""},"2021-07-10",135,null,null,null,12310,null,150,{"$f":"IF(G278=\"\",\"\",IF(ISERROR(VLOOKUP(G278,Kontoplan!A:D,2,0)),\"Konto findes ikke!\",VLOOKUP(G278,Kontoplan!A:D,2,0)))","v":"Bank konto"}]
[{"$f":"IF(B279>=T!C$4,IF(B279<=T!C$5,Bogføring!G279,\"\"),\"\")","v":""},"2021-07-10",135,null,null,null,2200,150,null,{"$f":"IF(G279=\"\",\"\",IF(ISERROR(VLOOKUP(G279,Kontoplan!A:D,2,0)),\"Konto findes ikke!\",VLOOKUP(G279,Kontoplan!A:D,2,0)))","v":"Kontingenter overført til KVB"}]
[{"$f":"IF(B280>=T!C$4,IF(B280<=T!C$5,Bogføring!G280,\"\"),\"\")","v":""},"2021-07-10",136,null,null,null,12320,830,null,{"$f":"IF(G280=\"\",\"\",IF(ISERROR(VLOOKUP(G280,Kontoplan!A:D,2,0)),\"Konto findes ikke!\",VLOOKUP(G280,Kontoplan!A:D,2,0)))","v":"Kasse"}]
[{"$f":"IF(B281>=T!C$4,IF(B281<=T!C$5,Bogføring!G281,\"\"),\"\")","v":""},"2021-07-10",136,null,null,null,1010,null,830,{"$f":"IF(G281=\"\",\"\",IF(ISERROR(VLOOKUP(G281,Kontoplan!A:D,2,0)),\"Konto findes ikke!\",VLOOKUP(G281,Kontoplan!A:D,2,0)))","v":"Kiosk salg"}]
[{"$f":"IF(B282>=T!C$4,IF(B282<=T!C$5,Bogføring!G282,\"\"),\"\")","v":""},"2021-07-12",137,null,null,null,12310,null,98.95,{"$f":"IF(G282=\"\",\"\",IF(ISERROR(VLOOKUP(G282,Kontoplan!A:D,2,0)),\"Konto findes ikke!\",VLOOKUP(G282,Kontoplan!A:D,2,0)))","v":"Bank konto"}]
[{"$f":"IF(B283>=T!C$4,IF(B283<=T!C$5,Bogføring!G283,\"\"),\"\")","v":""},"2021-07-12",137,null,null,null,2190,98.95,null,{"$f":"IF(G283=\"\",\"\",IF(ISERROR(VLOOKUP(G283,Kontoplan!A:D,2,0)),\"Konto findes ikke!\",VLOOKUP(G283,Kontoplan!A:D,2,0)))","v":"Diverse Udgifter"}]
[{"$f":"IF(B284>=T!C$4,IF(B284<=T!C$5,Bogføring!G284,\"\"),\"\")","v":""},"2021-07-13",138,null,null,null,12310,20438.259999999998,null,{"$f":"IF(G284=\"\",\"\",IF(ISERROR(VLOOKUP(G284,Kontoplan!A:D,2,0)),\"Konto findes ikke!\",VLOOKUP(G284,Kontoplan!A:D,2,0)))","v":"Bank konto"}]
[{"$f":"IF(B285>=T!C$4,IF(B285<=T!C$5,Bogføring!G285,\"\"),\"\")","v":""},"2021-07-13",138,null,null,null,1000,null,20438.259999999998,{"$f":"IF(G285=\"\",\"\",IF(ISERROR(VLOOKUP(G285,Kontoplan!A:D,2,0)),\"Konto findes ikke!\",VLOOKUP(G285,Kontoplan!A:D,2,0)))","v":"Entre"}]
[{"$f":"IF(B286>=T!C$4,IF(B286<=T!C$5,Bogføring!G286,\"\"),\"\")","v":""},"2021-07-13",139,null,null,null,12310,null,150,{"$f":"IF(G286=\"\",\"\",IF(ISERROR(VLOOKUP(G286,Kontoplan!A:D,2,0)),\"Konto findes ikke!\",VLOOKUP(G286,Kontoplan!A:D,2,0)))","v":"Bank konto"}]
[{"$f":"IF(B287>=T!C$4,IF(B287<=T!C$5,Bogføring!G287,\"\"),\"\")","v":""},"2021-07-13",139,null,null,null,2060,150,null,{"$f":"IF(G287=\"\",\"\",IF(ISERROR(VLOOKUP(G287,Kontoplan!A:D,2,0)),\"Konto findes ikke!\",VLOOKUP(G287,Kontoplan!A:D,2,0)))","v":"Internet, mobiltelefon, Forsik."}]
[{"$f":"IF(B288>=T!C$4,IF(B288<=T!C$5,Bogføring!G288,\"\"),\"\")","v":""},"2021-07-14",140,null,null,null,12310,null,46.25,{"$f":"IF(G288=\"\",\"\",IF(ISERROR(VLOOKUP(G288,Kontoplan!A:D,2,0)),\"Konto findes ikke!\",VLOOKUP(G288,Kontoplan!A:D,2,0)))","v":"Bank konto"}]
[{"$f":"IF(B289>=T!C$4,IF(B289<=T!C$5,Bogføring!G289,\"\"),\"\")","v":""},"2021-07-14",140,null,null,null,2037,46.25,null,{"$f":"IF(G289=\"\",\"\",IF(ISERROR(VLOOKUP(G289,Kontoplan!A:D,2,0)),\"Konto findes ikke!\",VLOOKUP(G289,Kontoplan!A:D,2,0)))","v":"Rengørringsartikler"}]
[{"$f":"IF(B290>=T!C$4,IF(B290<=T!C$5,Bogføring!G290,\"\"),\"\")","v":""},"2021-07-14",141,null,null,null,12320,1348,null,{"$f":"IF(G290=\"\",\"\",IF(ISERROR(VLOOKUP(G290,Kontoplan!A:D,2,0)),\"Konto findes ikke!\",VLOOKUP(G290,Kontoplan!A:D,2,0)))","v":"Kasse"}]
[{"$f":"IF(B291>=T!C$4,IF(B291<=T!C$5,Bogføring!G291,\"\"),\"\")","v":""},"2021-07-14",141,null,null,null,1010,null,1348,{"$f":"IF(G291=\"\",\"\",IF(ISERROR(VLOOKUP(G291,Kontoplan!A:D,2,0)),\"Konto findes ikke!\",VLOOKUP(G291,Kontoplan!A:D,2,0)))","v":"Kiosk salg"}]
[{"$f":"IF(B292>=T!C$4,IF(B292<=T!C$5,Bogføring!G292,\"\"),\"\")","v":""},"2021-07-15",142,null,null,null,12320,383,null,{"$f":"IF(G292=\"\",\"\",IF(ISERROR(VLOOKUP(G292,Kontoplan!A:D,2,0)),\"Konto findes ikke!\",VLOOKUP(G292,Kontoplan!A:D,2,0)))","v":"Kasse"}]
[{"$f":"IF(B293>=T!C$4,IF(B293<=T!C$5,Bogføring!G293,\"\"),\"\")","v":""},"2021-07-15",142,null,null,null,1010,null,383,{"$f":"IF(G293=\"\",\"\",IF(ISERROR(VLOOKUP(G293,Kontoplan!A:D,2,0)),\"Konto findes ikke!\",VLOOKUP(G293,Kontoplan!A:D,2,0)))","v":"Kiosk salg"}]
[{"$f":"IF(B294>=T!C$4,IF(B294<=T!C$5,Bogføring!G294,\"\"),\"\")","v":""},"2021-07-15",143,null,null,null,12310,4056,null,{"$f":"IF(G294=\"\",\"\",IF(ISERROR(VLOOKUP(G294,Kontoplan!A:D,2,0)),\"Konto findes ikke!\",VLOOKUP(G294,Kontoplan!A:D,2,0)))","v":"Bank konto"}]
[{"$f":"IF(B295>=T!C$4,IF(B295<=T!C$5,Bogføring!G295,\"\"),\"\")","v":""},"2021-07-15",143,null,null,null,12320,null,4056,{"$f":"IF(G295=\"\",\"\",IF(ISERROR(VLOOKUP(G295,Kontoplan!A:D,2,0)),\"Konto findes ikke!\",VLOOKUP(G295,Kontoplan!A:D,2,0)))","v":"Kasse"}]
[{"$f":"IF(B296>=T!C$4,IF(B296<=T!C$5,Bogføring!G296,\"\"),\"\")","v":""},"2021-07-15",144,null,null,null,12310,null,132.55000000000001,{"$f":"IF(G296=\"\",\"\",IF(ISERROR(VLOOKUP(G296,Kontoplan!A:D,2,0)),\"Konto findes ikke!\",VLOOKUP(G296,Kontoplan!A:D,2,0)))","v":"Bank konto"}]
[{"$f":"IF(B297>=T!C$4,IF(B297<=T!C$5,Bogføring!G297,\"\"),\"\")","v":""},"2021-07-15",144,null,null,null,2055,132.55000000000001,null,{"$f":"IF(G297=\"\",\"\",IF(ISERROR(VLOOKUP(G297,Kontoplan!A:D,2,0)),\"Konto findes ikke!\",VLOOKUP(G297,Kontoplan!A:D,2,0)))","v":"Indkøb af øl + vand"}]
[{"$f":"IF(B298>=T!C$4,IF(B298<=T!C$5,Bogføring!G298,\"\"),\"\")","v":""},"2021-07-16",145,null,null,null,12320,130,null,{"$f":"IF(G298=\"\",\"\",IF(ISERROR(VLOOKUP(G298,Kontoplan!A:D,2,0)),\"Konto findes ikke!\",VLOOKUP(G298,Kontoplan!A:D,2,0)))","v":"Kasse"}]
[{"$f":"IF(B299>=T!C$4,IF(B299<=T!C$5,Bogføring!G299,\"\"),\"\")","v":""},"2021-07-16",145,null,null,null,1010,null,130,{"$f":"IF(G299=\"\",\"\",IF(ISERROR(VLOOKUP(G299,Kontoplan!A:D,2,0)),\"Konto findes ikke!\",VLOOKUP(G299,Kontoplan!A:D,2,0)))","v":"Kiosk salg"}]
[{"$f":"IF(B300>=T!C$4,IF(B300<=T!C$5,Bogføring!G300,\"\"),\"\")","v":""},"2021-07-17",146,null,null,null,12320,10,null,{"$f":"IF(G300=\"\",\"\",IF(ISERROR(VLOOKUP(G300,Kontoplan!A:D,2,0)),\"Konto findes ikke!\",VLOOKUP(G300,Kontoplan!A:D,2,0)))","v":"Kasse"}]
[{"$f":"IF(B301>=T!C$4,IF(B301<=T!C$5,Bogføring!G301,\"\"),\"\")","v":""},"2021-07-17",146,null,null,null,1010,null,10,{"$f":"IF(G301=\"\",\"\",IF(ISERROR(VLOOKUP(G301,Kontoplan!A:D,2,0)),\"Konto findes ikke!\",VLOOKUP(G301,Kontoplan!A:D,2,0)))","v":"Kiosk salg"}]
[{"$f":"IF(B302>=T!C$4,IF(B302<=T!C$5,Bogføring!G302,\"\"),\"\")","v":""},"2021-07-19",147,null,null,null,12310,null,44,{"$f":"IF(G302=\"\",\"\",IF(ISERROR(VLOOKUP(G302,Kontoplan!A:D,2,0)),\"Konto findes ikke!\",VLOOKUP(G302,Kontoplan!A:D,2,0)))","v":"Bank konto"}]
[{"$f":"IF(B303>=T!C$4,IF(B303<=T!C$5,Bogføring!G303,\"\"),\"\")","v":""},"2021-07-19",147,null,null,null,2110,44,null,{"$f":"IF(G303=\"\",\"\",IF(ISERROR(VLOOKUP(G303,Kontoplan!A:D,2,0)),\"Konto findes ikke!\",VLOOKUP(G303,Kontoplan!A:D,2,0)))","v":"Kontorhold - Porto - IT"}]
[{"$f":"IF(B304>=T!C$4,IF(B304<=T!C$5,Bogføring!G304,\"\"),\"\")","v":""},"2021-07-20",148,null,null,null,12310,9647.9500000000007,null,{"$f":"IF(G304=\"\",\"\",IF(ISERROR(VLOOKUP(G304,Kontoplan!A:D,2,0)),\"Konto findes ikke!\",VLOOKUP(G304,Kontoplan!A:D,2,0)))","v":"Bank konto"}]
[{"$f":"IF(B305>=T!C$4,IF(B305<=T!C$5,Bogføring!G305,\"\"),\"\")","v":""},"2021-07-20",148,null,null,null,1000,null,9647.9500000000007,{"$f":"IF(G305=\"\",\"\",IF(ISERROR(VLOOKUP(G305,Kontoplan!A:D,2,0)),\"Konto findes ikke!\",VLOOKUP(G305,Kontoplan!A:D,2,0)))","v":"Entre"}]
[{"$f":"IF(B306>=T!C$4,IF(B306<=T!C$5,Bogføring!G306,\"\"),\"\")","v":""},"2021-07-21",149,null,null,null,12310,null,150,{"$f":"IF(G306=\"\",\"\",IF(ISERROR(VLOOKUP(G306,Kontoplan!A:D,2,0)),\"Konto findes ikke!\",VLOOKUP(G306,Kontoplan!A:D,2,0)))","v":"Bank konto"}]
[{"$f":"IF(B307>=T!C$4,IF(B307<=T!C$5,Bogføring!G307,\"\"),\"\")","v":""},"2021-07-21",149,null,null,null,2060,150,null,{"$f":"IF(G307=\"\",\"\",IF(ISERROR(VLOOKUP(G307,Kontoplan!A:D,2,0)),\"Konto findes ikke!\",VLOOKUP(G307,Kontoplan!A:D,2,0)))","v":"Internet, mobiltelefon, Forsik."}]
[{"$f":"IF(B308>=T!C$4,IF(B308<=T!C$5,Bogføring!G308,\"\"),\"\")","v":""},"2021-07-21",150,null,null,null,12320,1400,null,{"$f":"IF(G308=\"\",\"\",IF(ISERROR(VLOOKUP(G308,Kontoplan!A:D,2,0)),\"Konto findes ikke!\",VLOOKUP(G308,Kontoplan!A:D,2,0)))","v":"Kasse"}]
[{"$f":"IF(B309>=T!C$4,IF(B309<=T!C$5,Bogføring!G309,\"\"),\"\")","v":""},"2021-07-21",150,null,null,null,1010,null,1400,{"$f":"IF(G309=\"\",\"\",IF(ISERROR(VLOOKUP(G309,Kontoplan!A:D,2,0)),\"Konto findes ikke!\",VLOOKUP(G309,Kontoplan!A:D,2,0)))","v":"Kiosk salg"}]
[{"$f":"IF(B310>=T!C$4,IF(B310<=T!C$5,Bogføring!G310,\"\"),\"\")","v":""},"2021-07-22",151,null,null,null,12310,null,1664.79,{"$f":"IF(G310=\"\",\"\",IF(ISERROR(VLOOKUP(G310,Kontoplan!A:D,2,0)),\"Konto findes ikke!\",VLOOKUP(G310,Kontoplan!A:D,2,0)))","v":"Bank konto"}]
[{"$f":"IF(B311>=T!C$4,IF(B311<=T!C$5,Bogføring!G311,\"\"),\"\")","v":""},"2021-07-22",151,null,null,null,2110,1664.79,null,{"$f":"IF(G311=\"\",\"\",IF(ISERROR(VLOOKUP(G311,Kontoplan!A:D,2,0)),\"Konto findes ikke!\",VLOOKUP(G311,Kontoplan!A:D,2,0)))","v":"Kontorhold - Porto - IT"}]
[{"$f":"IF(B312>=T!C$4,IF(B312<=T!C$5,Bogføring!G312,\"\"),\"\")","v":""},"2021-07-22",152,null,null,null,12310,null,482.41,{"$f":"IF(G312=\"\",\"\",IF(ISERROR(VLOOKUP(G312,Kontoplan!A:D,2,0)),\"Konto findes ikke!\",VLOOKUP(G312,Kontoplan!A:D,2,0)))","v":"Bank konto"}]
[{"$f":"IF(B313>=T!C$4,IF(B313<=T!C$5,Bogføring!G313,\"\"),\"\")","v":""},"2021-07-22",152,null,null,null,2080,482.41,null,{"$f":"IF(G313=\"\",\"\",IF(ISERROR(VLOOKUP(G313,Kontoplan!A:D,2,0)),\"Konto findes ikke!\",VLOOKUP(G313,Kontoplan!A:D,2,0)))","v":"Indkøb af bøger"}]
[{"$f":"IF(B314>=T!C$4,IF(B314<=T!C$5,Bogføring!G314,\"\"),\"\")","v":""},"2021-07-22",153,null,null,null,12310,null,2357.04,{"$f":"IF(G314=\"\",\"\",IF(ISERROR(VLOOKUP(G314,Kontoplan!A:D,2,0)),\"Konto findes ikke!\",VLOOKUP(G314,Kontoplan!A:D,2,0)))","v":"Bank konto"}]
[{"$f":"IF(B315>=T!C$4,IF(B315<=T!C$5,Bogføring!G315,\"\"),\"\")","v":""},"2021-07-22",153,null,null,null,2130,2357.04,null,{"$f":"IF(G315=\"\",\"\",IF(ISERROR(VLOOKUP(G315,Kontoplan!A:D,2,0)),\"Konto findes ikke!\",VLOOKUP(G315,Kontoplan!A:D,2,0)))","v":"Annoncer"}]
[{"$f":"IF(B316>=T!C$4,IF(B316<=T!C$5,Bogføring!G316,\"\"),\"\")","v":""},"2021-07-22",154,null,null,null,12320,580,null,{"$f":"IF(G316=\"\",\"\",IF(ISERROR(VLOOKUP(G316,Kontoplan!A:D,2,0)),\"Konto findes ikke!\",VLOOKUP(G316,Kontoplan!A:D,2,0)))","v":"Kasse"}]
[{"$f":"IF(B317>=T!C$4,IF(B317<=T!C$5,Bogføring!G317,\"\"),\"\")","v":""},"2021-07-22",154,null,null,null,1010,null,580,{"$f":"IF(G317=\"\",\"\",IF(ISERROR(VLOOKUP(G317,Kontoplan!A:D,2,0)),\"Konto findes ikke!\",VLOOKUP(G317,Kontoplan!A:D,2,0)))","v":"Kiosk salg"}]
[{"$f":"IF(B318>=T!C$4,IF(B318<=T!C$5,Bogføring!G318,\"\"),\"\")","v":""},"2021-07-23",155,null,null,null,12320,890,null,{"$f":"IF(G318=\"\",\"\",IF(ISERROR(VLOOKUP(G318,Kontoplan!A:D,2,0)),\"Konto findes ikke!\",VLOOKUP(G318,Kontoplan!A:D,2,0)))","v":"Kasse"}]
[{"$f":"IF(B319>=T!C$4,IF(B319<=T!C$5,Bogføring!G319,\"\"),\"\")","v":""},"2021-07-23",155,null,null,null,1010,null,890,{"$f":"IF(G319=\"\",\"\",IF(ISERROR(VLOOKUP(G319,Kontoplan!A:D,2,0)),\"Konto findes ikke!\",VLOOKUP(G319,Kontoplan!A:D,2,0)))","v":"Kiosk salg"}]
[{"$f":"IF(B320>=T!C$4,IF(B320<=T!C$5,Bogføring!G320,\"\"),\"\")","v":""},"2021-07-24",156,null,null,null,12320,1113,null,{"$f":"IF(G320=\"\",\"\",IF(ISERROR(VLOOKUP(G320,Kontoplan!A:D,2,0)),\"Konto findes ikke!\",VLOOKUP(G320,Kontoplan!A:D,2,0)))","v":"Kasse"}]
[{"$f":"IF(B321>=T!C$4,IF(B321<=T!C$5,Bogføring!G321,\"\"),\"\")","v":""},"2021-07-24",156,null,null,null,1010,null,1113,{"$f":"IF(G321=\"\",\"\",IF(ISERROR(VLOOKUP(G321,Kontoplan!A:D,2,0)),\"Konto findes ikke!\",VLOOKUP(G321,Kontoplan!A:D,2,0)))","v":"Kiosk salg"}]
[{"$f":"IF(B322>=T!C$4,IF(B322<=T!C$5,Bogføring!G322,\"\"),\"\")","v":""},"2021-07-26",157,null,null,null,12310,null,110.1,{"$f":"IF(G322=\"\",\"\",IF(ISERROR(VLOOKUP(G322,Kontoplan!A:D,2,0)),\"Konto findes ikke!\",VLOOKUP(G322,Kontoplan!A:D,2,0)))","v":"Bank konto"}]
[{"$f":"IF(B323>=T!C$4,IF(B323<=T!C$5,Bogføring!G323,\"\"),\"\")","v":""},"2021-07-26",157,null,null,null,2060,110.1,null,{"$f":"IF(G323=\"\",\"\",IF(ISERROR(VLOOKUP(G323,Kontoplan!A:D,2,0)),\"Konto findes ikke!\",VLOOKUP(G323,Kontoplan!A:D,2,0)))","v":"Internet, mobiltelefon, Forsik."}]
[{"$f":"IF(B324>=T!C$4,IF(B324<=T!C$5,Bogføring!G324,\"\"),\"\")","v":""},"2021-07-26",158,null,null,null,12310,null,200,{"$f":"IF(G324=\"\",\"\",IF(ISERROR(VLOOKUP(G324,Kontoplan!A:D,2,0)),\"Konto findes ikke!\",VLOOKUP(G324,Kontoplan!A:D,2,0)))","v":"Bank konto"}]
[{"$f":"IF(B325>=T!C$4,IF(B325<=T!C$5,Bogføring!G325,\"\"),\"\")","v":""},"2021-07-26",158,null,null,null,2060,200,null,{"$f":"IF(G325=\"\",\"\",IF(ISERROR(VLOOKUP(G325,Kontoplan!A:D,2,0)),\"Konto findes ikke!\",VLOOKUP(G325,Kontoplan!A:D,2,0)))","v":"Internet, mobiltelefon, Forsik."}]
[{"$f":"IF(B326>=T!C$4,IF(B326<=T!C$5,Bogføring!G326,\"\"),\"\")","v":""},"2021-07-26",159,null,null,null,12310,null,2375,{"$f":"IF(G326=\"\",\"\",IF(ISERROR(VLOOKUP(G326,Kontoplan!A:D,2,0)),\"Konto findes ikke!\",VLOOKUP(G326,Kontoplan!A:D,2,0)))","v":"Bank konto"}]
[{"$f":"IF(B327>=T!C$4,IF(B327<=T!C$5,Bogføring!G327,\"\"),\"\")","v":""},"2021-07-26",159,null,null,null,2130,2375,null,{"$f":"IF(G327=\"\",\"\",IF(ISERROR(VLOOKUP(G327,Kontoplan!A:D,2,0)),\"Konto findes ikke!\",VLOOKUP(G327,Kontoplan!A:D,2,0)))","v":"Annoncer"}]
[{"$f":"IF(B328>=T!C$4,IF(B328<=T!C$5,Bogføring!G328,\"\"),\"\")","v":""},"2021-07-26",160,null,null,null,12310,null,500,{"$f":"IF(G328=\"\",\"\",IF(ISERROR(VLOOKUP(G328,Kontoplan!A:D,2,0)),\"Konto findes ikke!\",VLOOKUP(G328,Kontoplan!A:D,2,0)))","v":"Bank konto"}]
[{"$f":"IF(B329>=T!C$4,IF(B329<=T!C$5,Bogføring!G329,\"\"),\"\")","v":""},"2021-07-26",160,null,null,null,2015,500,null,{"$f":"IF(G329=\"\",\"\",IF(ISERROR(VLOOKUP(G329,Kontoplan!A:D,2,0)),\"Konto findes ikke!\",VLOOKUP(G329,Kontoplan!A:D,2,0)))","v":"Advokat"}]
[{"$f":"IF(B330>=T!C$4,IF(B330<=T!C$5,Bogføring!G330,\"\"),\"\")","v":""},"2021-07-27",161,null,null,null,12310,12334.56,null,{"$f":"IF(G330=\"\",\"\",IF(ISERROR(VLOOKUP(G330,Kontoplan!A:D,2,0)),\"Konto findes ikke!\",VLOOKUP(G330,Kontoplan!A:D,2,0)))","v":"Bank konto"}]
[{"$f":"IF(B331>=T!C$4,IF(B331<=T!C$5,Bogføring!G331,\"\"),\"\")","v":""},"2021-07-27",161,null,null,null,1000,null,12334.56,{"$f":"IF(G331=\"\",\"\",IF(ISERROR(VLOOKUP(G331,Kontoplan!A:D,2,0)),\"Konto findes ikke!\",VLOOKUP(G331,Kontoplan!A:D,2,0)))","v":"Entre"}]
[{"$f":"IF(B332>=T!C$4,IF(B332<=T!C$5,Bogføring!G332,\"\"),\"\")","v":""},"2021-07-28",162,null,null,null,12320,null,5037,{"$f":"IF(G332=\"\",\"\",IF(ISERROR(VLOOKUP(G332,Kontoplan!A:D,2,0)),\"Konto findes ikke!\",VLOOKUP(G332,Kontoplan!A:D,2,0)))","v":"Kasse"}]
[{"$f":"IF(B333>=T!C$4,IF(B333<=T!C$5,Bogføring!G333,\"\"),\"\")","v":""},"2021-07-28",162,null,null,null,12310,5037,null,{"$f":"IF(G333=\"\",\"\",IF(ISERROR(VLOOKUP(G333,Kontoplan!A:D,2,0)),\"Konto findes ikke!\",VLOOKUP(G333,Kontoplan!A:D,2,0)))","v":"Bank konto"}]
[{"$f":"IF(B334>=T!C$4,IF(B334<=T!C$5,Bogføring!G334,\"\"),\"\")","v":""},"2021-07-28",163,null,null,null,12310,null,150,{"$f":"IF(G334=\"\",\"\",IF(ISERROR(VLOOKUP(G334,Kontoplan!A:D,2,0)),\"Konto findes ikke!\",VLOOKUP(G334,Kontoplan!A:D,2,0)))","v":"Bank konto"}]
[{"$f":"IF(B335>=T!C$4,IF(B335<=T!C$5,Bogføring!G335,\"\"),\"\")","v":""},"2021-07-28",163,null,null,null,2200,150,null,{"$f":"IF(G335=\"\",\"\",IF(ISERROR(VLOOKUP(G335,Kontoplan!A:D,2,0)),\"Konto findes ikke!\",VLOOKUP(G335,Kontoplan!A:D,2,0)))","v":"Kontingenter overført til KVB"}]
[{"$f":"IF(B336>=T!C$4,IF(B336<=T!C$5,Bogføring!G336,\"\"),\"\")","v":""},"2021-07-28",164,null,null,null,12310,null,283.95,{"$f":"IF(G336=\"\",\"\",IF(ISERROR(VLOOKUP(G336,Kontoplan!A:D,2,0)),\"Konto findes ikke!\",VLOOKUP(G336,Kontoplan!A:D,2,0)))","v":"Bank konto"}]
[{"$f":"IF(B337>=T!C$4,IF(B337<=T!C$5,Bogføring!G337,\"\"),\"\")","v":""},"2021-07-28",164,null,null,null,3120,283.95,null,{"$f":"IF(G337=\"\",\"\",IF(ISERROR(VLOOKUP(G337,Kontoplan!A:D,2,0)),\"Konto findes ikke!\",VLOOKUP(G337,Kontoplan!A:D,2,0)))","v":"ATP"}]
[{"$f":"IF(B338>=T!C$4,IF(B338<=T!C$5,Bogføring!G338,\"\"),\"\")","v":""},"2021-07-28",165,null,null,null,12320,675,null,{"$f":"IF(G338=\"\",\"\",IF(ISERROR(VLOOKUP(G338,Kontoplan!A:D,2,0)),\"Konto findes ikke!\",VLOOKUP(G338,Kontoplan!A:D,2,0)))","v":"Kasse"}]
[{"$f":"IF(B339>=T!C$4,IF(B339<=T!C$5,Bogføring!G339,\"\"),\"\")","v":""},"2021-07-28",165,null,null,null,1010,null,675,{"$f":"IF(G339=\"\",\"\",IF(ISERROR(VLOOKUP(G339,Kontoplan!A:D,2,0)),\"Konto findes ikke!\",VLOOKUP(G339,Kontoplan!A:D,2,0)))","v":"Kiosk salg"}]
[{"$f":"IF(B340>=T!C$4,IF(B340<=T!C$5,Bogføring!G340,\"\"),\"\")","v":""},"2021-07-29",166,null,null,null,12320,320,null,{"$f":"IF(G340=\"\",\"\",IF(ISERROR(VLOOKUP(G340,Kontoplan!A:D,2,0)),\"Konto findes ikke!\",VLOOKUP(G340,Kontoplan!A:D,2,0)))","v":"Kasse"}]
[{"$f":"IF(B341>=T!C$4,IF(B341<=T!C$5,Bogføring!G341,\"\"),\"\")","v":""},"2021-07-29",166,null,null,null,1010,null,320,{"$f":"IF(G341=\"\",\"\",IF(ISERROR(VLOOKUP(G341,Kontoplan!A:D,2,0)),\"Konto findes ikke!\",VLOOKUP(G341,Kontoplan!A:D,2,0)))","v":"Kiosk salg"}]
[{"$f":"IF(B342>=T!C$4,IF(B342<=T!C$5,Bogføring!G342,\"\"),\"\")","v":""},"2021-07-29",167,null,null,null,12310,null,56.85,{"$f":"IF(G342=\"\",\"\",IF(ISERROR(VLOOKUP(G342,Kontoplan!A:D,2,0)),\"Konto findes ikke!\",VLOOKUP(G342,Kontoplan!A:D,2,0)))","v":"Bank konto"}]
[{"$f":"IF(B343>=T!C$4,IF(B343<=T!C$5,Bogføring!G343,\"\"),\"\")","v":""},"2021-07-29",167,null,null,null,2037,56.85,null,{"$f":"IF(G343=\"\",\"\",IF(ISERROR(VLOOKUP(G343,Kontoplan!A:D,2,0)),\"Konto findes ikke!\",VLOOKUP(G343,Kontoplan!A:D,2,0)))","v":"Rengørringsartikler"}]
[{"$f":"IF(B344>=T!C$4,IF(B344<=T!C$5,Bogføring!G344,\"\"),\"\")","v":""},"2021-07-29",168,null,null,null,12310,null,49.8,{"$f":"IF(G344=\"\",\"\",IF(ISERROR(VLOOKUP(G344,Kontoplan!A:D,2,0)),\"Konto findes ikke!\",VLOOKUP(G344,Kontoplan!A:D,2,0)))","v":"Bank konto"}]
[{"$f":"IF(B345>=T!C$4,IF(B345<=T!C$5,Bogføring!G345,\"\"),\"\")","v":""},"2021-07-29",168,null,null,null,2055,49.8,null,{"$f":"IF(G345=\"\",\"\",IF(ISERROR(VLOOKUP(G345,Kontoplan!A:D,2,0)),\"Konto findes ikke!\",VLOOKUP(G345,Kontoplan!A:D,2,0)))","v":"Indkøb af øl + vand"}]
[{"$f":"IF(B346>=T!C$4,IF(B346<=T!C$5,Bogføring!G346,\"\"),\"\")","v":""},"2021-07-30",169,null,null,null,12320,205,null,{"$f":"IF(G346=\"\",\"\",IF(ISERROR(VLOOKUP(G346,Kontoplan!A:D,2,0)),\"Konto findes ikke!\",VLOOKUP(G346,Kontoplan!A:D,2,0)))","v":"Kasse"}]
[{"$f":"IF(B347>=T!C$4,IF(B347<=T!C$5,Bogføring!G347,\"\"),\"\")","v":""},"2021-07-30",169,null,null,null,1010,null,205,{"$f":"IF(G347=\"\",\"\",IF(ISERROR(VLOOKUP(G347,Kontoplan!A:D,2,0)),\"Konto findes ikke!\",VLOOKUP(G347,Kontoplan!A:D,2,0)))","v":"Kiosk salg"}]
[{"$f":"IF(B348>=T!C$4,IF(B348<=T!C$5,Bogføring!G348,\"\"),\"\")","v":""},"2021-07-31",170,null,null,null,12320,205,null,{"$f":"IF(G348=\"\",\"\",IF(ISERROR(VLOOKUP(G348,Kontoplan!A:D,2,0)),\"Konto findes ikke!\",VLOOKUP(G348,Kontoplan!A:D,2,0)))","v":"Kasse"}]
[{"$f":"IF(B349>=T!C$4,IF(B349<=T!C$5,Bogføring!G349,\"\"),\"\")","v":""},"2021-07-31",170,null,null,null,1010,null,205,{"$f":"IF(G349=\"\",\"\",IF(ISERROR(VLOOKUP(G349,Kontoplan!A:D,2,0)),\"Konto findes ikke!\",VLOOKUP(G349,Kontoplan!A:D,2,0)))","v":"Kiosk salg"}]
[{"$f":"IF(B350>=T!C$4,IF(B350<=T!C$5,Bogføring!G350,\"\"),\"\")","v":""},"2021-08-01",171,null,null,null,12310,null,0.5,{"$f":"IF(G350=\"\",\"\",IF(ISERROR(VLOOKUP(G350,Kontoplan!A:D,2,0)),\"Konto findes ikke!\",VLOOKUP(G350,Kontoplan!A:D,2,0)))","v":"Bank konto"}]
[{"$f":"IF(B351>=T!C$4,IF(B351<=T!C$5,Bogføring!G351,\"\"),\"\")","v":""},"2021-08-01",171,null,null,null,2000,0.5,null,{"$f":"IF(G351=\"\",\"\",IF(ISERROR(VLOOKUP(G351,Kontoplan!A:D,2,0)),\"Konto findes ikke!\",VLOOKUP(G351,Kontoplan!A:D,2,0)))","v":"Bankgebyr"}]
[{"$f":"IF(B352>=T!C$4,IF(B352<=T!C$5,Bogføring!G352,\"\"),\"\")","v":""},"2021-08-02",172,null,null,null,12310,null,414,{"$f":"IF(G352=\"\",\"\",IF(ISERROR(VLOOKUP(G352,Kontoplan!A:D,2,0)),\"Konto findes ikke!\",VLOOKUP(G352,Kontoplan!A:D,2,0)))","v":"Bank konto"}]
[{"$f":"IF(B353>=T!C$4,IF(B353<=T!C$5,Bogføring!G353,\"\"),\"\")","v":""},"2021-08-02",172,null,null,null,2060,414,null,{"$f":"IF(G353=\"\",\"\",IF(ISERROR(VLOOKUP(G353,Kontoplan!A:D,2,0)),\"Konto findes ikke!\",VLOOKUP(G353,Kontoplan!A:D,2,0)))","v":"Internet, mobiltelefon, Forsik."}]
[{"$f":"IF(B354>=T!C$4,IF(B354<=T!C$5,Bogføring!G354,\"\"),\"\")","v":""},"2021-08-02",173,null,null,null,12310,null,4232.54,{"$f":"IF(G354=\"\",\"\",IF(ISERROR(VLOOKUP(G354,Kontoplan!A:D,2,0)),\"Konto findes ikke!\",VLOOKUP(G354,Kontoplan!A:D,2,0)))","v":"Bank konto"}]
[{"$f":"IF(B355>=T!C$4,IF(B355<=T!C$5,Bogføring!G355,\"\"),\"\")","v":""},"2021-08-02",173,null,null,null,2040,4232.54,null,{"$f":"IF(G355=\"\",\"\",IF(ISERROR(VLOOKUP(G355,Kontoplan!A:D,2,0)),\"Konto findes ikke!\",VLOOKUP(G355,Kontoplan!A:D,2,0)))","v":"El, Vand og Varme"}]
[{"$f":"IF(B356>=T!C$4,IF(B356<=T!C$5,Bogføring!G356,\"\"),\"\")","v":""},"2021-08-02",174,null,null,null,12310,null,1617.87,{"$f":"IF(G356=\"\",\"\",IF(ISERROR(VLOOKUP(G356,Kontoplan!A:D,2,0)),\"Konto findes ikke!\",VLOOKUP(G356,Kontoplan!A:D,2,0)))","v":"Bank konto"}]
[{"$f":"IF(B357>=T!C$4,IF(B357<=T!C$5,Bogføring!G357,\"\"),\"\")","v":""},"2021-08-02",174,null,null,null,2040,1617.87,null,{"$f":"IF(G357=\"\",\"\",IF(ISERROR(VLOOKUP(G357,Kontoplan!A:D,2,0)),\"Konto findes ikke!\",VLOOKUP(G357,Kontoplan!A:D,2,0)))","v":"El, Vand og Varme"}]
[{"$f":"IF(B358>=T!C$4,IF(B358<=T!C$5,Bogføring!G358,\"\"),\"\")","v":""},"2021-08-02",175,null,null,null,12310,null,192.5,{"$f":"IF(G358=\"\",\"\",IF(ISERROR(VLOOKUP(G358,Kontoplan!A:D,2,0)),\"Konto findes ikke!\",VLOOKUP(G358,Kontoplan!A:D,2,0)))","v":"Bank konto"}]
[{"$f":"IF(B359>=T!C$4,IF(B359<=T!C$5,Bogføring!G359,\"\"),\"\")","v":""},"2021-08-02",175,null,null,null,2010,192.5,null,{"$f":"IF(G359=\"\",\"\",IF(ISERROR(VLOOKUP(G359,Kontoplan!A:D,2,0)),\"Konto findes ikke!\",VLOOKUP(G359,Kontoplan!A:D,2,0)))","v":"Danløn"}]
[{"$f":"IF(B360>=T!C$4,IF(B360<=T!C$5,Bogføring!G360,\"\"),\"\")","v":""},"2021-08-03",176,null,null,null,12310,14339.59,null,{"$f":"IF(G360=\"\",\"\",IF(ISERROR(VLOOKUP(G360,Kontoplan!A:D,2,0)),\"Konto findes ikke!\",VLOOKUP(G360,Kontoplan!A:D,2,0)))","v":"Bank konto"}]
[{"$f":"IF(B361>=T!C$4,IF(B361<=T!C$5,Bogføring!G361,\"\"),\"\")","v":""},"2021-08-03",176,null,null,null,1000,null,14339.59,{"$f":"IF(G361=\"\",\"\",IF(ISERROR(VLOOKUP(G361,Kontoplan!A:D,2,0)),\"Konto findes ikke!\",VLOOKUP(G361,Kontoplan!A:D,2,0)))","v":"Entre"}]
[{"$f":"IF(B362>=T!C$4,IF(B362<=T!C$5,Bogføring!G362,\"\"),\"\")","v":""},"2021-08-03",177,null,null,null,12310,null,300,{"$f":"IF(G362=\"\",\"\",IF(ISERROR(VLOOKUP(G362,Kontoplan!A:D,2,0)),\"Konto findes ikke!\",VLOOKUP(G362,Kontoplan!A:D,2,0)))","v":"Bank konto"}]
[{"$f":"IF(B363>=T!C$4,IF(B363<=T!C$5,Bogføring!G363,\"\"),\"\")","v":""},"2021-08-03",177,null,null,null,2060,300,null,{"$f":"IF(G363=\"\",\"\",IF(ISERROR(VLOOKUP(G363,Kontoplan!A:D,2,0)),\"Konto findes ikke!\",VLOOKUP(G363,Kontoplan!A:D,2,0)))","v":"Internet, mobiltelefon, Forsik."}]
[{"$f":"IF(B364>=T!C$4,IF(B364<=T!C$5,Bogføring!G364,\"\"),\"\")","v":""},"2021-08-03",178,null,null,null,12310,null,36.68,{"$f":"IF(G364=\"\",\"\",IF(ISERROR(VLOOKUP(G364,Kontoplan!A:D,2,0)),\"Konto findes ikke!\",VLOOKUP(G364,Kontoplan!A:D,2,0)))","v":"Bank konto"}]
[{"$f":"IF(B365>=T!C$4,IF(B365<=T!C$5,Bogføring!G365,\"\"),\"\")","v":""},"2021-08-03",178,null,null,null,2060,36.68,null,{"$f":"IF(G365=\"\",\"\",IF(ISERROR(VLOOKUP(G365,Kontoplan!A:D,2,0)),\"Konto findes ikke!\",VLOOKUP(G365,Kontoplan!A:D,2,0)))","v":"Internet, mobiltelefon, Forsik."}]
[{"$f":"IF(B366>=T!C$4,IF(B366<=T!C$5,Bogføring!G366,\"\"),\"\")","v":""},"2021-08-04",179,null,null,null,12310,null,6743.45,{"$f":"IF(G366=\"\",\"\",IF(ISERROR(VLOOKUP(G366,Kontoplan!A:D,2,0)),\"Konto findes ikke!\",VLOOKUP(G366,Kontoplan!A:D,2,0)))","v":"Bank konto"}]
[{"$f":"IF(B367>=T!C$4,IF(B367<=T!C$5,Bogføring!G367,\"\"),\"\")","v":""},"2021-08-04",179,null,null,null,3110,6743.45,null,{"$f":"IF(G367=\"\",\"\",IF(ISERROR(VLOOKUP(G367,Kontoplan!A:D,2,0)),\"Konto findes ikke!\",VLOOKUP(G367,Kontoplan!A:D,2,0)))","v":"Lønninger incl ATP -AM"}]
[{"$f":"IF(B368>=T!C$4,IF(B368<=T!C$5,Bogføring!G368,\"\"),\"\")","v":""},"2021-08-04",180,null,null,null,12310,null,150,{"$f":"IF(G368=\"\",\"\",IF(ISERROR(VLOOKUP(G368,Kontoplan!A:D,2,0)),\"Konto findes ikke!\",VLOOKUP(G368,Kontoplan!A:D,2,0)))","v":"Bank konto"}]
[{"$f":"IF(B369>=T!C$4,IF(B369<=T!C$5,Bogføring!G369,\"\"),\"\")","v":""},"2021-08-04",180,null,null,null,2200,150,null,{"$f":"IF(G369=\"\",\"\",IF(ISERROR(VLOOKUP(G369,Kontoplan!A:D,2,0)),\"Konto findes ikke!\",VLOOKUP(G369,Kontoplan!A:D,2,0)))","v":"Kontingenter overført til KVB"}]
[{"$f":"IF(B370>=T!C$4,IF(B370<=T!C$5,Bogføring!G370,\"\"),\"\")","v":""},"2021-08-04",181,null,null,null,12320,745,null,{"$f":"IF(G370=\"\",\"\",IF(ISERROR(VLOOKUP(G370,Kontoplan!A:D,2,0)),\"Konto findes ikke!\",VLOOKUP(G370,Kontoplan!A:D,2,0)))","v":"Kasse"}]
[{"$f":"IF(B371>=T!C$4,IF(B371<=T!C$5,Bogføring!G371,\"\"),\"\")","v":""},"2021-08-04",181,null,null,null,1010,null,745,{"$f":"IF(G371=\"\",\"\",IF(ISERROR(VLOOKUP(G371,Kontoplan!A:D,2,0)),\"Konto findes ikke!\",VLOOKUP(G371,Kontoplan!A:D,2,0)))","v":"Kiosk salg"}]
[{"$f":"IF(B372>=T!C$4,IF(B372<=T!C$5,Bogføring!G372,\"\"),\"\")","v":""},"2021-08-05",182,null,null,null,12310,null,19,{"$f":"IF(G372=\"\",\"\",IF(ISERROR(VLOOKUP(G372,Kontoplan!A:D,2,0)),\"Konto findes ikke!\",VLOOKUP(G372,Kontoplan!A:D,2,0)))","v":"Bank konto"}]
[{"$f":"IF(B373>=T!C$4,IF(B373<=T!C$5,Bogføring!G373,\"\"),\"\")","v":""},"2021-08-05",182,null,null,null,2060,19,null,{"$f":"IF(G373=\"\",\"\",IF(ISERROR(VLOOKUP(G373,Kontoplan!A:D,2,0)),\"Konto findes ikke!\",VLOOKUP(G373,Kontoplan!A:D,2,0)))","v":"Internet, mobiltelefon, Forsik."}]
[{"$f":"IF(B374>=T!C$4,IF(B374<=T!C$5,Bogføring!G374,\"\"),\"\")","v":""},"2021-08-05",183,null,null,null,12310,null,120.31,{"$f":"IF(G374=\"\",\"\",IF(ISERROR(VLOOKUP(G374,Kontoplan!A:D,2,0)),\"Konto findes ikke!\",VLOOKUP(G374,Kontoplan!A:D,2,0)))","v":"Bank konto"}]
[{"$f":"IF(B375>=T!C$4,IF(B375<=T!C$5,Bogføring!G375,\"\"),\"\")","v":""},"2021-08-05",183,null,null,null,2025,120.31,null,{"$f":"IF(G375=\"\",\"\",IF(ISERROR(VLOOKUP(G375,Kontoplan!A:D,2,0)),\"Konto findes ikke!\",VLOOKUP(G375,Kontoplan!A:D,2,0)))","v":"Regnskabsservice"}]
[{"$f":"IF(B376>=T!C$4,IF(B376<=T!C$5,Bogføring!G376,\"\"),\"\")","v":""},"2021-08-05",184,null,null,null,12320,705,null,{"$f":"IF(G376=\"\",\"\",IF(ISERROR(VLOOKUP(G376,Kontoplan!A:D,2,0)),\"Konto findes ikke!\",VLOOKUP(G376,Kontoplan!A:D,2,0)))","v":"Kasse"}]
[{"$f":"IF(B377>=T!C$4,IF(B377<=T!C$5,Bogføring!G377,\"\"),\"\")","v":""},"2021-08-05",184,null,null,null,1010,null,705,{"$f":"IF(G377=\"\",\"\",IF(ISERROR(VLOOKUP(G377,Kontoplan!A:D,2,0)),\"Konto findes ikke!\",VLOOKUP(G377,Kontoplan!A:D,2,0)))","v":"Kiosk salg"}]
[{"$f":"IF(B378>=T!C$4,IF(B378<=T!C$5,Bogføring!G378,\"\"),\"\")","v":""},"2021-08-06",185,null,null,null,12310,null,75.95,{"$f":"IF(G378=\"\",\"\",IF(ISERROR(VLOOKUP(G378,Kontoplan!A:D,2,0)),\"Konto findes ikke!\",VLOOKUP(G378,Kontoplan!A:D,2,0)))","v":"Bank konto"}]
[{"$f":"IF(B379>=T!C$4,IF(B379<=T!C$5,Bogføring!G379,\"\"),\"\")","v":""},"2021-08-06",185,null,null,null,2100,75.95,null,{"$f":"IF(G379=\"\",\"\",IF(ISERROR(VLOOKUP(G379,Kontoplan!A:D,2,0)),\"Konto findes ikke!\",VLOOKUP(G379,Kontoplan!A:D,2,0)))","v":"Forplejning til møder/Rejser"}]
[{"$f":"IF(B380>=T!C$4,IF(B380<=T!C$5,Bogføring!G380,\"\"),\"\")","v":""},"2021-08-06",186,null,null,null,12310,null,9675,{"$f":"IF(G380=\"\",\"\",IF(ISERROR(VLOOKUP(G380,Kontoplan!A:D,2,0)),\"Konto findes ikke!\",VLOOKUP(G380,Kontoplan!A:D,2,0)))","v":"Bank konto"}]
[{"$f":"IF(B381>=T!C$4,IF(B381<=T!C$5,Bogføring!G381,\"\"),\"\")","v":""},"2021-08-06",186,null,null,null,3100,9675,null,{"$f":"IF(G381=\"\",\"\",IF(ISERROR(VLOOKUP(G381,Kontoplan!A:D,2,0)),\"Konto findes ikke!\",VLOOKUP(G381,Kontoplan!A:D,2,0)))","v":"Lønomkostninger"}]
[{"$f":"IF(B382>=T!C$4,IF(B382<=T!C$5,Bogføring!G382,\"\"),\"\")","v":""},"2021-08-06",187,null,null,null,12310,null,3225,{"$f":"IF(G382=\"\",\"\",IF(ISERROR(VLOOKUP(G382,Kontoplan!A:D,2,0)),\"Konto findes ikke!\",VLOOKUP(G382,Kontoplan!A:D,2,0)))","v":"Bank konto"}]
[{"$f":"IF(B383>=T!C$4,IF(B383<=T!C$5,Bogføring!G383,\"\"),\"\")","v":""},"2021-08-06",187,null,null,null,3100,3225,null,{"$f":"IF(G383=\"\",\"\",IF(ISERROR(VLOOKUP(G383,Kontoplan!A:D,2,0)),\"Konto findes ikke!\",VLOOKUP(G383,Kontoplan!A:D,2,0)))","v":"Lønomkostninger"}]
[{"$f":"IF(B384>=T!C$4,IF(B384<=T!C$5,Bogføring!G384,\"\"),\"\")","v":""},"2021-08-06",188,null,null,null,12310,null,150,{"$f":"IF(G384=\"\",\"\",IF(ISERROR(VLOOKUP(G384,Kontoplan!A:D,2,0)),\"Konto findes ikke!\",VLOOKUP(G384,Kontoplan!A:D,2,0)))","v":"Bank konto"}]
[{"$f":"IF(B385>=T!C$4,IF(B385<=T!C$5,Bogføring!G385,\"\"),\"\")","v":""},"2021-08-06",188,null,null,null,2200,150,null,{"$f":"IF(G385=\"\",\"\",IF(ISERROR(VLOOKUP(G385,Kontoplan!A:D,2,0)),\"Konto findes ikke!\",VLOOKUP(G385,Kontoplan!A:D,2,0)))","v":"Kontingenter overført til KVB"}]
[{"$f":"IF(B386>=T!C$4,IF(B386<=T!C$5,Bogføring!G386,\"\"),\"\")","v":""},"2021-08-06",189,null,null,null,12320,1119,null,{"$f":"IF(G386=\"\",\"\",IF(ISERROR(VLOOKUP(G386,Kontoplan!A:D,2,0)),\"Konto findes ikke!\",VLOOKUP(G386,Kontoplan!A:D,2,0)))","v":"Kasse"}]
[{"$f":"IF(B387>=T!C$4,IF(B387<=T!C$5,Bogføring!G387,\"\"),\"\")","v":""},"2021-08-06",189,null,null,null,1010,null,1119,{"$f":"IF(G387=\"\",\"\",IF(ISERROR(VLOOKUP(G387,Kontoplan!A:D,2,0)),\"Konto findes ikke!\",VLOOKUP(G387,Kontoplan!A:D,2,0)))","v":"Kiosk salg"}]
[{"$f":"IF(B388>=T!C$4,IF(B388<=T!C$5,Bogføring!G388,\"\"),\"\")","v":""},"2021-08-06",190,null,null,null,2135,300,null,{"$f":"IF(G388=\"\",\"\",IF(ISERROR(VLOOKUP(G388,Kontoplan!A:D,2,0)),\"Konto findes ikke!\",VLOOKUP(G388,Kontoplan!A:D,2,0)))","v":"Tryksager"}]
[{"$f":"IF(B389>=T!C$4,IF(B389<=T!C$5,Bogføring!G389,\"\"),\"\")","v":""},"2021-08-06",190,null,null,null,12310,null,300,{"$f":"IF(G389=\"\",\"\",IF(ISERROR(VLOOKUP(G389,Kontoplan!A:D,2,0)),\"Konto findes ikke!\",VLOOKUP(G389,Kontoplan!A:D,2,0)))","v":"Bank konto"}]
[{"$f":"IF(B390>=T!C$4,IF(B390<=T!C$5,Bogføring!G390,\"\"),\"\")","v":""},"2021-08-07",191,null,null,null,12320,485,null,{"$f":"IF(G390=\"\",\"\",IF(ISERROR(VLOOKUP(G390,Kontoplan!A:D,2,0)),\"Konto findes ikke!\",VLOOKUP(G390,Kontoplan!A:D,2,0)))","v":"Kasse"}]
[{"$f":"IF(B391>=T!C$4,IF(B391<=T!C$5,Bogføring!G391,\"\"),\"\")","v":""},"2021-08-07",191,null,null,null,1010,null,485,{"$f":"IF(G391=\"\",\"\",IF(ISERROR(VLOOKUP(G391,Kontoplan!A:D,2,0)),\"Konto findes ikke!\",VLOOKUP(G391,Kontoplan!A:D,2,0)))","v":"Kiosk salg"}]
[{"$f":"IF(B392>=T!C$4,IF(B392<=T!C$5,Bogføring!G392,\"\"),\"\")","v":""},"2021-08-08",192,null,null,null,3100,11389.11,null,{"$f":"IF(G392=\"\",\"\",IF(ISERROR(VLOOKUP(G392,Kontoplan!A:D,2,0)),\"Konto findes ikke!\",VLOOKUP(G392,Kontoplan!A:D,2,0)))","v":"Lønomkostninger"}]
[{"$f":"IF(B393>=T!C$4,IF(B393<=T!C$5,Bogføring!G393,\"\"),\"\")","v":""},"2021-08-08",192,null,null,null,12310,null,11389.11,{"$f":"IF(G393=\"\",\"\",IF(ISERROR(VLOOKUP(G393,Kontoplan!A:D,2,0)),\"Konto findes ikke!\",VLOOKUP(G393,Kontoplan!A:D,2,0)))","v":"Bank konto"}]
[{"$f":"IF(B394>=T!C$4,IF(B394<=T!C$5,Bogføring!G394,\"\"),\"\")","v":""},"2021-08-09",193,null,null,null,2165,1009.75,null,{"$f":"IF(G394=\"\",\"\",IF(ISERROR(VLOOKUP(G394,Kontoplan!A:D,2,0)),\"Konto findes ikke!\",VLOOKUP(G394,Kontoplan!A:D,2,0)))","v":"G4S tyverialarm"}]
[{"$f":"IF(B395>=T!C$4,IF(B395<=T!C$5,Bogføring!G395,\"\"),\"\")","v":""},"2021-08-09",193,null,null,null,12310,null,1009.75,{"$f":"IF(G395=\"\",\"\",IF(ISERROR(VLOOKUP(G395,Kontoplan!A:D,2,0)),\"Konto findes ikke!\",VLOOKUP(G395,Kontoplan!A:D,2,0)))","v":"Bank konto"}]
[{"$f":"IF(B396>=T!C$4,IF(B396<=T!C$5,Bogføring!G396,\"\"),\"\")","v":""},"2021-08-10",194,null,null,null,12310,9759.75,null,{"$f":"IF(G396=\"\",\"\",IF(ISERROR(VLOOKUP(G396,Kontoplan!A:D,2,0)),\"Konto findes ikke!\",VLOOKUP(G396,Kontoplan!A:D,2,0)))","v":"Bank konto"}]
[{"$f":"IF(B397>=T!C$4,IF(B397<=T!C$5,Bogføring!G397,\"\"),\"\")","v":""},"2021-08-10",194,null,null,null,1000,null,9759.75,{"$f":"IF(G397=\"\",\"\",IF(ISERROR(VLOOKUP(G397,Kontoplan!A:D,2,0)),\"Konto findes ikke!\",VLOOKUP(G397,Kontoplan!A:D,2,0)))","v":"Entre"}]
[{"$f":"IF(B398>=T!C$4,IF(B398<=T!C$5,Bogføring!G398,\"\"),\"\")","v":""},"2021-08-10",195,null,null,null,2010,125,null,{"$f":"IF(G398=\"\",\"\",IF(ISERROR(VLOOKUP(G398,Kontoplan!A:D,2,0)),\"Konto findes ikke!\",VLOOKUP(G398,Kontoplan!A:D,2,0)))","v":"Danløn"}]
[{"$f":"IF(B399>=T!C$4,IF(B399<=T!C$5,Bogføring!G399,\"\"),\"\")","v":""},"2021-08-10",195,null,null,null,12310,null,125,{"$f":"IF(G399=\"\",\"\",IF(ISERROR(VLOOKUP(G399,Kontoplan!A:D,2,0)),\"Konto findes ikke!\",VLOOKUP(G399,Kontoplan!A:D,2,0)))","v":"Bank konto"}]
[{"$f":"IF(B400>=T!C$4,IF(B400<=T!C$5,Bogføring!G400,\"\"),\"\")","v":""},"2021-08-10",196,null,null,null,2060,300,null,{"$f":"IF(G400=\"\",\"\",IF(ISERROR(VLOOKUP(G400,Kontoplan!A:D,2,0)),\"Konto findes ikke!\",VLOOKUP(G400,Kontoplan!A:D,2,0)))","v":"Internet, mobiltelefon, Forsik."}]
[{"$f":"IF(B401>=T!C$4,IF(B401<=T!C$5,Bogføring!G401,\"\"),\"\")","v":""},"2021-08-10",196,null,null,null,12310,null,300,{"$f":"IF(G401=\"\",\"\",IF(ISERROR(VLOOKUP(G401,Kontoplan!A:D,2,0)),\"Konto findes ikke!\",VLOOKUP(G401,Kontoplan!A:D,2,0)))","v":"Bank konto"}]
[{"$f":"IF(B402>=T!C$4,IF(B402<=T!C$5,Bogføring!G402,\"\"),\"\")","v":""},"2021-08-11",197,null,null,null,12310,3454,null,{"$f":"IF(G402=\"\",\"\",IF(ISERROR(VLOOKUP(G402,Kontoplan!A:D,2,0)),\"Konto findes ikke!\",VLOOKUP(G402,Kontoplan!A:D,2,0)))","v":"Bank konto"}]
[{"$f":"IF(B403>=T!C$4,IF(B403<=T!C$5,Bogføring!G403,\"\"),\"\")","v":""},"2021-08-11",197,null,null,null,12320,null,3454,{"$f":"IF(G403=\"\",\"\",IF(ISERROR(VLOOKUP(G403,Kontoplan!A:D,2,0)),\"Konto findes ikke!\",VLOOKUP(G403,Kontoplan!A:D,2,0)))","v":"Kasse"}]
[{"$f":"IF(B404>=T!C$4,IF(B404<=T!C$5,Bogføring!G404,\"\"),\"\")","v":""},"2021-08-11",198,null,null,null,2055,78.349999999999994,null,{"$f":"IF(G404=\"\",\"\",IF(ISERROR(VLOOKUP(G404,Kontoplan!A:D,2,0)),\"Konto findes ikke!\",VLOOKUP(G404,Kontoplan!A:D,2,0)))","v":"Indkøb af øl + vand"}]
[{"$f":"IF(B405>=T!C$4,IF(B405<=T!C$5,Bogføring!G405,\"\"),\"\")","v":""},"2021-08-11",198,null,null,null,12310,null,78.349999999999994,{"$f":"IF(G405=\"\",\"\",IF(ISERROR(VLOOKUP(G405,Kontoplan!A:D,2,0)),\"Konto findes ikke!\",VLOOKUP(G405,Kontoplan!A:D,2,0)))","v":"Bank konto"}]
[{"$f":"IF(B406>=T!C$4,IF(B406<=T!C$5,Bogføring!G406,\"\"),\"\")","v":""},"2021-08-11",199,null,null,null,2070,633.75,null,{"$f":"IF(G406=\"\",\"\",IF(ISERROR(VLOOKUP(G406,Kontoplan!A:D,2,0)),\"Konto findes ikke!\",VLOOKUP(G406,Kontoplan!A:D,2,0)))","v":"Tin og sortkrudt"}]
[{"$f":"IF(B407>=T!C$4,IF(B407<=T!C$5,Bogføring!G407,\"\"),\"\")","v":""},"2021-08-11",199,null,null,null,12310,null,633.75,{"$f":"IF(G407=\"\",\"\",IF(ISERROR(VLOOKUP(G407,Kontoplan!A:D,2,0)),\"Konto findes ikke!\",VLOOKUP(G407,Kontoplan!A:D,2,0)))","v":"Bank konto"}]
[{"$f":"IF(B408>=T!C$4,IF(B408<=T!C$5,Bogføring!G408,\"\"),\"\")","v":""},"2021-08-11",200,null,null,null,12320,365,null,{"$f":"IF(G408=\"\",\"\",IF(ISERROR(VLOOKUP(G408,Kontoplan!A:D,2,0)),\"Konto findes ikke!\",VLOOKUP(G408,Kontoplan!A:D,2,0)))","v":"Kasse"}]
[{"$f":"IF(B409>=T!C$4,IF(B409<=T!C$5,Bogføring!G409,\"\"),\"\")","v":""},"2021-08-11",200,null,null,null,1010,null,365,{"$f":"IF(G409=\"\",\"\",IF(ISERROR(VLOOKUP(G409,Kontoplan!A:D,2,0)),\"Konto findes ikke!\",VLOOKUP(G409,Kontoplan!A:D,2,0)))","v":"Kiosk salg"}]
[{"$f":"IF(B410>=T!C$4,IF(B410<=T!C$5,Bogføring!G410,\"\"),\"\")","v":""},"2021-08-12",201,null,null,null,2075,500,null,{"$f":"IF(G410=\"\",\"\",IF(ISERROR(VLOOKUP(G410,Kontoplan!A:D,2,0)),\"Konto findes ikke!\",VLOOKUP(G410,Kontoplan!A:D,2,0)))","v":"Gaver"}]
[{"$f":"IF(B411>=T!C$4,IF(B411<=T!C$5,Bogføring!G411,\"\"),\"\")","v":""},"2021-08-12",201,null,null,null,12310,null,500,{"$f":"IF(G411=\"\",\"\",IF(ISERROR(VLOOKUP(G411,Kontoplan!A:D,2,0)),\"Konto findes ikke!\",VLOOKUP(G411,Kontoplan!A:D,2,0)))","v":"Bank konto"}]
[{"$f":"IF(B412>=T!C$4,IF(B412<=T!C$5,Bogføring!G412,\"\"),\"\")","v":""},"2021-08-12",202,null,null,null,12320,315,null,{"$f":"IF(G412=\"\",\"\",IF(ISERROR(VLOOKUP(G412,Kontoplan!A:D,2,0)),\"Konto findes ikke!\",VLOOKUP(G412,Kontoplan!A:D,2,0)))","v":"Kasse"}]
[{"$f":"IF(B413>=T!C$4,IF(B413<=T!C$5,Bogføring!G413,\"\"),\"\")","v":""},"2021-08-12",202,null,null,null,1010,null,315,{"$f":"IF(G413=\"\",\"\",IF(ISERROR(VLOOKUP(G413,Kontoplan!A:D,2,0)),\"Konto findes ikke!\",VLOOKUP(G413,Kontoplan!A:D,2,0)))","v":"Kiosk salg"}]
[{"$f":"IF(B414>=T!C$4,IF(B414<=T!C$5,Bogføring!G414,\"\"),\"\")","v":""},"2021-08-13",203,null,null,null,12320,130,null,{"$f":"IF(G414=\"\",\"\",IF(ISERROR(VLOOKUP(G414,Kontoplan!A:D,2,0)),\"Konto findes ikke!\",VLOOKUP(G414,Kontoplan!A:D,2,0)))","v":"Kasse"}]
[{"$f":"IF(B415>=T!C$4,IF(B415<=T!C$5,Bogføring!G415,\"\"),\"\")","v":""},"2021-08-13",203,null,null,null,1010,null,130,{"$f":"IF(G415=\"\",\"\",IF(ISERROR(VLOOKUP(G415,Kontoplan!A:D,2,0)),\"Konto findes ikke!\",VLOOKUP(G415,Kontoplan!A:D,2,0)))","v":"Kiosk salg"}]
[{"$f":"IF(B416>=T!C$4,IF(B416<=T!C$5,Bogføring!G416,\"\"),\"\")","v":""},"2021-08-14",204,null,null,null,12320,1050,null,{"$f":"IF(G416=\"\",\"\",IF(ISERROR(VLOOKUP(G416,Kontoplan!A:D,2,0)),\"Konto findes ikke!\",VLOOKUP(G416,Kontoplan!A:D,2,0)))","v":"Kasse"}]
[{"$f":"IF(B417>=T!C$4,IF(B417<=T!C$5,Bogføring!G417,\"\"),\"\")","v":""},"2021-08-14",204,null,null,null,1010,null,1050,{"$f":"IF(G417=\"\",\"\",IF(ISERROR(VLOOKUP(G417,Kontoplan!A:D,2,0)),\"Konto findes ikke!\",VLOOKUP(G417,Kontoplan!A:D,2,0)))","v":"Kiosk salg"}]
[{"$f":"IF(B418>=T!C$4,IF(B418<=T!C$5,Bogføring!G418,\"\"),\"\")","v":""},"2021-08-16",205,null,null,null,2190,113.7,null,{"$f":"IF(G418=\"\",\"\",IF(ISERROR(VLOOKUP(G418,Kontoplan!A:D,2,0)),\"Konto findes ikke!\",VLOOKUP(G418,Kontoplan!A:D,2,0)))","v":"Diverse Udgifter"}]
[{"$f":"IF(B419>=T!C$4,IF(B419<=T!C$5,Bogføring!G419,\"\"),\"\")","v":""},"2021-08-16",205,null,null,null,12310,null,113.7,{"$f":"IF(G419=\"\",\"\",IF(ISERROR(VLOOKUP(G419,Kontoplan!A:D,2,0)),\"Konto findes ikke!\",VLOOKUP(G419,Kontoplan!A:D,2,0)))","v":"Bank konto"}]
[{"$f":"IF(B420>=T!C$4,IF(B420<=T!C$5,Bogføring!G420,\"\"),\"\")","v":""},"2021-08-17",206,null,null,null,12310,140,null,{"$f":"IF(G420=\"\",\"\",IF(ISERROR(VLOOKUP(G420,Kontoplan!A:D,2,0)),\"Konto findes ikke!\",VLOOKUP(G420,Kontoplan!A:D,2,0)))","v":"Bank konto"}]
[{"$f":"IF(B421>=T!C$4,IF(B421<=T!C$5,Bogføring!G421,\"\"),\"\")","v":""},"2021-08-17",206,null,null,null,1000,null,140,{"$f":"IF(G421=\"\",\"\",IF(ISERROR(VLOOKUP(G421,Kontoplan!A:D,2,0)),\"Konto findes ikke!\",VLOOKUP(G421,Kontoplan!A:D,2,0)))","v":"Entre"}]
[{"$f":"IF(B422>=T!C$4,IF(B422<=T!C$5,Bogføring!G422,\"\"),\"\")","v":""},"2021-08-17",207,null,null,null,12310,8868.48,null,{"$f":"IF(G422=\"\",\"\",IF(ISERROR(VLOOKUP(G422,Kontoplan!A:D,2,0)),\"Konto findes ikke!\",VLOOKUP(G422,Kontoplan!A:D,2,0)))","v":"Bank konto"}]
[{"$f":"IF(B423>=T!C$4,IF(B423<=T!C$5,Bogføring!G423,\"\"),\"\")","v":""},"2021-08-17",207,null,null,null,1000,null,8868.48,{"$f":"IF(G423=\"\",\"\",IF(ISERROR(VLOOKUP(G423,Kontoplan!A:D,2,0)),\"Konto findes ikke!\",VLOOKUP(G423,Kontoplan!A:D,2,0)))","v":"Entre"}]
[{"$f":"IF(B424>=T!C$4,IF(B424<=T!C$5,Bogføring!G424,\"\"),\"\")","v":""},"2021-08-19",208,null,null,null,2060,500,null,{"$f":"IF(G424=\"\",\"\",IF(ISERROR(VLOOKUP(G424,Kontoplan!A:D,2,0)),\"Konto findes ikke!\",VLOOKUP(G424,Kontoplan!A:D,2,0)))","v":"Internet, mobiltelefon, Forsik."}]
[{"$f":"IF(B425>=T!C$4,IF(B425<=T!C$5,Bogføring!G425,\"\"),\"\")","v":""},"2021-08-19",208,null,null,null,12310,null,500,{"$f":"IF(G425=\"\",\"\",IF(ISERROR(VLOOKUP(G425,Kontoplan!A:D,2,0)),\"Konto findes ikke!\",VLOOKUP(G425,Kontoplan!A:D,2,0)))","v":"Bank konto"}]
[{"$f":"IF(B426>=T!C$4,IF(B426<=T!C$5,Bogføring!G426,\"\"),\"\")","v":""},"2021-08-20",209,null,null,null,2190,515.86,null,{"$f":"IF(G426=\"\",\"\",IF(ISERROR(VLOOKUP(G426,Kontoplan!A:D,2,0)),\"Konto findes ikke!\",VLOOKUP(G426,Kontoplan!A:D,2,0)))","v":"Diverse Udgifter"}]
[{"$f":"IF(B427>=T!C$4,IF(B427<=T!C$5,Bogføring!G427,\"\"),\"\")","v":""},"2021-08-20",209,null,null,null,12310,null,515.86,{"$f":"IF(G427=\"\",\"\",IF(ISERROR(VLOOKUP(G427,Kontoplan!A:D,2,0)),\"Konto findes ikke!\",VLOOKUP(G427,Kontoplan!A:D,2,0)))","v":"Bank konto"}]
[{"$f":"IF(B428>=T!C$4,IF(B428<=T!C$5,Bogføring!G428,\"\"),\"\")","v":""},"2021-08-24",210,null,null,null,12310,8189.52,null,{"$f":"IF(G428=\"\",\"\",IF(ISERROR(VLOOKUP(G428,Kontoplan!A:D,2,0)),\"Konto findes ikke!\",VLOOKUP(G428,Kontoplan!A:D,2,0)))","v":"Bank konto"}]
[{"$f":"IF(B429>=T!C$4,IF(B429<=T!C$5,Bogføring!G429,\"\"),\"\")","v":""},"2021-08-24",210,null,null,null,1000,null,8189.52,{"$f":"IF(G429=\"\",\"\",IF(ISERROR(VLOOKUP(G429,Kontoplan!A:D,2,0)),\"Konto findes ikke!\",VLOOKUP(G429,Kontoplan!A:D,2,0)))","v":"Entre"}]
[{"$f":"IF(B430>=T!C$4,IF(B430<=T!C$5,Bogføring!G430,\"\"),\"\")","v":""},"2021-08-26",211,null,null,null,3100,4380,null,{"$f":"IF(G430=\"\",\"\",IF(ISERROR(VLOOKUP(G430,Kontoplan!A:D,2,0)),\"Konto findes ikke!\",VLOOKUP(G430,Kontoplan!A:D,2,0)))","v":"Lønomkostninger"}]
[{"$f":"IF(B431>=T!C$4,IF(B431<=T!C$5,Bogføring!G431,\"\"),\"\")","v":""},"2021-08-26",211,null,null,null,12310,null,4380,{"$f":"IF(G431=\"\",\"\",IF(ISERROR(VLOOKUP(G431,Kontoplan!A:D,2,0)),\"Konto findes ikke!\",VLOOKUP(G431,Kontoplan!A:D,2,0)))","v":"Bank konto"}]
[{"$f":"IF(B432>=T!C$4,IF(B432<=T!C$5,Bogføring!G432,\"\"),\"\")","v":""},"2021-08-29",212,null,null,null,2037,158.94999999999999,null,{"$f":"IF(G432=\"\",\"\",IF(ISERROR(VLOOKUP(G432,Kontoplan!A:D,2,0)),\"Konto findes ikke!\",VLOOKUP(G432,Kontoplan!A:D,2,0)))","v":"Rengørringsartikler"}]
[{"$f":"IF(B433>=T!C$4,IF(B433<=T!C$5,Bogføring!G433,\"\"),\"\")","v":""},"2021-08-29",212,null,null,null,12310,null,158.94999999999999,{"$f":"IF(G433=\"\",\"\",IF(ISERROR(VLOOKUP(G433,Kontoplan!A:D,2,0)),\"Konto findes ikke!\",VLOOKUP(G433,Kontoplan!A:D,2,0)))","v":"Bank konto"}]
[{"$f":"IF(B434>=T!C$4,IF(B434<=T!C$5,Bogføring!G434,\"\"),\"\")","v":""},"2021-08-30",213,null,null,null,3110,15168.75,null,{"$f":"IF(G434=\"\",\"\",IF(ISERROR(VLOOKUP(G434,Kontoplan!A:D,2,0)),\"Konto findes ikke!\",VLOOKUP(G434,Kontoplan!A:D,2,0)))","v":"Lønninger incl ATP -AM"}]
[{"$f":"IF(B435>=T!C$4,IF(B435<=T!C$5,Bogføring!G435,\"\"),\"\")","v":""},"2021-08-30",213,null,null,null,12310,null,15168.75,{"$f":"IF(G435=\"\",\"\",IF(ISERROR(VLOOKUP(G435,Kontoplan!A:D,2,0)),\"Konto findes ikke!\",VLOOKUP(G435,Kontoplan!A:D,2,0)))","v":"Bank konto"}]
[{"$f":"IF(B436>=T!C$4,IF(B436<=T!C$5,Bogføring!G436,\"\"),\"\")","v":""},"2021-08-30",214,null,null,null,2130,1455,null,{"$f":"IF(G436=\"\",\"\",IF(ISERROR(VLOOKUP(G436,Kontoplan!A:D,2,0)),\"Konto findes ikke!\",VLOOKUP(G436,Kontoplan!A:D,2,0)))","v":"Annoncer"}]
[{"$f":"IF(B437>=T!C$4,IF(B437<=T!C$5,Bogføring!G437,\"\"),\"\")","v":""},"2021-08-30",214,null,null,null,12310,null,1455,{"$f":"IF(G437=\"\",\"\",IF(ISERROR(VLOOKUP(G437,Kontoplan!A:D,2,0)),\"Konto findes ikke!\",VLOOKUP(G437,Kontoplan!A:D,2,0)))","v":"Bank konto"}]
[{"$f":"IF(B438>=T!C$4,IF(B438<=T!C$5,Bogføring!G438,\"\"),\"\")","v":""},"2021-08-30",215,null,null,null,2110,554.38,null,{"$f":"IF(G438=\"\",\"\",IF(ISERROR(VLOOKUP(G438,Kontoplan!A:D,2,0)),\"Konto findes ikke!\",VLOOKUP(G438,Kontoplan!A:D,2,0)))","v":"Kontorhold - Porto - IT"}]
[{"$f":"IF(B439>=T!C$4,IF(B439<=T!C$5,Bogføring!G439,\"\"),\"\")","v":""},"2021-08-30",215,null,null,null,12310,null,554.38,{"$f":"IF(G439=\"\",\"\",IF(ISERROR(VLOOKUP(G439,Kontoplan!A:D,2,0)),\"Konto findes ikke!\",VLOOKUP(G439,Kontoplan!A:D,2,0)))","v":"Bank konto"}]
[{"$f":"IF(B440>=T!C$4,IF(B440<=T!C$5,Bogføring!G440,\"\"),\"\")","v":""},"2021-08-30",216,null,null,null,3110,6743.45,null,{"$f":"IF(G440=\"\",\"\",IF(ISERROR(VLOOKUP(G440,Kontoplan!A:D,2,0)),\"Konto findes ikke!\",VLOOKUP(G440,Kontoplan!A:D,2,0)))","v":"Lønninger incl ATP -AM"}]
[{"$f":"IF(B441>=T!C$4,IF(B441<=T!C$5,Bogføring!G441,\"\"),\"\")","v":""},"2021-08-30",216,null,null,null,12310,null,6743.45,{"$f":"IF(G441=\"\",\"\",IF(ISERROR(VLOOKUP(G441,Kontoplan!A:D,2,0)),\"Konto findes ikke!\",VLOOKUP(G441,Kontoplan!A:D,2,0)))","v":"Bank konto"}]
[{"$f":"IF(B442>=T!C$4,IF(B442<=T!C$5,Bogføring!G442,\"\"),\"\")","v":""},"2021-08-31",217,null,null,null,12310,10049.959999999999,null,{"$f":"IF(G442=\"\",\"\",IF(ISERROR(VLOOKUP(G442,Kontoplan!A:D,2,0)),\"Konto findes ikke!\",VLOOKUP(G442,Kontoplan!A:D,2,0)))","v":"Bank konto"}]
[{"$f":"IF(B443>=T!C$4,IF(B443<=T!C$5,Bogføring!G443,\"\"),\"\")","v":""},"2021-08-31",217,null,null,null,1000,null,10049.959999999999,{"$f":"IF(G443=\"\",\"\",IF(ISERROR(VLOOKUP(G443,Kontoplan!A:D,2,0)),\"Konto findes ikke!\",VLOOKUP(G443,Kontoplan!A:D,2,0)))","v":"Entre"}]
[{"$f":"IF(B444>=T!C$4,IF(B444<=T!C$5,Bogføring!G444,\"\"),\"\")","v":""},"2021-08-31",218,null,null,null,2060,750,null,{"$f":"IF(G444=\"\",\"\",IF(ISERROR(VLOOKUP(G444,Kontoplan!A:D,2,0)),\"Konto findes ikke!\",VLOOKUP(G444,Kontoplan!A:D,2,0)))","v":"Internet, mobiltelefon, Forsik."}]
[{"$f":"IF(B445>=T!C$4,IF(B445<=T!C$5,Bogføring!G445,\"\"),\"\")","v":""},"2021-08-31",218,null,null,null,12310,null,750,{"$f":"IF(G445=\"\",\"\",IF(ISERROR(VLOOKUP(G445,Kontoplan!A:D,2,0)),\"Konto findes ikke!\",VLOOKUP(G445,Kontoplan!A:D,2,0)))","v":"Bank konto"}]
[{"$f":"IF(B446>=T!C$4,IF(B446<=T!C$5,Bogføring!G446,\"\"),\"\")","v":""},"2021-08-31",219,null,null,null,12310,9950,null,{"$f":"IF(G446=\"\",\"\",IF(ISERROR(VLOOKUP(G446,Kontoplan!A:D,2,0)),\"Konto findes ikke!\",VLOOKUP(G446,Kontoplan!A:D,2,0)))","v":"Bank konto"}]
[{"$f":"IF(B447>=T!C$4,IF(B447<=T!C$5,Bogføring!G447,\"\"),\"\")","v":""},"2021-08-31",219,null,null,null,12320,null,9950,{"$f":"IF(G447=\"\",\"\",IF(ISERROR(VLOOKUP(G447,Kontoplan!A:D,2,0)),\"Konto findes ikke!\",VLOOKUP(G447,Kontoplan!A:D,2,0)))","v":"Kasse"}]
[{"$f":"IF(B448>=T!C$4,IF(B448<=T!C$5,Bogføring!G448,\"\"),\"\")","v":""},"2021-09-04",220,null,null,null,12320,980,null,{"$f":"IF(G448=\"\",\"\",IF(ISERROR(VLOOKUP(G448,Kontoplan!A:D,2,0)),\"Konto findes ikke!\",VLOOKUP(G448,Kontoplan!A:D,2,0)))","v":"Kasse"}]
[{"$f":"IF(B449>=T!C$4,IF(B449<=T!C$5,Bogføring!G449,\"\"),\"\")","v":""},"2021-09-04",220,null,null,null,1010,null,980,{"$f":"IF(G449=\"\",\"\",IF(ISERROR(VLOOKUP(G449,Kontoplan!A:D,2,0)),\"Konto findes ikke!\",VLOOKUP(G449,Kontoplan!A:D,2,0)))","v":"Kiosk salg"}]
[{"$f":"IF(B450>=T!C$4,IF(B450<=T!C$5,Bogføring!G450,\"\"),\"\")","v":""},"2021-09-04",221,null,null,null,12320,909,null,{"$f":"IF(G450=\"\",\"\",IF(ISERROR(VLOOKUP(G450,Kontoplan!A:D,2,0)),\"Konto findes ikke!\",VLOOKUP(G450,Kontoplan!A:D,2,0)))","v":"Kasse"}]
[{"$f":"IF(B451>=T!C$4,IF(B451<=T!C$5,Bogføring!G451,\"\"),\"\")","v":""},"2021-09-04",221,null,null,null,1010,null,909,{"$f":"IF(G451=\"\",\"\",IF(ISERROR(VLOOKUP(G451,Kontoplan!A:D,2,0)),\"Konto findes ikke!\",VLOOKUP(G451,Kontoplan!A:D,2,0)))","v":"Kiosk salg"}]
[{"$f":"IF(B452>=T!C$4,IF(B452<=T!C$5,Bogføring!G452,\"\"),\"\")","v":""},"2021-09-04",222,null,null,null,12320,513.5,null,{"$f":"IF(G452=\"\",\"\",IF(ISERROR(VLOOKUP(G452,Kontoplan!A:D,2,0)),\"Konto findes ikke!\",VLOOKUP(G452,Kontoplan!A:D,2,0)))","v":"Kasse"}]
[{"$f":"IF(B453>=T!C$4,IF(B453<=T!C$5,Bogføring!G453,\"\"),\"\")","v":""},"2021-09-04",222,null,null,null,1010,null,513.5,{"$f":"IF(G453=\"\",\"\",IF(ISERROR(VLOOKUP(G453,Kontoplan!A:D,2,0)),\"Konto findes ikke!\",VLOOKUP(G453,Kontoplan!A:D,2,0)))","v":"Kiosk salg"}]
[{"$f":"IF(B454>=T!C$4,IF(B454<=T!C$5,Bogføring!G454,\"\"),\"\")","v":""},"2021-09-04",223,null,null,null,12320,453,null,{"$f":"IF(G454=\"\",\"\",IF(ISERROR(VLOOKUP(G454,Kontoplan!A:D,2,0)),\"Konto findes ikke!\",VLOOKUP(G454,Kontoplan!A:D,2,0)))","v":"Kasse"}]
[{"$f":"IF(B455>=T!C$4,IF(B455<=T!C$5,Bogføring!G455,\"\"),\"\")","v":""},"2021-09-04",223,null,null,null,1010,null,453,{"$f":"IF(G455=\"\",\"\",IF(ISERROR(VLOOKUP(G455,Kontoplan!A:D,2,0)),\"Konto findes ikke!\",VLOOKUP(G455,Kontoplan!A:D,2,0)))","v":"Kiosk salg"}]
[{"$f":"IF(B456>=T!C$4,IF(B456<=T!C$5,Bogføring!G456,\"\"),\"\")","v":""},"2021-09-04",224,null,null,null,12320,900,null,{"$f":"IF(G456=\"\",\"\",IF(ISERROR(VLOOKUP(G456,Kontoplan!A:D,2,0)),\"Konto findes ikke!\",VLOOKUP(G456,Kontoplan!A:D,2,0)))","v":"Kasse"}]
[{"$f":"IF(B457>=T!C$4,IF(B457<=T!C$5,Bogføring!G457,\"\"),\"\")","v":""},"2021-09-04",224,null,null,null,1010,null,900,{"$f":"IF(G457=\"\",\"\",IF(ISERROR(VLOOKUP(G457,Kontoplan!A:D,2,0)),\"Konto findes ikke!\",VLOOKUP(G457,Kontoplan!A:D,2,0)))","v":"Kiosk salg"}]
[{"$f":"IF(B458>=T!C$4,IF(B458<=T!C$5,Bogføring!G458,\"\"),\"\")","v":""},"2021-09-04",225,null,null,null,12320,1695,null,{"$f":"IF(G458=\"\",\"\",IF(ISERROR(VLOOKUP(G458,Kontoplan!A:D,2,0)),\"Konto findes ikke!\",VLOOKUP(G458,Kontoplan!A:D,2,0)))","v":"Kasse"}]
[{"$f":"IF(B459>=T!C$4,IF(B459<=T!C$5,Bogføring!G459,\"\"),\"\")","v":""},"2021-09-04",225,null,null,null,1010,null,1695,{"$f":"IF(G459=\"\",\"\",IF(ISERROR(VLOOKUP(G459,Kontoplan!A:D,2,0)),\"Konto findes ikke!\",VLOOKUP(G459,Kontoplan!A:D,2,0)))","v":"Kiosk salg"}]
[{"$f":"IF(B460>=T!C$4,IF(B460<=T!C$5,Bogføring!G460,\"\"),\"\")","v":""},"2021-09-04",226,null,null,null,12320,615,null,{"$f":"IF(G460=\"\",\"\",IF(ISERROR(VLOOKUP(G460,Kontoplan!A:D,2,0)),\"Konto findes ikke!\",VLOOKUP(G460,Kontoplan!A:D,2,0)))","v":"Kasse"}]
[{"$f":"IF(B461>=T!C$4,IF(B461<=T!C$5,Bogføring!G461,\"\"),\"\")","v":""},"2021-09-04",226,null,null,null,1010,null,615,{"$f":"IF(G461=\"\",\"\",IF(ISERROR(VLOOKUP(G461,Kontoplan!A:D,2,0)),\"Konto findes ikke!\",VLOOKUP(G461,Kontoplan!A:D,2,0)))","v":"Kiosk salg"}]
[{"$f":"IF(B462>=T!C$4,IF(B462<=T!C$5,Bogføring!G462,\"\"),\"\")","v":""},"2021-09-04",227,null,null,null,12320,725,null,{"$f":"IF(G462=\"\",\"\",IF(ISERROR(VLOOKUP(G462,Kontoplan!A:D,2,0)),\"Konto findes ikke!\",VLOOKUP(G462,Kontoplan!A:D,2,0)))","v":"Kasse"}]
[{"$f":"IF(B463>=T!C$4,IF(B463<=T!C$5,Bogføring!G463,\"\"),\"\")","v":""},"2021-09-04",227,null,null,null,1010,null,725,{"$f":"IF(G463=\"\",\"\",IF(ISERROR(VLOOKUP(G463,Kontoplan!A:D,2,0)),\"Konto findes ikke!\",VLOOKUP(G463,Kontoplan!A:D,2,0)))","v":"Kiosk salg"}]
[{"$f":"IF(B464>=T!C$4,IF(B464<=T!C$5,Bogføring!G464,\"\"),\"\")","v":""},"2021-09-04",228,null,null,null,12320,230,null,{"$f":"IF(G464=\"\",\"\",IF(ISERROR(VLOOKUP(G464,Kontoplan!A:D,2,0)),\"Konto findes ikke!\",VLOOKUP(G464,Kontoplan!A:D,2,0)))","v":"Kasse"}]
[{"$f":"IF(B465>=T!C$4,IF(B465<=T!C$5,Bogføring!G465,\"\"),\"\")","v":""},"2021-09-04",228,null,null,null,1010,null,230,{"$f":"IF(G465=\"\",\"\",IF(ISERROR(VLOOKUP(G465,Kontoplan!A:D,2,0)),\"Konto findes ikke!\",VLOOKUP(G465,Kontoplan!A:D,2,0)))","v":"Kiosk salg"}]
[{"$f":"IF(B466>=T!C$4,IF(B466<=T!C$5,Bogføring!G466,\"\"),\"\")","v":""},"2021-09-04",229,null,null,null,12320,370,null,{"$f":"IF(G466=\"\",\"\",IF(ISERROR(VLOOKUP(G466,Kontoplan!A:D,2,0)),\"Konto findes ikke!\",VLOOKUP(G466,Kontoplan!A:D,2,0)))","v":"Kasse"}]
[{"$f":"IF(B467>=T!C$4,IF(B467<=T!C$5,Bogføring!G467,\"\"),\"\")","v":""},"2021-09-04",229,null,null,null,1010,null,370,{"$f":"IF(G467=\"\",\"\",IF(ISERROR(VLOOKUP(G467,Kontoplan!A:D,2,0)),\"Konto findes ikke!\",VLOOKUP(G467,Kontoplan!A:D,2,0)))","v":"Kiosk salg"}]
[{"$f":"IF(B468>=T!C$4,IF(B468<=T!C$5,Bogføring!G468,\"\"),\"\")","v":""},"2021-09-04",230,null,null,null,12320,660,null,{"$f":"IF(G468=\"\",\"\",IF(ISERROR(VLOOKUP(G468,Kontoplan!A:D,2,0)),\"Konto findes ikke!\",VLOOKUP(G468,Kontoplan!A:D,2,0)))","v":"Kasse"}]
[{"$f":"IF(B469>=T!C$4,IF(B469<=T!C$5,Bogføring!G469,\"\"),\"\")","v":""},"2021-09-04",230,null,null,null,1010,null,660,{"$f":"IF(G469=\"\",\"\",IF(ISERROR(VLOOKUP(G469,Kontoplan!A:D,2,0)),\"Konto findes ikke!\",VLOOKUP(G469,Kontoplan!A:D,2,0)))","v":"Kiosk salg"}]
[{"$f":"IF(B470>=T!C$4,IF(B470<=T!C$5,Bogføring!G470,\"\"),\"\")","v":""},"2021-09-06",231,null,null,null,12320,720,null,{"$f":"IF(G470=\"\",\"\",IF(ISERROR(VLOOKUP(G470,Kontoplan!A:D,2,0)),\"Konto findes ikke!\",VLOOKUP(G470,Kontoplan!A:D,2,0)))","v":"Kasse"}]
[{"$f":"IF(B471>=T!C$4,IF(B471<=T!C$5,Bogføring!G471,\"\"),\"\")","v":""},"2021-09-06",231,null,null,null,1010,null,720,{"$f":"IF(G471=\"\",\"\",IF(ISERROR(VLOOKUP(G471,Kontoplan!A:D,2,0)),\"Konto findes ikke!\",VLOOKUP(G471,Kontoplan!A:D,2,0)))","v":"Kiosk salg"}]
[{"$f":"IF(B472>=T!C$4,IF(B472<=T!C$5,Bogføring!G472,\"\"),\"\")","v":""},"2021-09-06",232,null,null,null,2000,1.5,null,{"$f":"IF(G472=\"\",\"\",IF(ISERROR(VLOOKUP(G472,Kontoplan!A:D,2,0)),\"Konto findes ikke!\",VLOOKUP(G472,Kontoplan!A:D,2,0)))","v":"Bankgebyr"}]
[{"$f":"IF(B473>=T!C$4,IF(B473<=T!C$5,Bogføring!G473,\"\"),\"\")","v":""},"2021-09-06",232,null,null,null,12310,null,1.5,{"$f":"IF(G473=\"\",\"\",IF(ISERROR(VLOOKUP(G473,Kontoplan!A:D,2,0)),\"Konto findes ikke!\",VLOOKUP(G473,Kontoplan!A:D,2,0)))","v":"Bank konto"}]
[{"$f":"IF(B474>=T!C$4,IF(B474<=T!C$5,Bogføring!G474,\"\"),\"\")","v":""},"2021-09-06",233,null,null,null,2060,377.75,null,{"$f":"IF(G474=\"\",\"\",IF(ISERROR(VLOOKUP(G474,Kontoplan!A:D,2,0)),\"Konto findes ikke!\",VLOOKUP(G474,Kontoplan!A:D,2,0)))","v":"Internet, mobiltelefon, Forsik."}]
[{"$f":"IF(B475>=T!C$4,IF(B475<=T!C$5,Bogføring!G475,\"\"),\"\")","v":""},"2021-09-06",233,null,null,null,12310,null,377.75,{"$f":"IF(G475=\"\",\"\",IF(ISERROR(VLOOKUP(G475,Kontoplan!A:D,2,0)),\"Konto findes ikke!\",VLOOKUP(G475,Kontoplan!A:D,2,0)))","v":"Bank konto"}]
[{"$f":"IF(B476>=T!C$4,IF(B476<=T!C$5,Bogføring!G476,\"\"),\"\")","v":""},"2021-09-06",234,null,null,null,2010,192.5,null,{"$f":"IF(G476=\"\",\"\",IF(ISERROR(VLOOKUP(G476,Kontoplan!A:D,2,0)),\"Konto findes ikke!\",VLOOKUP(G476,Kontoplan!A:D,2,0)))","v":"Danløn"}]
[{"$f":"IF(B477>=T!C$4,IF(B477<=T!C$5,Bogføring!G477,\"\"),\"\")","v":""},"2021-09-06",234,null,null,null,12310,null,192.5,{"$f":"IF(G477=\"\",\"\",IF(ISERROR(VLOOKUP(G477,Kontoplan!A:D,2,0)),\"Konto findes ikke!\",VLOOKUP(G477,Kontoplan!A:D,2,0)))","v":"Bank konto"}]
[{"$f":"IF(B478>=T!C$4,IF(B478<=T!C$5,Bogføring!G478,\"\"),\"\")","v":""},"2021-09-06",235,null,null,null,2060,90.4,null,{"$f":"IF(G478=\"\",\"\",IF(ISERROR(VLOOKUP(G478,Kontoplan!A:D,2,0)),\"Konto findes ikke!\",VLOOKUP(G478,Kontoplan!A:D,2,0)))","v":"Internet, mobiltelefon, Forsik."}]
[{"$f":"IF(B479>=T!C$4,IF(B479<=T!C$5,Bogføring!G479,\"\"),\"\")","v":""},"2021-09-06",235,null,null,null,12310,null,90.4,{"$f":"IF(G479=\"\",\"\",IF(ISERROR(VLOOKUP(G479,Kontoplan!A:D,2,0)),\"Konto findes ikke!\",VLOOKUP(G479,Kontoplan!A:D,2,0)))","v":"Bank konto"}]
[{"$f":"IF(B480>=T!C$4,IF(B480<=T!C$5,Bogføring!G480,\"\"),\"\")","v":""},"2021-09-06",236,null,null,null,2060,19,null,{"$f":"IF(G480=\"\",\"\",IF(ISERROR(VLOOKUP(G480,Kontoplan!A:D,2,0)),\"Konto findes ikke!\",VLOOKUP(G480,Kontoplan!A:D,2,0)))","v":"Internet, mobiltelefon, Forsik."}]
[{"$f":"IF(B481>=T!C$4,IF(B481<=T!C$5,Bogføring!G481,\"\"),\"\")","v":""},"2021-09-06",236,null,null,null,12310,null,19,{"$f":"IF(G481=\"\",\"\",IF(ISERROR(VLOOKUP(G481,Kontoplan!A:D,2,0)),\"Konto findes ikke!\",VLOOKUP(G481,Kontoplan!A:D,2,0)))","v":"Bank konto"}]
[{"$f":"IF(B482>=T!C$4,IF(B482<=T!C$5,Bogføring!G482,\"\"),\"\")","v":""},"2021-09-06",237,null,null,null,2100,61.95,null,{"$f":"IF(G482=\"\",\"\",IF(ISERROR(VLOOKUP(G482,Kontoplan!A:D,2,0)),\"Konto findes ikke!\",VLOOKUP(G482,Kontoplan!A:D,2,0)))","v":"Forplejning til møder/Rejser"}]
[{"$f":"IF(B483>=T!C$4,IF(B483<=T!C$5,Bogføring!G483,\"\"),\"\")","v":""},"2021-09-06",237,null,null,null,12310,null,61.95,{"$f":"IF(G483=\"\",\"\",IF(ISERROR(VLOOKUP(G483,Kontoplan!A:D,2,0)),\"Konto findes ikke!\",VLOOKUP(G483,Kontoplan!A:D,2,0)))","v":"Bank konto"}]
[{"$f":"IF(B484>=T!C$4,IF(B484<=T!C$5,Bogføring!G484,\"\"),\"\")","v":""},"2021-09-07",238,null,null,null,12310,4520.05,null,{"$f":"IF(G484=\"\",\"\",IF(ISERROR(VLOOKUP(G484,Kontoplan!A:D,2,0)),\"Konto findes ikke!\",VLOOKUP(G484,Kontoplan!A:D,2,0)))","v":"Bank konto"}]
[{"$f":"IF(B485>=T!C$4,IF(B485<=T!C$5,Bogføring!G485,\"\"),\"\")","v":""},"2021-09-07",238,null,null,null,1000,null,4520.05,{"$f":"IF(G485=\"\",\"\",IF(ISERROR(VLOOKUP(G485,Kontoplan!A:D,2,0)),\"Konto findes ikke!\",VLOOKUP(G485,Kontoplan!A:D,2,0)))","v":"Entre"}]
[{"$f":"IF(B486>=T!C$4,IF(B486<=T!C$5,Bogføring!G486,\"\"),\"\")","v":""},"2021-09-07",239,null,null,null,2010,125,null,{"$f":"IF(G486=\"\",\"\",IF(ISERROR(VLOOKUP(G486,Kontoplan!A:D,2,0)),\"Konto findes ikke!\",VLOOKUP(G486,Kontoplan!A:D,2,0)))","v":"Danløn"}]
[{"$f":"IF(B487>=T!C$4,IF(B487<=T!C$5,Bogføring!G487,\"\"),\"\")","v":""},"2021-09-07",239,null,null,null,12310,null,125,{"$f":"IF(G487=\"\",\"\",IF(ISERROR(VLOOKUP(G487,Kontoplan!A:D,2,0)),\"Konto findes ikke!\",VLOOKUP(G487,Kontoplan!A:D,2,0)))","v":"Bank konto"}]
[{"$f":"IF(B488>=T!C$4,IF(B488<=T!C$5,Bogføring!G488,\"\"),\"\")","v":""},"2021-09-08",240,null,null,null,12320,650,null,{"$f":"IF(G488=\"\",\"\",IF(ISERROR(VLOOKUP(G488,Kontoplan!A:D,2,0)),\"Konto findes ikke!\",VLOOKUP(G488,Kontoplan!A:D,2,0)))","v":"Kasse"}]
[{"$f":"IF(B489>=T!C$4,IF(B489<=T!C$5,Bogføring!G489,\"\"),\"\")","v":""},"2021-09-08",240,null,null,null,1010,null,650,{"$f":"IF(G489=\"\",\"\",IF(ISERROR(VLOOKUP(G489,Kontoplan!A:D,2,0)),\"Konto findes ikke!\",VLOOKUP(G489,Kontoplan!A:D,2,0)))","v":"Kiosk salg"}]
[{"$f":"IF(B490>=T!C$4,IF(B490<=T!C$5,Bogføring!G490,\"\"),\"\")","v":""},"2021-09-09",241,null,null,null,2110,54,null,{"$f":"IF(G490=\"\",\"\",IF(ISERROR(VLOOKUP(G490,Kontoplan!A:D,2,0)),\"Konto findes ikke!\",VLOOKUP(G490,Kontoplan!A:D,2,0)))","v":"Kontorhold - Porto - IT"}]
[{"$f":"IF(B491>=T!C$4,IF(B491<=T!C$5,Bogføring!G491,\"\"),\"\")","v":""},"2021-09-09",241,null,null,null,12320,null,54,{"$f":"IF(G491=\"\",\"\",IF(ISERROR(VLOOKUP(G491,Kontoplan!A:D,2,0)),\"Konto findes ikke!\",VLOOKUP(G491,Kontoplan!A:D,2,0)))","v":"Kasse"}]
[{"$f":"IF(B492>=T!C$4,IF(B492<=T!C$5,Bogføring!G492,\"\"),\"\")","v":""},"2021-09-09",242,null,null,null,2100,299,null,{"$f":"IF(G492=\"\",\"\",IF(ISERROR(VLOOKUP(G492,Kontoplan!A:D,2,0)),\"Konto findes ikke!\",VLOOKUP(G492,Kontoplan!A:D,2,0)))","v":"Forplejning til møder/Rejser"}]
[{"$f":"IF(B493>=T!C$4,IF(B493<=T!C$5,Bogføring!G493,\"\"),\"\")","v":""},"2021-09-09",242,null,null,null,12320,null,299,{"$f":"IF(G493=\"\",\"\",IF(ISERROR(VLOOKUP(G493,Kontoplan!A:D,2,0)),\"Konto findes ikke!\",VLOOKUP(G493,Kontoplan!A:D,2,0)))","v":"Kasse"}]
[{"$f":"IF(B494>=T!C$4,IF(B494<=T!C$5,Bogføring!G494,\"\"),\"\")","v":""},"2021-09-10",243,null,null,null,2040,532,null,{"$f":"IF(G494=\"\",\"\",IF(ISERROR(VLOOKUP(G494,Kontoplan!A:D,2,0)),\"Konto findes ikke!\",VLOOKUP(G494,Kontoplan!A:D,2,0)))","v":"El, Vand og Varme"}]
[{"$f":"IF(B495>=T!C$4,IF(B495<=T!C$5,Bogføring!G495,\"\"),\"\")","v":""},"2021-09-10",243,null,null,null,12310,null,532,{"$f":"IF(G495=\"\",\"\",IF(ISERROR(VLOOKUP(G495,Kontoplan!A:D,2,0)),\"Konto findes ikke!\",VLOOKUP(G495,Kontoplan!A:D,2,0)))","v":"Bank konto"}]
[{"$f":"IF(B496>=T!C$4,IF(B496<=T!C$5,Bogføring!G496,\"\"),\"\")","v":""},"2021-09-10",244,null,null,null,3100,3225,null,{"$f":"IF(G496=\"\",\"\",IF(ISERROR(VLOOKUP(G496,Kontoplan!A:D,2,0)),\"Konto findes ikke!\",VLOOKUP(G496,Kontoplan!A:D,2,0)))","v":"Lønomkostninger"}]
[{"$f":"IF(B497>=T!C$4,IF(B497<=T!C$5,Bogføring!G497,\"\"),\"\")","v":""},"2021-09-10",244,null,null,null,12310,null,3225,{"$f":"IF(G497=\"\",\"\",IF(ISERROR(VLOOKUP(G497,Kontoplan!A:D,2,0)),\"Konto findes ikke!\",VLOOKUP(G497,Kontoplan!A:D,2,0)))","v":"Bank konto"}]
[{"$f":"IF(B498>=T!C$4,IF(B498<=T!C$5,Bogføring!G498,\"\"),\"\")","v":""},"2021-09-10",245,null,null,null,2025,120.31,null,{"$f":"IF(G498=\"\",\"\",IF(ISERROR(VLOOKUP(G498,Kontoplan!A:D,2,0)),\"Konto findes ikke!\",VLOOKUP(G498,Kontoplan!A:D,2,0)))","v":"Regnskabsservice"}]
[{"$f":"IF(B499>=T!C$4,IF(B499<=T!C$5,Bogføring!G499,\"\"),\"\")","v":""},"2021-09-10",245,null,null,null,12310,null,120.31,{"$f":"IF(G499=\"\",\"\",IF(ISERROR(VLOOKUP(G499,Kontoplan!A:D,2,0)),\"Konto findes ikke!\",VLOOKUP(G499,Kontoplan!A:D,2,0)))","v":"Bank konto"}]
[{"$f":"IF(B500>=T!C$4,IF(B500<=T!C$5,Bogføring!G500,\"\"),\"\")","v":""},"2021-09-10",246,null,null,null,2190,137.5,null,{"$f":"IF(G500=\"\",\"\",IF(ISERROR(VLOOKUP(G500,Kontoplan!A:D,2,0)),\"Konto findes ikke!\",VLOOKUP(G500,Kontoplan!A:D,2,0)))","v":"Diverse Udgifter"}]
[{"$f":"IF(B501>=T!C$4,IF(B501<=T!C$5,Bogføring!G501,\"\"),\"\")","v":""},"2021-09-10",246,null,null,null,12310,null,137.5,{"$f":"IF(G501=\"\",\"\",IF(ISERROR(VLOOKUP(G501,Kontoplan!A:D,2,0)),\"Konto findes ikke!\",VLOOKUP(G501,Kontoplan!A:D,2,0)))","v":"Bank konto"}]
[{"$f":"IF(B502>=T!C$4,IF(B502<=T!C$5,Bogføring!G502,\"\"),\"\")","v":""},"2021-09-10",247,null,null,null,2190,642.65,null,{"$f":"IF(G502=\"\",\"\",IF(ISERROR(VLOOKUP(G502,Kontoplan!A:D,2,0)),\"Konto findes ikke!\",VLOOKUP(G502,Kontoplan!A:D,2,0)))","v":"Diverse Udgifter"}]
[{"$f":"IF(B503>=T!C$4,IF(B503<=T!C$5,Bogføring!G503,\"\"),\"\")","v":""},"2021-09-10",247,null,null,null,12310,null,642.65,{"$f":"IF(G503=\"\",\"\",IF(ISERROR(VLOOKUP(G503,Kontoplan!A:D,2,0)),\"Konto findes ikke!\",VLOOKUP(G503,Kontoplan!A:D,2,0)))","v":"Bank konto"}]
[{"$f":"IF(B504>=T!C$4,IF(B504<=T!C$5,Bogføring!G504,\"\"),\"\")","v":""},"2021-09-10",248,null,null,null,2190,418.13,null,{"$f":"IF(G504=\"\",\"\",IF(ISERROR(VLOOKUP(G504,Kontoplan!A:D,2,0)),\"Konto findes ikke!\",VLOOKUP(G504,Kontoplan!A:D,2,0)))","v":"Diverse Udgifter"}]
[{"$f":"IF(B505>=T!C$4,IF(B505<=T!C$5,Bogføring!G505,\"\"),\"\")","v":""},"2021-09-10",248,null,null,null,12310,null,418.13,{"$f":"IF(G505=\"\",\"\",IF(ISERROR(VLOOKUP(G505,Kontoplan!A:D,2,0)),\"Konto findes ikke!\",VLOOKUP(G505,Kontoplan!A:D,2,0)))","v":"Bank konto"}]
[{"$f":"IF(B506>=T!C$4,IF(B506<=T!C$5,Bogføring!G506,\"\"),\"\")","v":""},"2021-09-10",249,null,null,null,2190,640,null,{"$f":"IF(G506=\"\",\"\",IF(ISERROR(VLOOKUP(G506,Kontoplan!A:D,2,0)),\"Konto findes ikke!\",VLOOKUP(G506,Kontoplan!A:D,2,0)))","v":"Diverse Udgifter"}]
[{"$f":"IF(B507>=T!C$4,IF(B507<=T!C$5,Bogføring!G507,\"\"),\"\")","v":""},"2021-09-10",249,null,null,null,12310,null,640,{"$f":"IF(G507=\"\",\"\",IF(ISERROR(VLOOKUP(G507,Kontoplan!A:D,2,0)),\"Konto findes ikke!\",VLOOKUP(G507,Kontoplan!A:D,2,0)))","v":"Bank konto"}]
[{"$f":"IF(B508>=T!C$4,IF(B508<=T!C$5,Bogføring!G508,\"\"),\"\")","v":""},"2021-09-10",250,null,null,null,2135,80,null,{"$f":"IF(G508=\"\",\"\",IF(ISERROR(VLOOKUP(G508,Kontoplan!A:D,2,0)),\"Konto findes ikke!\",VLOOKUP(G508,Kontoplan!A:D,2,0)))","v":"Tryksager"}]
[{"$f":"IF(B509>=T!C$4,IF(B509<=T!C$5,Bogføring!G509,\"\"),\"\")","v":""},"2021-09-10",250,null,null,null,12310,null,80,{"$f":"IF(G509=\"\",\"\",IF(ISERROR(VLOOKUP(G509,Kontoplan!A:D,2,0)),\"Konto findes ikke!\",VLOOKUP(G509,Kontoplan!A:D,2,0)))","v":"Bank konto"}]
[{"$f":"IF(B510>=T!C$4,IF(B510<=T!C$5,Bogføring!G510,\"\"),\"\")","v":""},"2021-09-10",251,null,null,null,2035,137.85,null,{"$f":"IF(G510=\"\",\"\",IF(ISERROR(VLOOKUP(G510,Kontoplan!A:D,2,0)),\"Konto findes ikke!\",VLOOKUP(G510,Kontoplan!A:D,2,0)))","v":"Grønne områder"}]
[{"$f":"IF(B511>=T!C$4,IF(B511<=T!C$5,Bogføring!G511,\"\"),\"\")","v":""},"2021-09-10",251,null,null,null,12310,null,137.85,{"$f":"IF(G511=\"\",\"\",IF(ISERROR(VLOOKUP(G511,Kontoplan!A:D,2,0)),\"Konto findes ikke!\",VLOOKUP(G511,Kontoplan!A:D,2,0)))","v":"Bank konto"}]
[{"$f":"IF(B512>=T!C$4,IF(B512<=T!C$5,Bogføring!G512,\"\"),\"\")","v":""},"2021-09-10",252,null,null,null,2190,1128,null,{"$f":"IF(G512=\"\",\"\",IF(ISERROR(VLOOKUP(G512,Kontoplan!A:D,2,0)),\"Konto findes ikke!\",VLOOKUP(G512,Kontoplan!A:D,2,0)))","v":"Diverse Udgifter"}]
[{"$f":"IF(B513>=T!C$4,IF(B513<=T!C$5,Bogføring!G513,\"\"),\"\")","v":""},"2021-09-10",252,null,null,null,12310,null,1128,{"$f":"IF(G513=\"\",\"\",IF(ISERROR(VLOOKUP(G513,Kontoplan!A:D,2,0)),\"Konto findes ikke!\",VLOOKUP(G513,Kontoplan!A:D,2,0)))","v":"Bank konto"}]
[{"$f":"IF(B514>=T!C$4,IF(B514<=T!C$5,Bogføring!G514,\"\"),\"\")","v":""},"2021-09-10",253,null,null,null,2190,72.5,null,{"$f":"IF(G514=\"\",\"\",IF(ISERROR(VLOOKUP(G514,Kontoplan!A:D,2,0)),\"Konto findes ikke!\",VLOOKUP(G514,Kontoplan!A:D,2,0)))","v":"Diverse Udgifter"}]
[{"$f":"IF(B515>=T!C$4,IF(B515<=T!C$5,Bogføring!G515,\"\"),\"\")","v":""},"2021-09-10",253,null,null,null,12310,null,72.5,{"$f":"IF(G515=\"\",\"\",IF(ISERROR(VLOOKUP(G515,Kontoplan!A:D,2,0)),\"Konto findes ikke!\",VLOOKUP(G515,Kontoplan!A:D,2,0)))","v":"Bank konto"}]
[{"$f":"IF(B516>=T!C$4,IF(B516<=T!C$5,Bogføring!G516,\"\"),\"\")","v":""},"2021-09-10",254,null,null,null,2100,28,null,{"$f":"IF(G516=\"\",\"\",IF(ISERROR(VLOOKUP(G516,Kontoplan!A:D,2,0)),\"Konto findes ikke!\",VLOOKUP(G516,Kontoplan!A:D,2,0)))","v":"Forplejning til møder/Rejser"}]
[{"$f":"IF(B517>=T!C$4,IF(B517<=T!C$5,Bogføring!G517,\"\"),\"\")","v":""},"2021-09-10",254,null,null,null,12310,null,28,{"$f":"IF(G517=\"\",\"\",IF(ISERROR(VLOOKUP(G517,Kontoplan!A:D,2,0)),\"Konto findes ikke!\",VLOOKUP(G517,Kontoplan!A:D,2,0)))","v":"Bank konto"}]
[{"$f":"IF(B518>=T!C$4,IF(B518<=T!C$5,Bogføring!G518,\"\"),\"\")","v":""},"2021-09-10",255,null,null,null,2055,198.75,null,{"$f":"IF(G518=\"\",\"\",IF(ISERROR(VLOOKUP(G518,Kontoplan!A:D,2,0)),\"Konto findes ikke!\",VLOOKUP(G518,Kontoplan!A:D,2,0)))","v":"Indkøb af øl + vand"}]
[{"$f":"IF(B519>=T!C$4,IF(B519<=T!C$5,Bogføring!G519,\"\"),\"\")","v":""},"2021-09-10",255,null,null,null,12310,null,198.75,{"$f":"IF(G519=\"\",\"\",IF(ISERROR(VLOOKUP(G519,Kontoplan!A:D,2,0)),\"Konto findes ikke!\",VLOOKUP(G519,Kontoplan!A:D,2,0)))","v":"Bank konto"}]
[{"$f":"IF(B520>=T!C$4,IF(B520<=T!C$5,Bogføring!G520,\"\"),\"\")","v":""},"2021-09-10",256,null,null,null,2200,150,null,{"$f":"IF(G520=\"\",\"\",IF(ISERROR(VLOOKUP(G520,Kontoplan!A:D,2,0)),\"Konto findes ikke!\",VLOOKUP(G520,Kontoplan!A:D,2,0)))","v":"Kontingenter overført til KVB"}]
[{"$f":"IF(B521>=T!C$4,IF(B521<=T!C$5,Bogføring!G521,\"\"),\"\")","v":""},"2021-09-10",256,null,null,null,12310,null,150,{"$f":"IF(G521=\"\",\"\",IF(ISERROR(VLOOKUP(G521,Kontoplan!A:D,2,0)),\"Konto findes ikke!\",VLOOKUP(G521,Kontoplan!A:D,2,0)))","v":"Bank konto"}]
[{"$f":"IF(B522>=T!C$4,IF(B522<=T!C$5,Bogføring!G522,\"\"),\"\")","v":""},"2021-09-10",257,null,null,null,12320,315,null,{"$f":"IF(G522=\"\",\"\",IF(ISERROR(VLOOKUP(G522,Kontoplan!A:D,2,0)),\"Konto findes ikke!\",VLOOKUP(G522,Kontoplan!A:D,2,0)))","v":"Kasse"}]
[{"$f":"IF(B523>=T!C$4,IF(B523<=T!C$5,Bogføring!G523,\"\"),\"\")","v":""},"2021-09-10",257,null,null,null,1010,null,315,{"$f":"IF(G523=\"\",\"\",IF(ISERROR(VLOOKUP(G523,Kontoplan!A:D,2,0)),\"Konto findes ikke!\",VLOOKUP(G523,Kontoplan!A:D,2,0)))","v":"Kiosk salg"}]
[{"$f":"IF(B524>=T!C$4,IF(B524<=T!C$5,Bogføring!G524,\"\"),\"\")","v":""},"2021-09-11",258,null,null,null,12320,1486.5,null,{"$f":"IF(G524=\"\",\"\",IF(ISERROR(VLOOKUP(G524,Kontoplan!A:D,2,0)),\"Konto findes ikke!\",VLOOKUP(G524,Kontoplan!A:D,2,0)))","v":"Kasse"}]
[{"$f":"IF(B525>=T!C$4,IF(B525<=T!C$5,Bogføring!G525,\"\"),\"\")","v":""},"2021-09-11",258,null,null,null,1010,null,1486.5,{"$f":"IF(G525=\"\",\"\",IF(ISERROR(VLOOKUP(G525,Kontoplan!A:D,2,0)),\"Konto findes ikke!\",VLOOKUP(G525,Kontoplan!A:D,2,0)))","v":"Kiosk salg"}]
[{"$f":"IF(B526>=T!C$4,IF(B526<=T!C$5,Bogføring!G526,\"\"),\"\")","v":""},"2021-09-11",259,null,null,null,2140,2,null,{"$f":"IF(G526=\"\",\"\",IF(ISERROR(VLOOKUP(G526,Kontoplan!A:D,2,0)),\"Konto findes ikke!\",VLOOKUP(G526,Kontoplan!A:D,2,0)))","v":"Kassedifferance"}]
[{"$f":"IF(B527>=T!C$4,IF(B527<=T!C$5,Bogføring!G527,\"\"),\"\")","v":""},"2021-09-11",259,null,null,null,12320,null,2,{"$f":"IF(G527=\"\",\"\",IF(ISERROR(VLOOKUP(G527,Kontoplan!A:D,2,0)),\"Konto findes ikke!\",VLOOKUP(G527,Kontoplan!A:D,2,0)))","v":"Kasse"}]
[{"$f":"IF(B528>=T!C$4,IF(B528<=T!C$5,Bogføring!G528,\"\"),\"\")","v":""},"2021-09-14",260,null,null,null,12310,4681.8,null,{"$f":"IF(G528=\"\",\"\",IF(ISERROR(VLOOKUP(G528,Kontoplan!A:D,2,0)),\"Konto findes ikke!\",VLOOKUP(G528,Kontoplan!A:D,2,0)))","v":"Bank konto"}]
[{"$f":"IF(B529>=T!C$4,IF(B529<=T!C$5,Bogføring!G529,\"\"),\"\")","v":""},"2021-09-14",260,null,null,null,1000,null,4681.8,{"$f":"IF(G529=\"\",\"\",IF(ISERROR(VLOOKUP(G529,Kontoplan!A:D,2,0)),\"Konto findes ikke!\",VLOOKUP(G529,Kontoplan!A:D,2,0)))","v":"Entre"}]
[{"$f":"IF(B530>=T!C$4,IF(B530<=T!C$5,Bogføring!G530,\"\"),\"\")","v":""},"2021-09-14",261,null,null,null,12310,600,null,{"$f":"IF(G530=\"\",\"\",IF(ISERROR(VLOOKUP(G530,Kontoplan!A:D,2,0)),\"Konto findes ikke!\",VLOOKUP(G530,Kontoplan!A:D,2,0)))","v":"Bank konto"}]
[{"$f":"IF(B531>=T!C$4,IF(B531<=T!C$5,Bogføring!G531,\"\"),\"\")","v":""},"2021-09-14",261,null,null,null,1000,null,600,{"$f":"IF(G531=\"\",\"\",IF(ISERROR(VLOOKUP(G531,Kontoplan!A:D,2,0)),\"Konto findes ikke!\",VLOOKUP(G531,Kontoplan!A:D,2,0)))","v":"Entre"}]
[{"$f":"IF(B532>=T!C$4,IF(B532<=T!C$5,Bogføring!G532,\"\"),\"\")","v":""},"2021-09-14",262,null,null,null,12310,20000,null,{"$f":"IF(G532=\"\",\"\",IF(ISERROR(VLOOKUP(G532,Kontoplan!A:D,2,0)),\"Konto findes ikke!\",VLOOKUP(G532,Kontoplan!A:D,2,0)))","v":"Bank konto"}]
[{"$f":"IF(B533>=T!C$4,IF(B533<=T!C$5,Bogføring!G533,\"\"),\"\")","v":""},"2021-09-14",262,null,null,null,1040,null,20000,{"$f":"IF(G533=\"\",\"\",IF(ISERROR(VLOOKUP(G533,Kontoplan!A:D,2,0)),\"Konto findes ikke!\",VLOOKUP(G533,Kontoplan!A:D,2,0)))","v":"Fonde/Gaver"}]
[{"$f":"IF(B534>=T!C$4,IF(B534<=T!C$5,Bogføring!G534,\"\"),\"\")","v":""},"2021-09-15",263,null,null,null,12310,3812,null,{"$f":"IF(G534=\"\",\"\",IF(ISERROR(VLOOKUP(G534,Kontoplan!A:D,2,0)),\"Konto findes ikke!\",VLOOKUP(G534,Kontoplan!A:D,2,0)))","v":"Bank konto"}]
[{"$f":"IF(B535>=T!C$4,IF(B535<=T!C$5,Bogføring!G535,\"\"),\"\")","v":""},"2021-09-15",263,null,null,null,12320,null,3812,{"$f":"IF(G535=\"\",\"\",IF(ISERROR(VLOOKUP(G535,Kontoplan!A:D,2,0)),\"Konto findes ikke!\",VLOOKUP(G535,Kontoplan!A:D,2,0)))","v":"Kasse"}]
[{"$f":"IF(B536>=T!C$4,IF(B536<=T!C$5,Bogføring!G536,\"\"),\"\")","v":""},"2021-09-15",264,null,null,null,2190,60,null,{"$f":"IF(G536=\"\",\"\",IF(ISERROR(VLOOKUP(G536,Kontoplan!A:D,2,0)),\"Konto findes ikke!\",VLOOKUP(G536,Kontoplan!A:D,2,0)))","v":"Diverse Udgifter"}]
[{"$f":"IF(B537>=T!C$4,IF(B537<=T!C$5,Bogføring!G537,\"\"),\"\")","v":""},"2021-09-15",264,null,null,null,12310,null,60,{"$f":"IF(G537=\"\",\"\",IF(ISERROR(VLOOKUP(G537,Kontoplan!A:D,2,0)),\"Konto findes ikke!\",VLOOKUP(G537,Kontoplan!A:D,2,0)))","v":"Bank konto"}]
[{"$f":"IF(B538>=T!C$4,IF(B538<=T!C$5,Bogføring!G538,\"\"),\"\")","v":""},"2021-09-15",265,null,null,null,2190,2000,null,{"$f":"IF(G538=\"\",\"\",IF(ISERROR(VLOOKUP(G538,Kontoplan!A:D,2,0)),\"Konto findes ikke!\",VLOOKUP(G538,Kontoplan!A:D,2,0)))","v":"Diverse Udgifter"}]
[{"$f":"IF(B539>=T!C$4,IF(B539<=T!C$5,Bogføring!G539,\"\"),\"\")","v":""},"2021-09-15",265,null,null,null,12310,null,2000,{"$f":"IF(G539=\"\",\"\",IF(ISERROR(VLOOKUP(G539,Kontoplan!A:D,2,0)),\"Konto findes ikke!\",VLOOKUP(G539,Kontoplan!A:D,2,0)))","v":"Bank konto"}]
[{"$f":"IF(B540>=T!C$4,IF(B540<=T!C$5,Bogføring!G540,\"\"),\"\")","v":""},"2021-09-15",266,null,null,null,2190,72.5,null,{"$f":"IF(G540=\"\",\"\",IF(ISERROR(VLOOKUP(G540,Kontoplan!A:D,2,0)),\"Konto findes ikke!\",VLOOKUP(G540,Kontoplan!A:D,2,0)))","v":"Diverse Udgifter"}]
[{"$f":"IF(B541>=T!C$4,IF(B541<=T!C$5,Bogføring!G541,\"\"),\"\")","v":""},"2021-09-15",266,null,null,null,12310,null,72.5,{"$f":"IF(G541=\"\",\"\",IF(ISERROR(VLOOKUP(G541,Kontoplan!A:D,2,0)),\"Konto findes ikke!\",VLOOKUP(G541,Kontoplan!A:D,2,0)))","v":"Bank konto"}]
[{"$f":"IF(B542>=T!C$4,IF(B542<=T!C$5,Bogføring!G542,\"\"),\"\")","v":""},"2021-09-15",267,null,null,null,3100,750,null,{"$f":"IF(G542=\"\",\"\",IF(ISERROR(VLOOKUP(G542,Kontoplan!A:D,2,0)),\"Konto findes ikke!\",VLOOKUP(G542,Kontoplan!A:D,2,0)))","v":"Lønomkostninger"}]
[{"$f":"IF(B543>=T!C$4,IF(B543<=T!C$5,Bogføring!G543,\"\"),\"\")","v":""},"2021-09-15",267,null,null,null,12310,null,750,{"$f":"IF(G543=\"\",\"\",IF(ISERROR(VLOOKUP(G543,Kontoplan!A:D,2,0)),\"Konto findes ikke!\",VLOOKUP(G543,Kontoplan!A:D,2,0)))","v":"Bank konto"}]
[{"$f":"IF(B544>=T!C$4,IF(B544<=T!C$5,Bogføring!G544,\"\"),\"\")","v":""},"2021-09-15",268,null,null,null,12320,800,null,{"$f":"IF(G544=\"\",\"\",IF(ISERROR(VLOOKUP(G544,Kontoplan!A:D,2,0)),\"Konto findes ikke!\",VLOOKUP(G544,Kontoplan!A:D,2,0)))","v":"Kasse"}]
[{"$f":"IF(B545>=T!C$4,IF(B545<=T!C$5,Bogføring!G545,\"\"),\"\")","v":""},"2021-09-15",268,null,null,null,1010,null,800,{"$f":"IF(G545=\"\",\"\",IF(ISERROR(VLOOKUP(G545,Kontoplan!A:D,2,0)),\"Konto findes ikke!\",VLOOKUP(G545,Kontoplan!A:D,2,0)))","v":"Kiosk salg"}]
[{"$f":"IF(B546>=T!C$4,IF(B546<=T!C$5,Bogføring!G546,\"\"),\"\")","v":""},"2021-09-16",269,null,null,null,12310,null,50,{"$f":"IF(G546=\"\",\"\",IF(ISERROR(VLOOKUP(G546,Kontoplan!A:D,2,0)),\"Konto findes ikke!\",VLOOKUP(G546,Kontoplan!A:D,2,0)))","v":"Bank konto"}]
[{"$f":"IF(B547>=T!C$4,IF(B547<=T!C$5,Bogføring!G547,\"\"),\"\")","v":""},"2021-09-16",269,null,null,null,2060,50,null,{"$f":"IF(G547=\"\",\"\",IF(ISERROR(VLOOKUP(G547,Kontoplan!A:D,2,0)),\"Konto findes ikke!\",VLOOKUP(G547,Kontoplan!A:D,2,0)))","v":"Internet, mobiltelefon, Forsik."}]
[{"$f":"IF(B548>=T!C$4,IF(B548<=T!C$5,Bogføring!G548,\"\"),\"\")","v":""},"2021-09-16",270,null,null,null,12320,240,null,{"$f":"IF(G548=\"\",\"\",IF(ISERROR(VLOOKUP(G548,Kontoplan!A:D,2,0)),\"Konto findes ikke!\",VLOOKUP(G548,Kontoplan!A:D,2,0)))","v":"Kasse"}]
[{"$f":"IF(B549>=T!C$4,IF(B549<=T!C$5,Bogføring!G549,\"\"),\"\")","v":""},"2021-09-16",270,null,null,null,1010,null,240,{"$f":"IF(G549=\"\",\"\",IF(ISERROR(VLOOKUP(G549,Kontoplan!A:D,2,0)),\"Konto findes ikke!\",VLOOKUP(G549,Kontoplan!A:D,2,0)))","v":"Kiosk salg"}]
[{"$f":"IF(B550>=T!C$4,IF(B550<=T!C$5,Bogføring!G550,\"\"),\"\")","v":""},"2021-09-16",271,null,null,null,12310,140,null,{"$f":"IF(G550=\"\",\"\",IF(ISERROR(VLOOKUP(G550,Kontoplan!A:D,2,0)),\"Konto findes ikke!\",VLOOKUP(G550,Kontoplan!A:D,2,0)))","v":"Bank konto"}]
[{"$f":"IF(B551>=T!C$4,IF(B551<=T!C$5,Bogføring!G551,\"\"),\"\")","v":""},"2021-09-16",271,null,null,null,1000,null,140,{"$f":"IF(G551=\"\",\"\",IF(ISERROR(VLOOKUP(G551,Kontoplan!A:D,2,0)),\"Konto findes ikke!\",VLOOKUP(G551,Kontoplan!A:D,2,0)))","v":"Entre"}]
[{"$f":"IF(B552>=T!C$4,IF(B552<=T!C$5,Bogføring!G552,\"\"),\"\")","v":""},"2021-09-17",272,null,null,null,12310,null,94.1,{"$f":"IF(G552=\"\",\"\",IF(ISERROR(VLOOKUP(G552,Kontoplan!A:D,2,0)),\"Konto findes ikke!\",VLOOKUP(G552,Kontoplan!A:D,2,0)))","v":"Bank konto"}]
[{"$f":"IF(B553>=T!C$4,IF(B553<=T!C$5,Bogføring!G553,\"\"),\"\")","v":""},"2021-09-17",272,null,null,null,2100,94.1,null,{"$f":"IF(G553=\"\",\"\",IF(ISERROR(VLOOKUP(G553,Kontoplan!A:D,2,0)),\"Konto findes ikke!\",VLOOKUP(G553,Kontoplan!A:D,2,0)))","v":"Forplejning til møder/Rejser"}]
[{"$f":"IF(B554>=T!C$4,IF(B554<=T!C$5,Bogføring!G554,\"\"),\"\")","v":""},"2021-09-17",273,null,null,null,12320,135,null,{"$f":"IF(G554=\"\",\"\",IF(ISERROR(VLOOKUP(G554,Kontoplan!A:D,2,0)),\"Konto findes ikke!\",VLOOKUP(G554,Kontoplan!A:D,2,0)))","v":"Kasse"}]
[{"$f":"IF(B555>=T!C$4,IF(B555<=T!C$5,Bogføring!G555,\"\"),\"\")","v":""},"2021-09-17",273,null,null,null,1010,null,135,{"$f":"IF(G555=\"\",\"\",IF(ISERROR(VLOOKUP(G555,Kontoplan!A:D,2,0)),\"Konto findes ikke!\",VLOOKUP(G555,Kontoplan!A:D,2,0)))","v":"Kiosk salg"}]
[{"$f":"IF(B556>=T!C$4,IF(B556<=T!C$5,Bogføring!G556,\"\"),\"\")","v":""},"2021-09-18",274,null,null,null,12320,105,null,{"$f":"IF(G556=\"\",\"\",IF(ISERROR(VLOOKUP(G556,Kontoplan!A:D,2,0)),\"Konto findes ikke!\",VLOOKUP(G556,Kontoplan!A:D,2,0)))","v":"Kasse"}]
[{"$f":"IF(B557>=T!C$4,IF(B557<=T!C$5,Bogføring!G557,\"\"),\"\")","v":""},"2021-09-18",274,null,null,null,1010,null,105,{"$f":"IF(G557=\"\",\"\",IF(ISERROR(VLOOKUP(G557,Kontoplan!A:D,2,0)),\"Konto findes ikke!\",VLOOKUP(G557,Kontoplan!A:D,2,0)))","v":"Kiosk salg"}]
[{"$f":"IF(B558>=T!C$4,IF(B558<=T!C$5,Bogføring!G558,\"\"),\"\")","v":""},"2021-09-21",275,null,null,null,12310,3181.67,null,{"$f":"IF(G558=\"\",\"\",IF(ISERROR(VLOOKUP(G558,Kontoplan!A:D,2,0)),\"Konto findes ikke!\",VLOOKUP(G558,Kontoplan!A:D,2,0)))","v":"Bank konto"}]
[{"$f":"IF(B559>=T!C$4,IF(B559<=T!C$5,Bogføring!G559,\"\"),\"\")","v":""},"2021-09-21",275,null,null,null,1000,null,3181.67,{"$f":"IF(G559=\"\",\"\",IF(ISERROR(VLOOKUP(G559,Kontoplan!A:D,2,0)),\"Konto findes ikke!\",VLOOKUP(G559,Kontoplan!A:D,2,0)))","v":"Entre"}]
[{"$f":"IF(B560>=T!C$4,IF(B560<=T!C$5,Bogføring!G560,\"\"),\"\")","v":""},"2021-09-22",276,null,null,null,12320,420,null,{"$f":"IF(G560=\"\",\"\",IF(ISERROR(VLOOKUP(G560,Kontoplan!A:D,2,0)),\"Konto findes ikke!\",VLOOKUP(G560,Kontoplan!A:D,2,0)))","v":"Kasse"}]
[{"$f":"IF(B561>=T!C$4,IF(B561<=T!C$5,Bogføring!G561,\"\"),\"\")","v":""},"2021-09-22",276,null,null,null,1010,null,420,{"$f":"IF(G561=\"\",\"\",IF(ISERROR(VLOOKUP(G561,Kontoplan!A:D,2,0)),\"Konto findes ikke!\",VLOOKUP(G561,Kontoplan!A:D,2,0)))","v":"Kiosk salg"}]
[{"$f":"IF(B562>=T!C$4,IF(B562<=T!C$5,Bogføring!G562,\"\"),\"\")","v":""},"2021-09-23",277,null,null,null,12320,1310,null,{"$f":"IF(G562=\"\",\"\",IF(ISERROR(VLOOKUP(G562,Kontoplan!A:D,2,0)),\"Konto findes ikke!\",VLOOKUP(G562,Kontoplan!A:D,2,0)))","v":"Kasse"}]
[{"$f":"IF(B563>=T!C$4,IF(B563<=T!C$5,Bogføring!G563,\"\"),\"\")","v":""},"2021-09-23",277,null,null,null,1010,null,1310,{"$f":"IF(G563=\"\",\"\",IF(ISERROR(VLOOKUP(G563,Kontoplan!A:D,2,0)),\"Konto findes ikke!\",VLOOKUP(G563,Kontoplan!A:D,2,0)))","v":"Kiosk salg"}]
[{"$f":"IF(B564>=T!C$4,IF(B564<=T!C$5,Bogføring!G564,\"\"),\"\")","v":""},"2021-09-24",278,null,null,null,12320,65,null,{"$f":"IF(G564=\"\",\"\",IF(ISERROR(VLOOKUP(G564,Kontoplan!A:D,2,0)),\"Konto findes ikke!\",VLOOKUP(G564,Kontoplan!A:D,2,0)))","v":"Kasse"}]
[{"$f":"IF(B565>=T!C$4,IF(B565<=T!C$5,Bogføring!G565,\"\"),\"\")","v":""},"2021-09-24",278,null,null,null,1010,null,65,{"$f":"IF(G565=\"\",\"\",IF(ISERROR(VLOOKUP(G565,Kontoplan!A:D,2,0)),\"Konto findes ikke!\",VLOOKUP(G565,Kontoplan!A:D,2,0)))","v":"Kiosk salg"}]
[{"$f":"IF(B566>=T!C$4,IF(B566<=T!C$5,Bogføring!G566,\"\"),\"\")","v":""},"2021-09-24",279,null,null,null,12310,3730,null,{"$f":"IF(G566=\"\",\"\",IF(ISERROR(VLOOKUP(G566,Kontoplan!A:D,2,0)),\"Konto findes ikke!\",VLOOKUP(G566,Kontoplan!A:D,2,0)))","v":"Bank konto"}]
[{"$f":"IF(B567>=T!C$4,IF(B567<=T!C$5,Bogføring!G567,\"\"),\"\")","v":""},"2021-09-24",279,null,null,null,12320,null,3730,{"$f":"IF(G567=\"\",\"\",IF(ISERROR(VLOOKUP(G567,Kontoplan!A:D,2,0)),\"Konto findes ikke!\",VLOOKUP(G567,Kontoplan!A:D,2,0)))","v":"Kasse"}]
[{"$f":"IF(B568>=T!C$4,IF(B568<=T!C$5,Bogføring!G568,\"\"),\"\")","v":""},"2021-09-24",280,null,null,null,12310,2000,null,{"$f":"IF(G568=\"\",\"\",IF(ISERROR(VLOOKUP(G568,Kontoplan!A:D,2,0)),\"Konto findes ikke!\",VLOOKUP(G568,Kontoplan!A:D,2,0)))","v":"Bank konto"}]
[{"$f":"IF(B569>=T!C$4,IF(B569<=T!C$5,Bogføring!G569,\"\"),\"\")","v":""},"2021-09-24",280,null,null,null,1000,null,2000,{"$f":"IF(G569=\"\",\"\",IF(ISERROR(VLOOKUP(G569,Kontoplan!A:D,2,0)),\"Konto findes ikke!\",VLOOKUP(G569,Kontoplan!A:D,2,0)))","v":"Entre"}]
[{"$f":"IF(B570>=T!C$4,IF(B570<=T!C$5,Bogføring!G570,\"\"),\"\")","v":""},"2021-09-28",281,null,null,null,12310,4319.0600000000004,null,{"$f":"IF(G570=\"\",\"\",IF(ISERROR(VLOOKUP(G570,Kontoplan!A:D,2,0)),\"Konto findes ikke!\",VLOOKUP(G570,Kontoplan!A:D,2,0)))","v":"Bank konto"}]
[{"$f":"IF(B571>=T!C$4,IF(B571<=T!C$5,Bogføring!G571,\"\"),\"\")","v":""},"2021-09-28",281,null,null,null,1000,null,4319.0600000000004,{"$f":"IF(G571=\"\",\"\",IF(ISERROR(VLOOKUP(G571,Kontoplan!A:D,2,0)),\"Konto findes ikke!\",VLOOKUP(G571,Kontoplan!A:D,2,0)))","v":"Entre"}]
[{"$f":"IF(B572>=T!C$4,IF(B572<=T!C$5,Bogføring!G572,\"\"),\"\")","v":""},"2021-09-28",282,null,null,null,12310,1200,null,{"$f":"IF(G572=\"\",\"\",IF(ISERROR(VLOOKUP(G572,Kontoplan!A:D,2,0)),\"Konto findes ikke!\",VLOOKUP(G572,Kontoplan!A:D,2,0)))","v":"Bank konto"}]
[{"$f":"IF(B573>=T!C$4,IF(B573<=T!C$5,Bogføring!G573,\"\"),\"\")","v":""},"2021-09-28",282,null,null,null,1000,null,1200,{"$f":"IF(G573=\"\",\"\",IF(ISERROR(VLOOKUP(G573,Kontoplan!A:D,2,0)),\"Konto findes ikke!\",VLOOKUP(G573,Kontoplan!A:D,2,0)))","v":"Entre"}]
[{"$f":"IF(B574>=T!C$4,IF(B574<=T!C$5,Bogføring!G574,\"\"),\"\")","v":""},"2021-09-29",283,null,null,null,3110,6743.45,null,{"$f":"IF(G574=\"\",\"\",IF(ISERROR(VLOOKUP(G574,Kontoplan!A:D,2,0)),\"Konto findes ikke!\",VLOOKUP(G574,Kontoplan!A:D,2,0)))","v":"Lønninger incl ATP -AM"}]
[{"$f":"IF(B575>=T!C$4,IF(B575<=T!C$5,Bogføring!G575,\"\"),\"\")","v":""},"2021-09-29",283,null,null,null,12310,null,6743.45,{"$f":"IF(G575=\"\",\"\",IF(ISERROR(VLOOKUP(G575,Kontoplan!A:D,2,0)),\"Konto findes ikke!\",VLOOKUP(G575,Kontoplan!A:D,2,0)))","v":"Bank konto"}]
[{"$f":"IF(B576>=T!C$4,IF(B576<=T!C$5,Bogføring!G576,\"\"),\"\")","v":""},"2021-09-29",284,null,null,null,12320,200,null,{"$f":"IF(G576=\"\",\"\",IF(ISERROR(VLOOKUP(G576,Kontoplan!A:D,2,0)),\"Konto findes ikke!\",VLOOKUP(G576,Kontoplan!A:D,2,0)))","v":"Kasse"}]
[{"$f":"IF(B577>=T!C$4,IF(B577<=T!C$5,Bogføring!G577,\"\"),\"\")","v":""},"2021-09-29",284,null,null,null,1010,null,200,{"$f":"IF(G577=\"\",\"\",IF(ISERROR(VLOOKUP(G577,Kontoplan!A:D,2,0)),\"Konto findes ikke!\",VLOOKUP(G577,Kontoplan!A:D,2,0)))","v":"Kiosk salg"}]
[{"$f":"IF(B578>=T!C$4,IF(B578<=T!C$5,Bogføring!G578,\"\"),\"\")","v":""},"2021-09-30",285,null,null,null,2000,107,null,{"$f":"IF(G578=\"\",\"\",IF(ISERROR(VLOOKUP(G578,Kontoplan!A:D,2,0)),\"Konto findes ikke!\",VLOOKUP(G578,Kontoplan!A:D,2,0)))","v":"Bankgebyr"}]
[{"$f":"IF(B579>=T!C$4,IF(B579<=T!C$5,Bogføring!G579,\"\"),\"\")","v":""},"2021-09-30",285,null,null,null,12310,null,107,{"$f":"IF(G579=\"\",\"\",IF(ISERROR(VLOOKUP(G579,Kontoplan!A:D,2,0)),\"Konto findes ikke!\",VLOOKUP(G579,Kontoplan!A:D,2,0)))","v":"Bank konto"}]
[{"$f":"IF(B580>=T!C$4,IF(B580<=T!C$5,Bogføring!G580,\"\"),\"\")","v":""},"2021-09-30",286,null,null,null,12320,200,null,{"$f":"IF(G580=\"\",\"\",IF(ISERROR(VLOOKUP(G580,Kontoplan!A:D,2,0)),\"Konto findes ikke!\",VLOOKUP(G580,Kontoplan!A:D,2,0)))","v":"Kasse"}]
[{"$f":"IF(B581>=T!C$4,IF(B581<=T!C$5,Bogføring!G581,\"\"),\"\")","v":""},"2021-09-30",286,null,null,null,1010,null,200,{"$f":"IF(G581=\"\",\"\",IF(ISERROR(VLOOKUP(G581,Kontoplan!A:D,2,0)),\"Konto findes ikke!\",VLOOKUP(G581,Kontoplan!A:D,2,0)))","v":"Kiosk salg"}]
[{"$f":"IF(B582>=T!C$4,IF(B582<=T!C$5,Bogføring!G582,\"\"),\"\")","v":""},"2021-10-01",287,null,null,null,2060,377.75,null,{"$f":"IF(G582=\"\",\"\",IF(ISERROR(VLOOKUP(G582,Kontoplan!A:D,2,0)),\"Konto findes ikke!\",VLOOKUP(G582,Kontoplan!A:D,2,0)))","v":"Internet, mobiltelefon, Forsik."}]
[{"$f":"IF(B583>=T!C$4,IF(B583<=T!C$5,Bogføring!G583,\"\"),\"\")","v":""},"2021-10-01",287,null,null,null,12310,null,377.75,{"$f":"IF(G583=\"\",\"\",IF(ISERROR(VLOOKUP(G583,Kontoplan!A:D,2,0)),\"Konto findes ikke!\",VLOOKUP(G583,Kontoplan!A:D,2,0)))","v":"Bank konto"}]
[{"$f":"IF(B584>=T!C$4,IF(B584<=T!C$5,Bogføring!G584,\"\"),\"\")","v":""},"2021-10-01",288,null,null,null,2190,324.38,null,{"$f":"IF(G584=\"\",\"\",IF(ISERROR(VLOOKUP(G584,Kontoplan!A:D,2,0)),\"Konto findes ikke!\",VLOOKUP(G584,Kontoplan!A:D,2,0)))","v":"Diverse Udgifter"}]
[{"$f":"IF(B585>=T!C$4,IF(B585<=T!C$5,Bogføring!G585,\"\"),\"\")","v":""},"2021-10-01",288,null,null,null,12310,null,324.38,{"$f":"IF(G585=\"\",\"\",IF(ISERROR(VLOOKUP(G585,Kontoplan!A:D,2,0)),\"Konto findes ikke!\",VLOOKUP(G585,Kontoplan!A:D,2,0)))","v":"Bank konto"}]
[{"$f":"IF(B586>=T!C$4,IF(B586<=T!C$5,Bogføring!G586,\"\"),\"\")","v":""},"2021-10-01",289,null,null,null,2110,1288.83,null,{"$f":"IF(G586=\"\",\"\",IF(ISERROR(VLOOKUP(G586,Kontoplan!A:D,2,0)),\"Konto findes ikke!\",VLOOKUP(G586,Kontoplan!A:D,2,0)))","v":"Kontorhold - Porto - IT"}]
[{"$f":"IF(B587>=T!C$4,IF(B587<=T!C$5,Bogføring!G587,\"\"),\"\")","v":""},"2021-10-01",289,null,null,null,12310,null,1288.83,{"$f":"IF(G587=\"\",\"\",IF(ISERROR(VLOOKUP(G587,Kontoplan!A:D,2,0)),\"Konto findes ikke!\",VLOOKUP(G587,Kontoplan!A:D,2,0)))","v":"Bank konto"}]
[{"$f":"IF(B588>=T!C$4,IF(B588<=T!C$5,Bogføring!G588,\"\"),\"\")","v":""},"2021-10-01",290,null,null,null,2030,3444.23,null,{"$f":"IF(G588=\"\",\"\",IF(ISERROR(VLOOKUP(G588,Kontoplan!A:D,2,0)),\"Konto findes ikke!\",VLOOKUP(G588,Kontoplan!A:D,2,0)))","v":"Bygnings vedligehold"}]
[{"$f":"IF(B589>=T!C$4,IF(B589<=T!C$5,Bogføring!G589,\"\"),\"\")","v":""},"2021-10-01",290,null,null,null,12310,null,3444.23,{"$f":"IF(G589=\"\",\"\",IF(ISERROR(VLOOKUP(G589,Kontoplan!A:D,2,0)),\"Konto findes ikke!\",VLOOKUP(G589,Kontoplan!A:D,2,0)))","v":"Bank konto"}]
[{"$f":"IF(B590>=T!C$4,IF(B590<=T!C$5,Bogføring!G590,\"\"),\"\")","v":""},"2021-10-01",291,null,null,null,12320,50,null,{"$f":"IF(G590=\"\",\"\",IF(ISERROR(VLOOKUP(G590,Kontoplan!A:D,2,0)),\"Konto findes ikke!\",VLOOKUP(G590,Kontoplan!A:D,2,0)))","v":"Kasse"}]
[{"$f":"IF(B591>=T!C$4,IF(B591<=T!C$5,Bogføring!G591,\"\"),\"\")","v":""},"2021-10-01",291,null,null,null,1010,null,50,{"$f":"IF(G591=\"\",\"\",IF(ISERROR(VLOOKUP(G591,Kontoplan!A:D,2,0)),\"Konto findes ikke!\",VLOOKUP(G591,Kontoplan!A:D,2,0)))","v":"Kiosk salg"}]
[{"$f":"IF(B592>=T!C$4,IF(B592<=T!C$5,Bogføring!G592,\"\"),\"\")","v":""},"2021-10-02",292,null,null,null,12320,243,null,{"$f":"IF(G592=\"\",\"\",IF(ISERROR(VLOOKUP(G592,Kontoplan!A:D,2,0)),\"Konto findes ikke!\",VLOOKUP(G592,Kontoplan!A:D,2,0)))","v":"Kasse"}]
[{"$f":"IF(B593>=T!C$4,IF(B593<=T!C$5,Bogføring!G593,\"\"),\"\")","v":""},"2021-10-02",292,null,null,null,1010,null,243,{"$f":"IF(G593=\"\",\"\",IF(ISERROR(VLOOKUP(G593,Kontoplan!A:D,2,0)),\"Konto findes ikke!\",VLOOKUP(G593,Kontoplan!A:D,2,0)))","v":"Kiosk salg"}]
[{"$f":"IF(B594>=T!C$4,IF(B594<=T!C$5,Bogføring!G594,\"\"),\"\")","v":""},"2021-10-04",293,null,null,null,3135,79826.42,null,{"$f":"IF(G594=\"\",\"\",IF(ISERROR(VLOOKUP(G594,Kontoplan!A:D,2,0)),\"Konto findes ikke!\",VLOOKUP(G594,Kontoplan!A:D,2,0)))","v":"Gl. Skat og Gebyr"}]
[{"$f":"IF(B595>=T!C$4,IF(B595<=T!C$5,Bogføring!G595,\"\"),\"\")","v":""},"2021-10-04",293,null,null,null,12310,null,79826.42,{"$f":"IF(G595=\"\",\"\",IF(ISERROR(VLOOKUP(G595,Kontoplan!A:D,2,0)),\"Konto findes ikke!\",VLOOKUP(G595,Kontoplan!A:D,2,0)))","v":"Bank konto"}]
[{"$f":"IF(B596>=T!C$4,IF(B596<=T!C$5,Bogføring!G596,\"\"),\"\")","v":""},"2021-10-05",294,null,null,null,2060,19,null,{"$f":"IF(G596=\"\",\"\",IF(ISERROR(VLOOKUP(G596,Kontoplan!A:D,2,0)),\"Konto findes ikke!\",VLOOKUP(G596,Kontoplan!A:D,2,0)))","v":"Internet, mobiltelefon, Forsik."}]
[{"$f":"IF(B597>=T!C$4,IF(B597<=T!C$5,Bogføring!G597,\"\"),\"\")","v":""},"2021-10-05",294,null,null,null,12310,null,19,{"$f":"IF(G597=\"\",\"\",IF(ISERROR(VLOOKUP(G597,Kontoplan!A:D,2,0)),\"Konto findes ikke!\",VLOOKUP(G597,Kontoplan!A:D,2,0)))","v":"Bank konto"}]
[{"$f":"IF(B598>=T!C$4,IF(B598<=T!C$5,Bogføring!G598,\"\"),\"\")","v":""},"2021-10-05",295,null,null,null,1125,null,250,{"$f":"IF(G598=\"\",\"\",IF(ISERROR(VLOOKUP(G598,Kontoplan!A:D,2,0)),\"Konto findes ikke!\",VLOOKUP(G598,Kontoplan!A:D,2,0)))","v":"Salg af inventar"}]
[{"$f":"IF(B599>=T!C$4,IF(B599<=T!C$5,Bogføring!G599,\"\"),\"\")","v":""},"2021-10-05",295,null,null,null,12310,250,null,{"$f":"IF(G599=\"\",\"\",IF(ISERROR(VLOOKUP(G599,Kontoplan!A:D,2,0)),\"Konto findes ikke!\",VLOOKUP(G599,Kontoplan!A:D,2,0)))","v":"Bank konto"}]
[{"$f":"IF(B600>=T!C$4,IF(B600<=T!C$5,Bogføring!G600,\"\"),\"\")","v":""},"2021-10-05",296,null,null,null,12310,2843.39,null,{"$f":"IF(G600=\"\",\"\",IF(ISERROR(VLOOKUP(G600,Kontoplan!A:D,2,0)),\"Konto findes ikke!\",VLOOKUP(G600,Kontoplan!A:D,2,0)))","v":"Bank konto"}]
[{"$f":"IF(B601>=T!C$4,IF(B601<=T!C$5,Bogføring!G601,\"\"),\"\")","v":""},"2021-10-05",296,null,null,null,1000,null,2843.39,{"$f":"IF(G601=\"\",\"\",IF(ISERROR(VLOOKUP(G601,Kontoplan!A:D,2,0)),\"Konto findes ikke!\",VLOOKUP(G601,Kontoplan!A:D,2,0)))","v":"Entre"}]
[{"$f":"IF(B602>=T!C$4,IF(B602<=T!C$5,Bogføring!G602,\"\"),\"\")","v":""},"2021-10-05",297,null,null,null,2010,125,null,{"$f":"IF(G602=\"\",\"\",IF(ISERROR(VLOOKUP(G602,Kontoplan!A:D,2,0)),\"Konto findes ikke!\",VLOOKUP(G602,Kontoplan!A:D,2,0)))","v":"Danløn"}]
[{"$f":"IF(B603>=T!C$4,IF(B603<=T!C$5,Bogføring!G603,\"\"),\"\")","v":""},"2021-10-05",297,null,null,null,12310,null,125,{"$f":"IF(G603=\"\",\"\",IF(ISERROR(VLOOKUP(G603,Kontoplan!A:D,2,0)),\"Konto findes ikke!\",VLOOKUP(G603,Kontoplan!A:D,2,0)))","v":"Bank konto"}]
[{"$f":"IF(B604>=T!C$4,IF(B604<=T!C$5,Bogføring!G604,\"\"),\"\")","v":""},"2021-10-05",298,null,null,null,2060,472.82,null,{"$f":"IF(G604=\"\",\"\",IF(ISERROR(VLOOKUP(G604,Kontoplan!A:D,2,0)),\"Konto findes ikke!\",VLOOKUP(G604,Kontoplan!A:D,2,0)))","v":"Internet, mobiltelefon, Forsik."}]
[{"$f":"IF(B605>=T!C$4,IF(B605<=T!C$5,Bogføring!G605,\"\"),\"\")","v":""},"2021-10-05",298,null,null,null,12310,null,472.82,{"$f":"IF(G605=\"\",\"\",IF(ISERROR(VLOOKUP(G605,Kontoplan!A:D,2,0)),\"Konto findes ikke!\",VLOOKUP(G605,Kontoplan!A:D,2,0)))","v":"Bank konto"}]
[{"$f":"IF(B606>=T!C$4,IF(B606<=T!C$5,Bogføring!G606,\"\"),\"\")","v":""},"2021-10-05",299,null,null,null,2025,120.31,null,{"$f":"IF(G606=\"\",\"\",IF(ISERROR(VLOOKUP(G606,Kontoplan!A:D,2,0)),\"Konto findes ikke!\",VLOOKUP(G606,Kontoplan!A:D,2,0)))","v":"Regnskabsservice"}]
[{"$f":"IF(B607>=T!C$4,IF(B607<=T!C$5,Bogføring!G607,\"\"),\"\")","v":""},"2021-10-05",299,null,null,null,12310,null,120.31,{"$f":"IF(G607=\"\",\"\",IF(ISERROR(VLOOKUP(G607,Kontoplan!A:D,2,0)),\"Konto findes ikke!\",VLOOKUP(G607,Kontoplan!A:D,2,0)))","v":"Bank konto"}]
[{"$f":"IF(B608>=T!C$4,IF(B608<=T!C$5,Bogføring!G608,\"\"),\"\")","v":""},"2021-10-07",300,null,null,null,2035,62.57,null,{"$f":"IF(G608=\"\",\"\",IF(ISERROR(VLOOKUP(G608,Kontoplan!A:D,2,0)),\"Konto findes ikke!\",VLOOKUP(G608,Kontoplan!A:D,2,0)))","v":"Grønne områder"}]
[{"$f":"IF(B609>=T!C$4,IF(B609<=T!C$5,Bogføring!G609,\"\"),\"\")","v":""},"2021-10-07",300,null,null,null,12310,null,62.57,{"$f":"IF(G609=\"\",\"\",IF(ISERROR(VLOOKUP(G609,Kontoplan!A:D,2,0)),\"Konto findes ikke!\",VLOOKUP(G609,Kontoplan!A:D,2,0)))","v":"Bank konto"}]
[{"$f":"IF(B610>=T!C$4,IF(B610<=T!C$5,Bogføring!G610,\"\"),\"\")","v":""},"2021-10-08",301,null,null,null,2165,124.44,null,{"$f":"IF(G610=\"\",\"\",IF(ISERROR(VLOOKUP(G610,Kontoplan!A:D,2,0)),\"Konto findes ikke!\",VLOOKUP(G610,Kontoplan!A:D,2,0)))","v":"G4S tyverialarm"}]
[{"$f":"IF(B611>=T!C$4,IF(B611<=T!C$5,Bogføring!G611,\"\"),\"\")","v":""},"2021-10-08",301,null,null,null,12310,null,124.44,{"$f":"IF(G611=\"\",\"\",IF(ISERROR(VLOOKUP(G611,Kontoplan!A:D,2,0)),\"Konto findes ikke!\",VLOOKUP(G611,Kontoplan!A:D,2,0)))","v":"Bank konto"}]
[{"$f":"IF(B612>=T!C$4,IF(B612<=T!C$5,Bogføring!G612,\"\"),\"\")","v":""},"2021-10-10",302,null,null,null,12320,295,null,{"$f":"IF(G612=\"\",\"\",IF(ISERROR(VLOOKUP(G612,Kontoplan!A:D,2,0)),\"Konto findes ikke!\",VLOOKUP(G612,Kontoplan!A:D,2,0)))","v":"Kasse"}]
[{"$f":"IF(B613>=T!C$4,IF(B613<=T!C$5,Bogføring!G613,\"\"),\"\")","v":""},"2021-10-10",302,null,null,null,1010,null,295,{"$f":"IF(G613=\"\",\"\",IF(ISERROR(VLOOKUP(G613,Kontoplan!A:D,2,0)),\"Konto findes ikke!\",VLOOKUP(G613,Kontoplan!A:D,2,0)))","v":"Kiosk salg"}]
[{"$f":"IF(B614>=T!C$4,IF(B614<=T!C$5,Bogføring!G614,\"\"),\"\")","v":""},"2021-10-10",303,null,null,null,12320,830,null,{"$f":"IF(G614=\"\",\"\",IF(ISERROR(VLOOKUP(G614,Kontoplan!A:D,2,0)),\"Konto findes ikke!\",VLOOKUP(G614,Kontoplan!A:D,2,0)))","v":"Kasse"}]
[{"$f":"IF(B615>=T!C$4,IF(B615<=T!C$5,Bogføring!G615,\"\"),\"\")","v":""},"2021-10-10",303,null,null,null,1010,null,830,{"$f":"IF(G615=\"\",\"\",IF(ISERROR(VLOOKUP(G615,Kontoplan!A:D,2,0)),\"Konto findes ikke!\",VLOOKUP(G615,Kontoplan!A:D,2,0)))","v":"Kiosk salg"}]
[{"$f":"IF(B616>=T!C$4,IF(B616<=T!C$5,Bogføring!G616,\"\"),\"\")","v":""},"2021-10-10",304,null,null,null,12320,65,null,{"$f":"IF(G616=\"\",\"\",IF(ISERROR(VLOOKUP(G616,Kontoplan!A:D,2,0)),\"Konto findes ikke!\",VLOOKUP(G616,Kontoplan!A:D,2,0)))","v":"Kasse"}]
[{"$f":"IF(B617>=T!C$4,IF(B617<=T!C$5,Bogføring!G617,\"\"),\"\")","v":""},"2021-10-10",304,null,null,null,1010,null,65,{"$f":"IF(G617=\"\",\"\",IF(ISERROR(VLOOKUP(G617,Kontoplan!A:D,2,0)),\"Konto findes ikke!\",VLOOKUP(G617,Kontoplan!A:D,2,0)))","v":"Kiosk salg"}]
[{"$f":"IF(B618>=T!C$4,IF(B618<=T!C$5,Bogføring!G618,\"\"),\"\")","v":""},"2021-10-10",305,null,null,null,3100,100,null,{"$f":"IF(G618=\"\",\"\",IF(ISERROR(VLOOKUP(G618,Kontoplan!A:D,2,0)),\"Konto findes ikke!\",VLOOKUP(G618,Kontoplan!A:D,2,0)))","v":"Lønomkostninger"}]
[{"$f":"IF(B619>=T!C$4,IF(B619<=T!C$5,Bogføring!G619,\"\"),\"\")","v":""},"2021-10-10",305,null,null,null,12310,null,100,{"$f":"IF(G619=\"\",\"\",IF(ISERROR(VLOOKUP(G619,Kontoplan!A:D,2,0)),\"Konto findes ikke!\",VLOOKUP(G619,Kontoplan!A:D,2,0)))","v":"Bank konto"}]
[{"$f":"IF(B620>=T!C$4,IF(B620<=T!C$5,Bogføring!G620,\"\"),\"\")","v":""},"2021-10-11",306,null,null,null,3110,3225,null,{"$f":"IF(G620=\"\",\"\",IF(ISERROR(VLOOKUP(G620,Kontoplan!A:D,2,0)),\"Konto findes ikke!\",VLOOKUP(G620,Kontoplan!A:D,2,0)))","v":"Lønninger incl ATP -AM"}]
[{"$f":"IF(B621>=T!C$4,IF(B621<=T!C$5,Bogføring!G621,\"\"),\"\")","v":""},"2021-10-11",306,null,null,null,12310,null,3225,{"$f":"IF(G621=\"\",\"\",IF(ISERROR(VLOOKUP(G621,Kontoplan!A:D,2,0)),\"Konto findes ikke!\",VLOOKUP(G621,Kontoplan!A:D,2,0)))","v":"Bank konto"}]
[{"$f":"IF(B622>=T!C$4,IF(B622<=T!C$5,Bogføring!G622,\"\"),\"\")","v":""},"2021-10-12",307,null,null,null,12310,705.95,null,{"$f":"IF(G622=\"\",\"\",IF(ISERROR(VLOOKUP(G622,Kontoplan!A:D,2,0)),\"Konto findes ikke!\",VLOOKUP(G622,Kontoplan!A:D,2,0)))","v":"Bank konto"}]
[{"$f":"IF(B623>=T!C$4,IF(B623<=T!C$5,Bogføring!G623,\"\"),\"\")","v":""},"2021-10-12",307,null,null,null,1000,null,705.95,{"$f":"IF(G623=\"\",\"\",IF(ISERROR(VLOOKUP(G623,Kontoplan!A:D,2,0)),\"Konto findes ikke!\",VLOOKUP(G623,Kontoplan!A:D,2,0)))","v":"Entre"}]
[{"$f":"IF(B624>=T!C$4,IF(B624<=T!C$5,Bogføring!G624,\"\"),\"\")","v":""},"2021-10-14",308,null,null,null,2010,246.46,null,{"$f":"IF(G624=\"\",\"\",IF(ISERROR(VLOOKUP(G624,Kontoplan!A:D,2,0)),\"Konto findes ikke!\",VLOOKUP(G624,Kontoplan!A:D,2,0)))","v":"Danløn"}]
[{"$f":"IF(B625>=T!C$4,IF(B625<=T!C$5,Bogføring!G625,\"\"),\"\")","v":""},"2021-10-14",308,null,null,null,12310,null,246.46,{"$f":"IF(G625=\"\",\"\",IF(ISERROR(VLOOKUP(G625,Kontoplan!A:D,2,0)),\"Konto findes ikke!\",VLOOKUP(G625,Kontoplan!A:D,2,0)))","v":"Bank konto"}]
[{"$f":"IF(B626>=T!C$4,IF(B626<=T!C$5,Bogføring!G626,\"\"),\"\")","v":""},"2021-10-15",309,null,null,null,2065,29150,null,{"$f":"IF(G626=\"\",\"\",IF(ISERROR(VLOOKUP(G626,Kontoplan!A:D,2,0)),\"Konto findes ikke!\",VLOOKUP(G626,Kontoplan!A:D,2,0)))","v":"Udstilling"}]
[{"$f":"IF(B627>=T!C$4,IF(B627<=T!C$5,Bogføring!G627,\"\"),\"\")","v":""},"2021-10-15",309,null,null,null,12310,null,29150,{"$f":"IF(G627=\"\",\"\",IF(ISERROR(VLOOKUP(G627,Kontoplan!A:D,2,0)),\"Konto findes ikke!\",VLOOKUP(G627,Kontoplan!A:D,2,0)))","v":"Bank konto"}]
[{"$f":"IF(B628>=T!C$4,IF(B628<=T!C$5,Bogføring!G628,\"\"),\"\")","v":""},"2021-10-17",310,null,null,null,12310,30000,null,{"$f":"IF(G628=\"\",\"\",IF(ISERROR(VLOOKUP(G628,Kontoplan!A:D,2,0)),\"Konto findes ikke!\",VLOOKUP(G628,Kontoplan!A:D,2,0)))","v":"Bank konto"}]
[{"$f":"IF(B629>=T!C$4,IF(B629<=T!C$5,Bogføring!G629,\"\"),\"\")","v":""},"2021-10-17",310,null,null,null,1030,null,30000,{"$f":"IF(G629=\"\",\"\",IF(ISERROR(VLOOKUP(G629,Kontoplan!A:D,2,0)),\"Konto findes ikke!\",VLOOKUP(G629,Kontoplan!A:D,2,0)))","v":"Tilskud fra KVB"}]
[{"$f":"IF(B630>=T!C$4,IF(B630<=T!C$5,Bogføring!G630,\"\"),\"\")","v":""},"2021-10-18",311,null,null,null,12320,220,null,{"$f":"IF(G630=\"\",\"\",IF(ISERROR(VLOOKUP(G630,Kontoplan!A:D,2,0)),\"Konto findes ikke!\",VLOOKUP(G630,Kontoplan!A:D,2,0)))","v":"Kasse"}]
[{"$f":"IF(B631>=T!C$4,IF(B631<=T!C$5,Bogføring!G631,\"\"),\"\")","v":""},"2021-10-18",311,null,null,null,1010,null,220,{"$f":"IF(G631=\"\",\"\",IF(ISERROR(VLOOKUP(G631,Kontoplan!A:D,2,0)),\"Konto findes ikke!\",VLOOKUP(G631,Kontoplan!A:D,2,0)))","v":"Kiosk salg"}]
[{"$f":"IF(B632>=T!C$4,IF(B632<=T!C$5,Bogføring!G632,\"\"),\"\")","v":""},"2021-10-18",312,null,null,null,12320,100,null,{"$f":"IF(G632=\"\",\"\",IF(ISERROR(VLOOKUP(G632,Kontoplan!A:D,2,0)),\"Konto findes ikke!\",VLOOKUP(G632,Kontoplan!A:D,2,0)))","v":"Kasse"}]
[{"$f":"IF(B633>=T!C$4,IF(B633<=T!C$5,Bogføring!G633,\"\"),\"\")","v":""},"2021-10-18",312,null,null,null,1010,null,100,{"$f":"IF(G633=\"\",\"\",IF(ISERROR(VLOOKUP(G633,Kontoplan!A:D,2,0)),\"Konto findes ikke!\",VLOOKUP(G633,Kontoplan!A:D,2,0)))","v":"Kiosk salg"}]
[{"$f":"IF(B634>=T!C$4,IF(B634<=T!C$5,Bogføring!G634,\"\"),\"\")","v":""},"2021-10-18",313,null,null,null,12320,100,null,{"$f":"IF(G634=\"\",\"\",IF(ISERROR(VLOOKUP(G634,Kontoplan!A:D,2,0)),\"Konto findes ikke!\",VLOOKUP(G634,Kontoplan!A:D,2,0)))","v":"Kasse"}]
[{"$f":"IF(B635>=T!C$4,IF(B635<=T!C$5,Bogføring!G635,\"\"),\"\")","v":""},"2021-10-18",313,null,null,null,1010,null,100,{"$f":"IF(G635=\"\",\"\",IF(ISERROR(VLOOKUP(G635,Kontoplan!A:D,2,0)),\"Konto findes ikke!\",VLOOKUP(G635,Kontoplan!A:D,2,0)))","v":"Kiosk salg"}]
[{"$f":"IF(B636>=T!C$4,IF(B636<=T!C$5,Bogføring!G636,\"\"),\"\")","v":""},"2021-10-18",314,null,null,null,12320,490,null,{"$f":"IF(G636=\"\",\"\",IF(ISERROR(VLOOKUP(G636,Kontoplan!A:D,2,0)),\"Konto findes ikke!\",VLOOKUP(G636,Kontoplan!A:D,2,0)))","v":"Kasse"}]
[{"$f":"IF(B637>=T!C$4,IF(B637<=T!C$5,Bogføring!G637,\"\"),\"\")","v":""},"2021-10-18",314,null,null,null,1010,null,490,{"$f":"IF(G637=\"\",\"\",IF(ISERROR(VLOOKUP(G637,Kontoplan!A:D,2,0)),\"Konto findes ikke!\",VLOOKUP(G637,Kontoplan!A:D,2,0)))","v":"Kiosk salg"}]
[{"$f":"IF(B638>=T!C$4,IF(B638<=T!C$5,Bogføring!G638,\"\"),\"\")","v":""},"2021-10-18",315,null,null,null,2075,200,null,{"$f":"IF(G638=\"\",\"\",IF(ISERROR(VLOOKUP(G638,Kontoplan!A:D,2,0)),\"Konto findes ikke!\",VLOOKUP(G638,Kontoplan!A:D,2,0)))","v":"Gaver"}]
[{"$f":"IF(B639>=T!C$4,IF(B639<=T!C$5,Bogføring!G639,\"\"),\"\")","v":""},"2021-10-18",315,null,null,null,12310,null,200,{"$f":"IF(G639=\"\",\"\",IF(ISERROR(VLOOKUP(G639,Kontoplan!A:D,2,0)),\"Konto findes ikke!\",VLOOKUP(G639,Kontoplan!A:D,2,0)))","v":"Bank konto"}]
[{"$f":"IF(B640>=T!C$4,IF(B640<=T!C$5,Bogføring!G640,\"\"),\"\")","v":""},"2021-10-18",316,null,null,null,2060,375,null,{"$f":"IF(G640=\"\",\"\",IF(ISERROR(VLOOKUP(G640,Kontoplan!A:D,2,0)),\"Konto findes ikke!\",VLOOKUP(G640,Kontoplan!A:D,2,0)))","v":"Internet, mobiltelefon, Forsik."}]
[{"$f":"IF(B641>=T!C$4,IF(B641<=T!C$5,Bogføring!G641,\"\"),\"\")","v":""},"2021-10-18",316,null,null,null,12310,null,375,{"$f":"IF(G641=\"\",\"\",IF(ISERROR(VLOOKUP(G641,Kontoplan!A:D,2,0)),\"Konto findes ikke!\",VLOOKUP(G641,Kontoplan!A:D,2,0)))","v":"Bank konto"}]
[{"$f":"IF(B642>=T!C$4,IF(B642<=T!C$5,Bogføring!G642,\"\"),\"\")","v":""},"2021-10-18",317,null,null,null,2020,12500,null,{"$f":"IF(G642=\"\",\"\",IF(ISERROR(VLOOKUP(G642,Kontoplan!A:D,2,0)),\"Konto findes ikke!\",VLOOKUP(G642,Kontoplan!A:D,2,0)))","v":"Revision"}]
[{"$f":"IF(B643>=T!C$4,IF(B643<=T!C$5,Bogføring!G643,\"\"),\"\")","v":""},"2021-10-18",317,null,null,null,12310,null,12500,{"$f":"IF(G643=\"\",\"\",IF(ISERROR(VLOOKUP(G643,Kontoplan!A:D,2,0)),\"Konto findes ikke!\",VLOOKUP(G643,Kontoplan!A:D,2,0)))","v":"Bank konto"}]
[{"$f":"IF(B644>=T!C$4,IF(B644<=T!C$5,Bogføring!G644,\"\"),\"\")","v":""},"2021-10-19",318,null,null,null,12310,4083.73,null,{"$f":"IF(G644=\"\",\"\",IF(ISERROR(VLOOKUP(G644,Kontoplan!A:D,2,0)),\"Konto findes ikke!\",VLOOKUP(G644,Kontoplan!A:D,2,0)))","v":"Bank konto"}]
[{"$f":"IF(B645>=T!C$4,IF(B645<=T!C$5,Bogføring!G645,\"\"),\"\")","v":""},"2021-10-19",318,null,null,null,1000,null,4083.73,{"$f":"IF(G645=\"\",\"\",IF(ISERROR(VLOOKUP(G645,Kontoplan!A:D,2,0)),\"Konto findes ikke!\",VLOOKUP(G645,Kontoplan!A:D,2,0)))","v":"Entre"}]
[{"$f":"IF(B646>=T!C$4,IF(B646<=T!C$5,Bogføring!G646,\"\"),\"\")","v":""},"2021-10-24",319,null,null,null,12320,276,null,{"$f":"IF(G646=\"\",\"\",IF(ISERROR(VLOOKUP(G646,Kontoplan!A:D,2,0)),\"Konto findes ikke!\",VLOOKUP(G646,Kontoplan!A:D,2,0)))","v":"Kasse"}]
[{"$f":"IF(B647>=T!C$4,IF(B647<=T!C$5,Bogføring!G647,\"\"),\"\")","v":""},"2021-10-24",319,null,null,null,1010,null,276,{"$f":"IF(G647=\"\",\"\",IF(ISERROR(VLOOKUP(G647,Kontoplan!A:D,2,0)),\"Konto findes ikke!\",VLOOKUP(G647,Kontoplan!A:D,2,0)))","v":"Kiosk salg"}]
[{"$f":"IF(B648>=T!C$4,IF(B648<=T!C$5,Bogføring!G648,\"\"),\"\")","v":""},"2021-10-24",320,null,null,null,12320,564,null,{"$f":"IF(G648=\"\",\"\",IF(ISERROR(VLOOKUP(G648,Kontoplan!A:D,2,0)),\"Konto findes ikke!\",VLOOKUP(G648,Kontoplan!A:D,2,0)))","v":"Kasse"}]
[{"$f":"IF(B649>=T!C$4,IF(B649<=T!C$5,Bogføring!G649,\"\"),\"\")","v":""},"2021-10-24",320,null,null,null,1010,null,564,{"$f":"IF(G649=\"\",\"\",IF(ISERROR(VLOOKUP(G649,Kontoplan!A:D,2,0)),\"Konto findes ikke!\",VLOOKUP(G649,Kontoplan!A:D,2,0)))","v":"Kiosk salg"}]
[{"$f":"IF(B650>=T!C$4,IF(B650<=T!C$5,Bogføring!G650,\"\"),\"\")","v":""},"2021-10-24",321,null,null,null,12320,725,null,{"$f":"IF(G650=\"\",\"\",IF(ISERROR(VLOOKUP(G650,Kontoplan!A:D,2,0)),\"Konto findes ikke!\",VLOOKUP(G650,Kontoplan!A:D,2,0)))","v":"Kasse"}]
[{"$f":"IF(B651>=T!C$4,IF(B651<=T!C$5,Bogføring!G651,\"\"),\"\")","v":""},"2021-10-24",321,null,null,null,1010,null,725,{"$f":"IF(G651=\"\",\"\",IF(ISERROR(VLOOKUP(G651,Kontoplan!A:D,2,0)),\"Konto findes ikke!\",VLOOKUP(G651,Kontoplan!A:D,2,0)))","v":"Kiosk salg"}]
[{"$f":"IF(B652>=T!C$4,IF(B652<=T!C$5,Bogføring!G652,\"\"),\"\")","v":""},"2021-10-24",322,null,null,null,12320,70,null,{"$f":"IF(G652=\"\",\"\",IF(ISERROR(VLOOKUP(G652,Kontoplan!A:D,2,0)),\"Konto findes ikke!\",VLOOKUP(G652,Kontoplan!A:D,2,0)))","v":"Kasse"}]
[{"$f":"IF(B653>=T!C$4,IF(B653<=T!C$5,Bogføring!G653,\"\"),\"\")","v":""},"2021-10-24",322,null,null,null,1010,null,70,{"$f":"IF(G653=\"\",\"\",IF(ISERROR(VLOOKUP(G653,Kontoplan!A:D,2,0)),\"Konto findes ikke!\",VLOOKUP(G653,Kontoplan!A:D,2,0)))","v":"Kiosk salg"}]
[{"$f":"IF(B654>=T!C$4,IF(B654<=T!C$5,Bogføring!G654,\"\"),\"\")","v":""},"2021-10-24",323,null,null,null,2200,150,null,{"$f":"IF(G654=\"\",\"\",IF(ISERROR(VLOOKUP(G654,Kontoplan!A:D,2,0)),\"Konto findes ikke!\",VLOOKUP(G654,Kontoplan!A:D,2,0)))","v":"Kontingenter overført til KVB"}]
[{"$f":"IF(B655>=T!C$4,IF(B655<=T!C$5,Bogføring!G655,\"\"),\"\")","v":""},"2021-10-24",323,null,null,null,12310,null,150,{"$f":"IF(G655=\"\",\"\",IF(ISERROR(VLOOKUP(G655,Kontoplan!A:D,2,0)),\"Konto findes ikke!\",VLOOKUP(G655,Kontoplan!A:D,2,0)))","v":"Bank konto"}]
[{"$f":"IF(B656>=T!C$4,IF(B656<=T!C$5,Bogføring!G656,\"\"),\"\")","v":""},"2021-10-25",324,null,null,null,3135,4101.16,null,{"$f":"IF(G656=\"\",\"\",IF(ISERROR(VLOOKUP(G656,Kontoplan!A:D,2,0)),\"Konto findes ikke!\",VLOOKUP(G656,Kontoplan!A:D,2,0)))","v":"Gl. Skat og Gebyr"}]
[{"$f":"IF(B657>=T!C$4,IF(B657<=T!C$5,Bogføring!G657,\"\"),\"\")","v":""},"2021-10-25",324,null,null,null,12310,null,4101.16,{"$f":"IF(G657=\"\",\"\",IF(ISERROR(VLOOKUP(G657,Kontoplan!A:D,2,0)),\"Konto findes ikke!\",VLOOKUP(G657,Kontoplan!A:D,2,0)))","v":"Bank konto"}]
[{"$f":"IF(B658>=T!C$4,IF(B658<=T!C$5,Bogføring!G658,\"\"),\"\")","v":""},"2021-10-26",325,null,null,null,12310,13701.36,null,{"$f":"IF(G658=\"\",\"\",IF(ISERROR(VLOOKUP(G658,Kontoplan!A:D,2,0)),\"Konto findes ikke!\",VLOOKUP(G658,Kontoplan!A:D,2,0)))","v":"Bank konto"}]
[{"$f":"IF(B659>=T!C$4,IF(B659<=T!C$5,Bogføring!G659,\"\"),\"\")","v":""},"2021-10-26",325,null,null,null,1000,null,13701.36,{"$f":"IF(G659=\"\",\"\",IF(ISERROR(VLOOKUP(G659,Kontoplan!A:D,2,0)),\"Konto findes ikke!\",VLOOKUP(G659,Kontoplan!A:D,2,0)))","v":"Entre"}]
[{"$f":"IF(B660>=T!C$4,IF(B660<=T!C$5,Bogføring!G660,\"\"),\"\")","v":""},"2021-10-28",326,null,null,null,3110,6743.45,null,{"$f":"IF(G660=\"\",\"\",IF(ISERROR(VLOOKUP(G660,Kontoplan!A:D,2,0)),\"Konto findes ikke!\",VLOOKUP(G660,Kontoplan!A:D,2,0)))","v":"Lønninger incl ATP -AM"}]
[{"$f":"IF(B661>=T!C$4,IF(B661<=T!C$5,Bogføring!G661,\"\"),\"\")","v":""},"2021-10-28",326,null,null,null,12310,null,6743.45,{"$f":"IF(G661=\"\",\"\",IF(ISERROR(VLOOKUP(G661,Kontoplan!A:D,2,0)),\"Konto findes ikke!\",VLOOKUP(G661,Kontoplan!A:D,2,0)))","v":"Bank konto"}]
[{"$f":"IF(B662>=T!C$4,IF(B662<=T!C$5,Bogføring!G662,\"\"),\"\")","v":""},"2021-10-29",327,null,null,null,2000,2.5,null,{"$f":"IF(G662=\"\",\"\",IF(ISERROR(VLOOKUP(G662,Kontoplan!A:D,2,0)),\"Konto findes ikke!\",VLOOKUP(G662,Kontoplan!A:D,2,0)))","v":"Bankgebyr"}]
[{"$f":"IF(B663>=T!C$4,IF(B663<=T!C$5,Bogføring!G663,\"\"),\"\")","v":""},"2021-10-29",327,null,null,null,12310,null,2.5,{"$f":"IF(G663=\"\",\"\",IF(ISERROR(VLOOKUP(G663,Kontoplan!A:D,2,0)),\"Konto findes ikke!\",VLOOKUP(G663,Kontoplan!A:D,2,0)))","v":"Bank konto"}]
[{"$f":"IF(B664>=T!C$4,IF(B664<=T!C$5,Bogføring!G664,\"\"),\"\")","v":""},"2021-10-31",328,null,null,null,2100,585,null,{"$f":"IF(G664=\"\",\"\",IF(ISERROR(VLOOKUP(G664,Kontoplan!A:D,2,0)),\"Konto findes ikke!\",VLOOKUP(G664,Kontoplan!A:D,2,0)))","v":"Forplejning til møder/Rejser"}]
[{"$f":"IF(B665>=T!C$4,IF(B665<=T!C$5,Bogføring!G665,\"\"),\"\")","v":""},"2021-10-31",328,null,null,null,12310,null,585,{"$f":"IF(G665=\"\",\"\",IF(ISERROR(VLOOKUP(G665,Kontoplan!A:D,2,0)),\"Konto findes ikke!\",VLOOKUP(G665,Kontoplan!A:D,2,0)))","v":"Bank konto"}]
[{"$f":"IF(B666>=T!C$4,IF(B666<=T!C$5,Bogføring!G666,\"\"),\"\")","v":""},"2021-11-01",329,null,null,null,2040,2951.94,null,{"$f":"IF(G666=\"\",\"\",IF(ISERROR(VLOOKUP(G666,Kontoplan!A:D,2,0)),\"Konto findes ikke!\",VLOOKUP(G666,Kontoplan!A:D,2,0)))","v":"El, Vand og Varme"}]
[{"$f":"IF(B667>=T!C$4,IF(B667<=T!C$5,Bogføring!G667,\"\"),\"\")","v":""},"2021-11-01",329,null,null,null,12310,null,2951.94,{"$f":"IF(G667=\"\",\"\",IF(ISERROR(VLOOKUP(G667,Kontoplan!A:D,2,0)),\"Konto findes ikke!\",VLOOKUP(G667,Kontoplan!A:D,2,0)))","v":"Bank konto"}]
[{"$f":"IF(B668>=T!C$4,IF(B668<=T!C$5,Bogføring!G668,\"\"),\"\")","v":""},"2021-11-01",330,null,null,null,2040,1521.3,null,{"$f":"IF(G668=\"\",\"\",IF(ISERROR(VLOOKUP(G668,Kontoplan!A:D,2,0)),\"Konto findes ikke!\",VLOOKUP(G668,Kontoplan!A:D,2,0)))","v":"El, Vand og Varme"}]
[{"$f":"IF(B669>=T!C$4,IF(B669<=T!C$5,Bogføring!G669,\"\"),\"\")","v":""},"2021-11-01",330,null,null,null,12310,null,1521.3,{"$f":"IF(G669=\"\",\"\",IF(ISERROR(VLOOKUP(G669,Kontoplan!A:D,2,0)),\"Konto findes ikke!\",VLOOKUP(G669,Kontoplan!A:D,2,0)))","v":"Bank konto"}]
[{"$f":"IF(B670>=T!C$4,IF(B670<=T!C$5,Bogføring!G670,\"\"),\"\")","v":""},"2021-11-01",331,null,null,null,2060,377.75,null,{"$f":"IF(G670=\"\",\"\",IF(ISERROR(VLOOKUP(G670,Kontoplan!A:D,2,0)),\"Konto findes ikke!\",VLOOKUP(G670,Kontoplan!A:D,2,0)))","v":"Internet, mobiltelefon, Forsik."}]
[{"$f":"IF(B671>=T!C$4,IF(B671<=T!C$5,Bogføring!G671,\"\"),\"\")","v":""},"2021-11-01",331,null,null,null,12310,null,377.75,{"$f":"IF(G671=\"\",\"\",IF(ISERROR(VLOOKUP(G671,Kontoplan!A:D,2,0)),\"Konto findes ikke!\",VLOOKUP(G671,Kontoplan!A:D,2,0)))","v":"Bank konto"}]
[{"$f":"IF(B672>=T!C$4,IF(B672<=T!C$5,Bogføring!G672,\"\"),\"\")","v":""},"2021-11-01",332,null,null,null,2010,59.38,null,{"$f":"IF(G672=\"\",\"\",IF(ISERROR(VLOOKUP(G672,Kontoplan!A:D,2,0)),\"Konto findes ikke!\",VLOOKUP(G672,Kontoplan!A:D,2,0)))","v":"Danløn"}]
[{"$f":"IF(B673>=T!C$4,IF(B673<=T!C$5,Bogføring!G673,\"\"),\"\")","v":""},"2021-11-01",332,null,null,null,12310,null,59.38,{"$f":"IF(G673=\"\",\"\",IF(ISERROR(VLOOKUP(G673,Kontoplan!A:D,2,0)),\"Konto findes ikke!\",VLOOKUP(G673,Kontoplan!A:D,2,0)))","v":"Bank konto"}]
[{"$f":"IF(B674>=T!C$4,IF(B674<=T!C$5,Bogføring!G674,\"\"),\"\")","v":""},"2021-11-01",333,null,null,null,2110,647.65,null,{"$f":"IF(G674=\"\",\"\",IF(ISERROR(VLOOKUP(G674,Kontoplan!A:D,2,0)),\"Konto findes ikke!\",VLOOKUP(G674,Kontoplan!A:D,2,0)))","v":"Kontorhold - Porto - IT"}]
[{"$f":"IF(B675>=T!C$4,IF(B675<=T!C$5,Bogføring!G675,\"\"),\"\")","v":""},"2021-11-01",333,null,null,null,12310,null,647.65,{"$f":"IF(G675=\"\",\"\",IF(ISERROR(VLOOKUP(G675,Kontoplan!A:D,2,0)),\"Konto findes ikke!\",VLOOKUP(G675,Kontoplan!A:D,2,0)))","v":"Bank konto"}]
[{"$f":"IF(B676>=T!C$4,IF(B676<=T!C$5,Bogføring!G676,\"\"),\"\")","v":""},"2021-11-01",334,null,null,null,2025,120.31,null,{"$f":"IF(G676=\"\",\"\",IF(ISERROR(VLOOKUP(G676,Kontoplan!A:D,2,0)),\"Konto findes ikke!\",VLOOKUP(G676,Kontoplan!A:D,2,0)))","v":"Regnskabsservice"}]
[{"$f":"IF(B677>=T!C$4,IF(B677<=T!C$5,Bogføring!G677,\"\"),\"\")","v":""},"2021-11-01",334,null,null,null,12310,null,120.31,{"$f":"IF(G677=\"\",\"\",IF(ISERROR(VLOOKUP(G677,Kontoplan!A:D,2,0)),\"Konto findes ikke!\",VLOOKUP(G677,Kontoplan!A:D,2,0)))","v":"Bank konto"}]
[{"$f":"IF(B678>=T!C$4,IF(B678<=T!C$5,Bogføring!G678,\"\"),\"\")","v":""},"2021-11-04",335,null,null,null,2060,110.8,null,{"$f":"IF(G678=\"\",\"\",IF(ISERROR(VLOOKUP(G678,Kontoplan!A:D,2,0)),\"Konto findes ikke!\",VLOOKUP(G678,Kontoplan!A:D,2,0)))","v":"Internet, mobiltelefon, Forsik."}]
[{"$f":"IF(B679>=T!C$4,IF(B679<=T!C$5,Bogføring!G679,\"\"),\"\")","v":""},"2021-11-04",335,null,null,null,12310,null,110.8,{"$f":"IF(G679=\"\",\"\",IF(ISERROR(VLOOKUP(G679,Kontoplan!A:D,2,0)),\"Konto findes ikke!\",VLOOKUP(G679,Kontoplan!A:D,2,0)))","v":"Bank konto"}]
[{"$f":"IF(B680>=T!C$4,IF(B680<=T!C$5,Bogføring!G680,\"\"),\"\")","v":""},"2021-11-05",336,null,null,null,2060,19,null,{"$f":"IF(G680=\"\",\"\",IF(ISERROR(VLOOKUP(G680,Kontoplan!A:D,2,0)),\"Konto findes ikke!\",VLOOKUP(G680,Kontoplan!A:D,2,0)))","v":"Internet, mobiltelefon, Forsik."}]
[{"$f":"IF(B681>=T!C$4,IF(B681<=T!C$5,Bogføring!G681,\"\"),\"\")","v":""},"2021-11-05",336,null,null,null,12310,null,19,{"$f":"IF(G681=\"\",\"\",IF(ISERROR(VLOOKUP(G681,Kontoplan!A:D,2,0)),\"Konto findes ikke!\",VLOOKUP(G681,Kontoplan!A:D,2,0)))","v":"Bank konto"}]
[{"$f":"IF(B682>=T!C$4,IF(B682<=T!C$5,Bogføring!G682,\"\"),\"\")","v":""},"2021-11-06",337,null,null,null,12310,585,null,{"$f":"IF(G682=\"\",\"\",IF(ISERROR(VLOOKUP(G682,Kontoplan!A:D,2,0)),\"Konto findes ikke!\",VLOOKUP(G682,Kontoplan!A:D,2,0)))","v":"Bank konto"}]
[{"$f":"IF(B683>=T!C$4,IF(B683<=T!C$5,Bogføring!G683,\"\"),\"\")","v":""},"2021-11-06",337,null,null,null,1130,null,585,{"$f":"IF(G683=\"\",\"\",IF(ISERROR(VLOOKUP(G683,Kontoplan!A:D,2,0)),\"Konto findes ikke!\",VLOOKUP(G683,Kontoplan!A:D,2,0)))","v":"Diverse Indtægter"}]
[{"$f":"IF(B684>=T!C$4,IF(B684<=T!C$5,Bogføring!G684,\"\"),\"\")","v":""},"2021-11-08",338,null,null,null,3120,283.95,null,{"$f":"IF(G684=\"\",\"\",IF(ISERROR(VLOOKUP(G684,Kontoplan!A:D,2,0)),\"Konto findes ikke!\",VLOOKUP(G684,Kontoplan!A:D,2,0)))","v":"ATP"}]
[{"$f":"IF(B685>=T!C$4,IF(B685<=T!C$5,Bogføring!G685,\"\"),\"\")","v":""},"2021-11-08",338,null,null,null,12310,null,283.95,{"$f":"IF(G685=\"\",\"\",IF(ISERROR(VLOOKUP(G685,Kontoplan!A:D,2,0)),\"Konto findes ikke!\",VLOOKUP(G685,Kontoplan!A:D,2,0)))","v":"Bank konto"}]
[{"$f":"IF(B686>=T!C$4,IF(B686<=T!C$5,Bogføring!G686,\"\"),\"\")","v":""},"2021-11-09",339,null,null,null,12310,4728,null,{"$f":"IF(G686=\"\",\"\",IF(ISERROR(VLOOKUP(G686,Kontoplan!A:D,2,0)),\"Konto findes ikke!\",VLOOKUP(G686,Kontoplan!A:D,2,0)))","v":"Bank konto"}]
[{"$f":"IF(B687>=T!C$4,IF(B687<=T!C$5,Bogføring!G687,\"\"),\"\")","v":""},"2021-11-09",339,null,null,null,12320,null,4728,{"$f":"IF(G687=\"\",\"\",IF(ISERROR(VLOOKUP(G687,Kontoplan!A:D,2,0)),\"Konto findes ikke!\",VLOOKUP(G687,Kontoplan!A:D,2,0)))","v":"Kasse"}]
[{"$f":"IF(B688>=T!C$4,IF(B688<=T!C$5,Bogføring!G688,\"\"),\"\")","v":""},"2021-11-09",340,null,null,null,12310,3800,null,{"$f":"IF(G688=\"\",\"\",IF(ISERROR(VLOOKUP(G688,Kontoplan!A:D,2,0)),\"Konto findes ikke!\",VLOOKUP(G688,Kontoplan!A:D,2,0)))","v":"Bank konto"}]
[{"$f":"IF(B689>=T!C$4,IF(B689<=T!C$5,Bogføring!G689,\"\"),\"\")","v":""},"2021-11-09",340,null,null,null,1125,null,3800,{"$f":"IF(G689=\"\",\"\",IF(ISERROR(VLOOKUP(G689,Kontoplan!A:D,2,0)),\"Konto findes ikke!\",VLOOKUP(G689,Kontoplan!A:D,2,0)))","v":"Salg af inventar"}]
[{"$f":"IF(B690>=T!C$4,IF(B690<=T!C$5,Bogføring!G690,\"\"),\"\")","v":""},"2021-11-10",341,null,null,null,3110,3225,null,{"$f":"IF(G690=\"\",\"\",IF(ISERROR(VLOOKUP(G690,Kontoplan!A:D,2,0)),\"Konto findes ikke!\",VLOOKUP(G690,Kontoplan!A:D,2,0)))","v":"Lønninger incl ATP -AM"}]
[{"$f":"IF(B691>=T!C$4,IF(B691<=T!C$5,Bogføring!G691,\"\"),\"\")","v":""},"2021-11-10",341,null,null,null,12310,null,3225,{"$f":"IF(G691=\"\",\"\",IF(ISERROR(VLOOKUP(G691,Kontoplan!A:D,2,0)),\"Konto findes ikke!\",VLOOKUP(G691,Kontoplan!A:D,2,0)))","v":"Bank konto"}]
[{"$f":"IF(B692>=T!C$4,IF(B692<=T!C$5,Bogføring!G692,\"\"),\"\")","v":""},"2021-11-11",342,null,null,null,12310,853.71,null,{"$f":"IF(G692=\"\",\"\",IF(ISERROR(VLOOKUP(G692,Kontoplan!A:D,2,0)),\"Konto findes ikke!\",VLOOKUP(G692,Kontoplan!A:D,2,0)))","v":"Bank konto"}]
[{"$f":"IF(B693>=T!C$4,IF(B693<=T!C$5,Bogføring!G693,\"\"),\"\")","v":""},"2021-11-11",342,null,null,null,1110,null,853.71,{"$f":"IF(G693=\"\",\"\",IF(ISERROR(VLOOKUP(G693,Kontoplan!A:D,2,0)),\"Konto findes ikke!\",VLOOKUP(G693,Kontoplan!A:D,2,0)))","v":"A-skat Retur"}]
[{"$f":"IF(B694>=T!C$4,IF(B694<=T!C$5,Bogføring!G694,\"\"),\"\")","v":""},"2021-11-12",343,null,null,null,2030,15187.5,null,{"$f":"IF(G694=\"\",\"\",IF(ISERROR(VLOOKUP(G694,Kontoplan!A:D,2,0)),\"Konto findes ikke!\",VLOOKUP(G694,Kontoplan!A:D,2,0)))","v":"Bygnings vedligehold"}]
[{"$f":"IF(B695>=T!C$4,IF(B695<=T!C$5,Bogføring!G695,\"\"),\"\")","v":""},"2021-11-12",343,null,null,null,12310,null,15187.5,{"$f":"IF(G695=\"\",\"\",IF(ISERROR(VLOOKUP(G695,Kontoplan!A:D,2,0)),\"Konto findes ikke!\",VLOOKUP(G695,Kontoplan!A:D,2,0)))","v":"Bank konto"}]
[{"$f":"IF(B696>=T!C$4,IF(B696<=T!C$5,Bogføring!G696,\"\"),\"\")","v":""},"2021-11-18",344,null,null,null,2030,1577.5,null,{"$f":"IF(G696=\"\",\"\",IF(ISERROR(VLOOKUP(G696,Kontoplan!A:D,2,0)),\"Konto findes ikke!\",VLOOKUP(G696,Kontoplan!A:D,2,0)))","v":"Bygnings vedligehold"}]
[{"$f":"IF(B697>=T!C$4,IF(B697<=T!C$5,Bogføring!G697,\"\"),\"\")","v":""},"2021-11-18",344,null,null,null,12310,null,1577.5,{"$f":"IF(G697=\"\",\"\",IF(ISERROR(VLOOKUP(G697,Kontoplan!A:D,2,0)),\"Konto findes ikke!\",VLOOKUP(G697,Kontoplan!A:D,2,0)))","v":"Bank konto"}]
[{"$f":"IF(B698>=T!C$4,IF(B698<=T!C$5,Bogføring!G698,\"\"),\"\")","v":""},"2021-11-18",345,null,null,null,2015,12500,null,{"$f":"IF(G698=\"\",\"\",IF(ISERROR(VLOOKUP(G698,Kontoplan!A:D,2,0)),\"Konto findes ikke!\",VLOOKUP(G698,Kontoplan!A:D,2,0)))","v":"Advokat"}]
[{"$f":"IF(B699>=T!C$4,IF(B699<=T!C$5,Bogføring!G699,\"\"),\"\")","v":""},"2021-11-18",345,null,null,null,12310,null,12500,{"$f":"IF(G699=\"\",\"\",IF(ISERROR(VLOOKUP(G699,Kontoplan!A:D,2,0)),\"Konto findes ikke!\",VLOOKUP(G699,Kontoplan!A:D,2,0)))","v":"Bank konto"}]
[{"$f":"IF(B700>=T!C$4,IF(B700<=T!C$5,Bogføring!G700,\"\"),\"\")","v":""},"2021-11-19",346,null,null,null,1010,21702.22,null,{"$f":"IF(G700=\"\",\"\",IF(ISERROR(VLOOKUP(G700,Kontoplan!A:D,2,0)),\"Konto findes ikke!\",VLOOKUP(G700,Kontoplan!A:D,2,0)))","v":"Kiosk salg"},"formeget sat ind på kiosk salg"]
[{"$f":"IF(B701>=T!C$4,IF(B701<=T!C$5,Bogføring!G701,\"\"),\"\")","v":""},"2021-11-19",346,null,null,null,1000,null,21702.22,{"$f":"IF(G701=\"\",\"\",IF(ISERROR(VLOOKUP(G701,Kontoplan!A:D,2,0)),\"Konto findes ikke!\",VLOOKUP(G701,Kontoplan!A:D,2,0)))","v":"Entre"},"formeget sat ind på kiosk salg"]
[{"$f":"IF(B702>=T!C$4,IF(B702<=T!C$5,Bogføring!G702,\"\"),\"\")","v":""},"2021-11-26",347,null,null,null,2065,110,null,{"$f":"IF(G702=\"\",\"\",IF(ISERROR(VLOOKUP(G702,Kontoplan!A:D,2,0)),\"Konto findes ikke!\",VLOOKUP(G702,Kontoplan!A:D,2,0)))","v":"Udstilling"}]
[{"$f":"IF(B703>=T!C$4,IF(B703<=T!C$5,Bogføring!G703,\"\"),\"\")","v":""},"2021-11-26",347,null,null,null,12310,null,110,{"$f":"IF(G703=\"\",\"\",IF(ISERROR(VLOOKUP(G703,Kontoplan!A:D,2,0)),\"Konto findes ikke!\",VLOOKUP(G703,Kontoplan!A:D,2,0)))","v":"Bank konto"}]
[{"$f":"IF(B704>=T!C$4,IF(B704<=T!C$5,Bogføring!G704,\"\"),\"\")","v":""},"2021-11-26",348,null,null,null,3110,6743.45,null,{"$f":"IF(G704=\"\",\"\",IF(ISERROR(VLOOKUP(G704,Kontoplan!A:D,2,0)),\"Konto findes ikke!\",VLOOKUP(G704,Kontoplan!A:D,2,0)))","v":"Lønninger incl ATP -AM"}]
[{"$f":"IF(B705>=T!C$4,IF(B705<=T!C$5,Bogføring!G705,\"\"),\"\")","v":""},"2021-11-26",348,null,null,null,12310,null,6743.45,{"$f":"IF(G705=\"\",\"\",IF(ISERROR(VLOOKUP(G705,Kontoplan!A:D,2,0)),\"Konto findes ikke!\",VLOOKUP(G705,Kontoplan!A:D,2,0)))","v":"Bank konto"}]
[{"$f":"IF(B706>=T!C$4,IF(B706<=T!C$5,Bogføring!G706,\"\"),\"\")","v":""},"2021-12-01",349,null,null,null,2000,1.5,null,{"$f":"IF(G706=\"\",\"\",IF(ISERROR(VLOOKUP(G706,Kontoplan!A:D,2,0)),\"Konto findes ikke!\",VLOOKUP(G706,Kontoplan!A:D,2,0)))","v":"Bankgebyr"}]
[{"$f":"IF(B707>=T!C$4,IF(B707<=T!C$5,Bogføring!G707,\"\"),\"\")","v":""},"2021-12-01",349,null,null,null,12310,null,1.5,{"$f":"IF(G707=\"\",\"\",IF(ISERROR(VLOOKUP(G707,Kontoplan!A:D,2,0)),\"Konto findes ikke!\",VLOOKUP(G707,Kontoplan!A:D,2,0)))","v":"Bank konto"}]
[{"$f":"IF(B708>=T!C$4,IF(B708<=T!C$5,Bogføring!G708,\"\"),\"\")","v":""},"2021-12-01",350,null,null,null,2060,377.75,null,{"$f":"IF(G708=\"\",\"\",IF(ISERROR(VLOOKUP(G708,Kontoplan!A:D,2,0)),\"Konto findes ikke!\",VLOOKUP(G708,Kontoplan!A:D,2,0)))","v":"Internet, mobiltelefon, Forsik."}]
[{"$f":"IF(B709>=T!C$4,IF(B709<=T!C$5,Bogføring!G709,\"\"),\"\")","v":""},"2021-12-01",350,null,null,null,12310,null,377.75,{"$f":"IF(G709=\"\",\"\",IF(ISERROR(VLOOKUP(G709,Kontoplan!A:D,2,0)),\"Konto findes ikke!\",VLOOKUP(G709,Kontoplan!A:D,2,0)))","v":"Bank konto"}]
[{"$f":"IF(B710>=T!C$4,IF(B710<=T!C$5,Bogføring!G710,\"\"),\"\")","v":""},"2021-12-02",351,null,null,null,2090,550,null,{"$f":"IF(G710=\"\",\"\",IF(ISERROR(VLOOKUP(G710,Kontoplan!A:D,2,0)),\"Konto findes ikke!\",VLOOKUP(G710,Kontoplan!A:D,2,0)))","v":"Kontingent til andre Foreninger"}]
[{"$f":"IF(B711>=T!C$4,IF(B711<=T!C$5,Bogføring!G711,\"\"),\"\")","v":""},"2021-12-02",351,null,null,null,12310,null,550,{"$f":"IF(G711=\"\",\"\",IF(ISERROR(VLOOKUP(G711,Kontoplan!A:D,2,0)),\"Konto findes ikke!\",VLOOKUP(G711,Kontoplan!A:D,2,0)))","v":"Bank konto"}]
[{"$f":"IF(B712>=T!C$4,IF(B712<=T!C$5,Bogføring!G712,\"\"),\"\")","v":""},"2021-12-02",352,null,null,null,2025,120.31,null,{"$f":"IF(G712=\"\",\"\",IF(ISERROR(VLOOKUP(G712,Kontoplan!A:D,2,0)),\"Konto findes ikke!\",VLOOKUP(G712,Kontoplan!A:D,2,0)))","v":"Regnskabsservice"}]
[{"$f":"IF(B713>=T!C$4,IF(B713<=T!C$5,Bogføring!G713,\"\"),\"\")","v":""},"2021-12-02",352,null,null,null,12310,null,120.31,{"$f":"IF(G713=\"\",\"\",IF(ISERROR(VLOOKUP(G713,Kontoplan!A:D,2,0)),\"Konto findes ikke!\",VLOOKUP(G713,Kontoplan!A:D,2,0)))","v":"Bank konto"}]
[{"$f":"IF(B714>=T!C$4,IF(B714<=T!C$5,Bogføring!G714,\"\"),\"\")","v":""},"2021-12-02",353,null,null,null,2025,120.31,null,{"$f":"IF(G714=\"\",\"\",IF(ISERROR(VLOOKUP(G714,Kontoplan!A:D,2,0)),\"Konto findes ikke!\",VLOOKUP(G714,Kontoplan!A:D,2,0)))","v":"Regnskabsservice"},"Betalt 2 gange"]
[{"$f":"IF(B715>=T!C$4,IF(B715<=T!C$5,Bogføring!G715,\"\"),\"\")","v":""},"2021-12-02",353,null,null,null,12310,null,120.31,{"$f":"IF(G715=\"\",\"\",IF(ISERROR(VLOOKUP(G715,Kontoplan!A:D,2,0)),\"Konto findes ikke!\",VLOOKUP(G715,Kontoplan!A:D,2,0)))","v":"Bank konto"}]
[{"$f":"IF(B716>=T!C$4,IF(B716<=T!C$5,Bogføring!G716,\"\"),\"\")","v":""},"2021-12-06",354,null,null,null,2060,19,null,{"$f":"IF(G716=\"\",\"\",IF(ISERROR(VLOOKUP(G716,Kontoplan!A:D,2,0)),\"Konto findes ikke!\",VLOOKUP(G716,Kontoplan!A:D,2,0)))","v":"Internet, mobiltelefon, Forsik."}]
[{"$f":"IF(B717>=T!C$4,IF(B717<=T!C$5,Bogføring!G717,\"\"),\"\")","v":""},"2021-12-06",354,null,null,null,12310,null,19,{"$f":"IF(G717=\"\",\"\",IF(ISERROR(VLOOKUP(G717,Kontoplan!A:D,2,0)),\"Konto findes ikke!\",VLOOKUP(G717,Kontoplan!A:D,2,0)))","v":"Bank konto"}]
[{"$f":"IF(B718>=T!C$4,IF(B718<=T!C$5,Bogføring!G718,\"\"),\"\")","v":""},"2021-12-09",355,null,null,null,12310,2514.85,null,{"$f":"IF(G718=\"\",\"\",IF(ISERROR(VLOOKUP(G718,Kontoplan!A:D,2,0)),\"Konto findes ikke!\",VLOOKUP(G718,Kontoplan!A:D,2,0)))","v":"Bank konto"}]
[{"$f":"IF(B719>=T!C$4,IF(B719<=T!C$5,Bogføring!G719,\"\"),\"\")","v":""},"2021-12-09",355,null,null,null,1120,null,2514.85,{"$f":"IF(G719=\"\",\"\",IF(ISERROR(VLOOKUP(G719,Kontoplan!A:D,2,0)),\"Konto findes ikke!\",VLOOKUP(G719,Kontoplan!A:D,2,0)))","v":"Lønsum retur"}]
[{"$f":"IF(B720>=T!C$4,IF(B720<=T!C$5,Bogføring!G720,\"\"),\"\")","v":""},"2021-12-10",356,null,null,null,2040,532,null,{"$f":"IF(G720=\"\",\"\",IF(ISERROR(VLOOKUP(G720,Kontoplan!A:D,2,0)),\"Konto findes ikke!\",VLOOKUP(G720,Kontoplan!A:D,2,0)))","v":"El, Vand og Varme"}]
[{"$f":"IF(B721>=T!C$4,IF(B721<=T!C$5,Bogføring!G721,\"\"),\"\")","v":""},"2021-12-10",356,null,null,null,12310,null,532,{"$f":"IF(G721=\"\",\"\",IF(ISERROR(VLOOKUP(G721,Kontoplan!A:D,2,0)),\"Konto findes ikke!\",VLOOKUP(G721,Kontoplan!A:D,2,0)))","v":"Bank konto"}]
[{"$f":"IF(B722>=T!C$4,IF(B722<=T!C$5,Bogføring!G722,\"\"),\"\")","v":""},"2021-12-10",357,null,null,null,3110,3225,null,{"$f":"IF(G722=\"\",\"\",IF(ISERROR(VLOOKUP(G722,Kontoplan!A:D,2,0)),\"Konto findes ikke!\",VLOOKUP(G722,Kontoplan!A:D,2,0)))","v":"Lønninger incl ATP -AM"}]
[{"$f":"IF(B723>=T!C$4,IF(B723<=T!C$5,Bogføring!G723,\"\"),\"\")","v":""},"2021-12-10",357,null,null,null,12310,null,3225,{"$f":"IF(G723=\"\",\"\",IF(ISERROR(VLOOKUP(G723,Kontoplan!A:D,2,0)),\"Konto findes ikke!\",VLOOKUP(G723,Kontoplan!A:D,2,0)))","v":"Bank konto"}]
[{"$f":"IF(B724>=T!C$4,IF(B724<=T!C$5,Bogføring!G724,\"\"),\"\")","v":""},"2021-12-14",358,null,null,null,12310,67,null,{"$f":"IF(G724=\"\",\"\",IF(ISERROR(VLOOKUP(G724,Kontoplan!A:D,2,0)),\"Konto findes ikke!\",VLOOKUP(G724,Kontoplan!A:D,2,0)))","v":"Bank konto"}]
[{"$f":"IF(B725>=T!C$4,IF(B725<=T!C$5,Bogføring!G725,\"\"),\"\")","v":""},"2021-12-14",358,null,null,null,1060,null,67,{"$f":"IF(G725=\"\",\"\",IF(ISERROR(VLOOKUP(G725,Kontoplan!A:D,2,0)),\"Konto findes ikke!\",VLOOKUP(G725,Kontoplan!A:D,2,0)))","v":"Bog salg"}]
[{"$f":"IF(B726>=T!C$4,IF(B726<=T!C$5,Bogføring!G726,\"\"),\"\")","v":""},"2021-12-15",359,null,null,null,2110,22,null,{"$f":"IF(G726=\"\",\"\",IF(ISERROR(VLOOKUP(G726,Kontoplan!A:D,2,0)),\"Konto findes ikke!\",VLOOKUP(G726,Kontoplan!A:D,2,0)))","v":"Kontorhold - Porto - IT"}]
[{"$f":"IF(B727>=T!C$4,IF(B727<=T!C$5,Bogføring!G727,\"\"),\"\")","v":""},"2021-12-15",359,null,null,null,12310,null,22,{"$f":"IF(G727=\"\",\"\",IF(ISERROR(VLOOKUP(G727,Kontoplan!A:D,2,0)),\"Konto findes ikke!\",VLOOKUP(G727,Kontoplan!A:D,2,0)))","v":"Bank konto"}]
[{"$f":"IF(B728>=T!C$4,IF(B728<=T!C$5,Bogføring!G728,\"\"),\"\")","v":""},"2021-12-16",360,null,null,null,12310,120.31,null,{"$f":"IF(G728=\"\",\"\",IF(ISERROR(VLOOKUP(G728,Kontoplan!A:D,2,0)),\"Konto findes ikke!\",VLOOKUP(G728,Kontoplan!A:D,2,0)))","v":"Bank konto"}]
[{"$f":"IF(B729>=T!C$4,IF(B729<=T!C$5,Bogføring!G729,\"\"),\"\")","v":""},"2021-12-16",360,null,null,null,2025,null,120.31,{"$f":"IF(G729=\"\",\"\",IF(ISERROR(VLOOKUP(G729,Kontoplan!A:D,2,0)),\"Konto findes ikke!\",VLOOKUP(G729,Kontoplan!A:D,2,0)))","v":"Regnskabsservice"}]
[{"$f":"IF(B730>=T!C$4,IF(B730<=T!C$5,Bogføring!G730,\"\"),\"\")","v":""},"2021-12-18",361,null,null,null,2190,239.1,null,{"$f":"IF(G730=\"\",\"\",IF(ISERROR(VLOOKUP(G730,Kontoplan!A:D,2,0)),\"Konto findes ikke!\",VLOOKUP(G730,Kontoplan!A:D,2,0)))","v":"Diverse Udgifter"}]
[{"$f":"IF(B731>=T!C$4,IF(B731<=T!C$5,Bogføring!G731,\"\"),\"\")","v":""},"2021-12-18",361,null,null,null,12310,null,239.1,{"$f":"IF(G731=\"\",\"\",IF(ISERROR(VLOOKUP(G731,Kontoplan!A:D,2,0)),\"Konto findes ikke!\",VLOOKUP(G731,Kontoplan!A:D,2,0)))","v":"Bank konto"}]
[{"$f":"IF(B732>=T!C$4,IF(B732<=T!C$5,Bogføring!G732,\"\"),\"\")","v":""},"2021-12-21",362,null,null,null,2030,1110.94,null,{"$f":"IF(G732=\"\",\"\",IF(ISERROR(VLOOKUP(G732,Kontoplan!A:D,2,0)),\"Konto findes ikke!\",VLOOKUP(G732,Kontoplan!A:D,2,0)))","v":"Bygnings vedligehold"}]
[{"$f":"IF(B733>=T!C$4,IF(B733<=T!C$5,Bogføring!G733,\"\"),\"\")","v":""},"2021-12-21",362,null,null,null,12310,null,1110.94,{"$f":"IF(G733=\"\",\"\",IF(ISERROR(VLOOKUP(G733,Kontoplan!A:D,2,0)),\"Konto findes ikke!\",VLOOKUP(G733,Kontoplan!A:D,2,0)))","v":"Bank konto"}]
[{"$f":"IF(B734>=T!C$4,IF(B734<=T!C$5,Bogføring!G734,\"\"),\"\")","v":""},"2021-12-21",363,null,null,null,2030,28.95,null,{"$f":"IF(G734=\"\",\"\",IF(ISERROR(VLOOKUP(G734,Kontoplan!A:D,2,0)),\"Konto findes ikke!\",VLOOKUP(G734,Kontoplan!A:D,2,0)))","v":"Bygnings vedligehold"}]
[{"$f":"IF(B735>=T!C$4,IF(B735<=T!C$5,Bogføring!G735,\"\"),\"\")","v":""},"2021-12-21",363,null,null,null,12310,null,28.95,{"$f":"IF(G735=\"\",\"\",IF(ISERROR(VLOOKUP(G735,Kontoplan!A:D,2,0)),\"Konto findes ikke!\",VLOOKUP(G735,Kontoplan!A:D,2,0)))","v":"Bank konto"}]
[{"$f":"IF(B736>=T!C$4,IF(B736<=T!C$5,Bogføring!G736,\"\"),\"\")","v":""},"2021-12-22",364,null,null,null,12310,800,null,{"$f":"IF(G736=\"\",\"\",IF(ISERROR(VLOOKUP(G736,Kontoplan!A:D,2,0)),\"Konto findes ikke!\",VLOOKUP(G736,Kontoplan!A:D,2,0)))","v":"Bank konto"}]
[{"$f":"IF(B737>=T!C$4,IF(B737<=T!C$5,Bogføring!G737,\"\"),\"\")","v":""},"2021-12-22",364,null,null,null,1110,null,800,{"$f":"IF(G737=\"\",\"\",IF(ISERROR(VLOOKUP(G737,Kontoplan!A:D,2,0)),\"Konto findes ikke!\",VLOOKUP(G737,Kontoplan!A:D,2,0)))","v":"A-skat Retur"}]
[{"$f":"IF(B738>=T!C$4,IF(B738<=T!C$5,Bogføring!G738,\"\"),\"\")","v":""},"2021-12-29",365,null,null,null,3110,7304.45,null,{"$f":"IF(G738=\"\",\"\",IF(ISERROR(VLOOKUP(G738,Kontoplan!A:D,2,0)),\"Konto findes ikke!\",VLOOKUP(G738,Kontoplan!A:D,2,0)))","v":"Lønninger incl ATP -AM"}]
[{"$f":"IF(B739>=T!C$4,IF(B739<=T!C$5,Bogføring!G739,\"\"),\"\")","v":""},"2021-12-29",365,null,null,null,12310,null,7304.45,{"$f":"IF(G739=\"\",\"\",IF(ISERROR(VLOOKUP(G739,Kontoplan!A:D,2,0)),\"Konto findes ikke!\",VLOOKUP(G739,Kontoplan!A:D,2,0)))","v":"Bank konto"}]
[{"$f":"IF(B740>=T!C$4,IF(B740<=T!C$5,Bogføring!G740,\"\"),\"\")","v":""},"2021-12-31",366,null,null,null,2000,106,null,{"$f":"IF(G740=\"\",\"\",IF(ISERROR(VLOOKUP(G740,Kontoplan!A:D,2,0)),\"Konto findes ikke!\",VLOOKUP(G740,Kontoplan!A:D,2,0)))","v":"Bankgebyr"}]
[{"$f":"IF(B741>=T!C$4,IF(B741<=T!C$5,Bogføring!G741,\"\"),\"\")","v":""},"2021-12-31",366,null,null,null,12310,null,106,{"$f":"IF(G741=\"\",\"\",IF(ISERROR(VLOOKUP(G741,Kontoplan!A:D,2,0)),\"Konto findes ikke!\",VLOOKUP(G741,Kontoplan!A:D,2,0)))","v":"Bank konto"}]
[{"$f":"IF(B742>=T!C$4,IF(B742<=T!C$5,Bogføring!G742,\"\"),\"\")","v":12310},"2022-01-01",null,"Åbningsbalance, Overført Saldi",null,null,12310,1158.8399999999999,null,{"$f":"IF(G742=\"\",\"\",IF(ISERROR(VLOOKUP(G742,Kontoplan!A:D,2,0)),\"Konto findes ikke!\",VLOOKUP(G742,Kontoplan!A:D,2,0)))","v":"Bank konto"}]
[{"$f":"IF(B743>=T!C$4,IF(B743<=T!C$5,Bogføring!G743,\"\"),\"\")","v":12320},"2022-01-01",null,"Åbningsbalance, Overført Saldi",null,null,12320,851,null,{"$f":"IF(G743=\"\",\"\",IF(ISERROR(VLOOKUP(G743,Kontoplan!A:D,2,0)),\"Konto findes ikke!\",VLOOKUP(G743,Kontoplan!A:D,2,0)))","v":"Kasse"}]
[{"$f":"IF(B744>=T!C$4,IF(B744<=T!C$5,Bogføring!G744,\"\"),\"\")","v":12330},"2022-01-01",null,"Åbningsbalance, Overført Saldi",null,null,12330,null,2009.84,{"$f":"IF(G744=\"\",\"\",IF(ISERROR(VLOOKUP(G744,Kontoplan!A:D,2,0)),\"Konto findes ikke!\",VLOOKUP(G744,Kontoplan!A:D,2,0)))","v":"Egenkapital"}]
[{"$f":"IF(B745>=T!C$4,IF(B745<=T!C$5,Bogføring!G745,\"\"),\"\")","v":2060},"2022-01-03",1,null,null,null,2060,377.75,null,{"$f":"IF(G745=\"\",\"\",IF(ISERROR(VLOOKUP(G745,Kontoplan!A:D,2,0)),\"Konto findes ikke!\",VLOOKUP(G745,Kontoplan!A:D,2,0)))","v":"Internet, mobiltelefon, Forsik."}]
[{"$f":"IF(B746>=T!C$4,IF(B746<=T!C$5,Bogføring!G746,\"\"),\"\")","v":12310},"2022-01-03",1,null,null,null,12310,null,377.75,{"$f":"IF(G746=\"\",\"\",IF(ISERROR(VLOOKUP(G746,Kontoplan!A:D,2,0)),\"Konto findes ikke!\",VLOOKUP(G746,Kontoplan!A:D,2,0)))","v":"Bank konto"}]
[{"$f":"IF(B747>=T!C$4,IF(B747<=T!C$5,Bogføring!G747,\"\"),\"\")","v":12310},"2022-01-04",2,null,null,null,12310,74021,null,{"$f":"IF(G747=\"\",\"\",IF(ISERROR(VLOOKUP(G747,Kontoplan!A:D,2,0)),\"Konto findes ikke!\",VLOOKUP(G747,Kontoplan!A:D,2,0)))","v":"Bank konto"}]
[{"$f":"IF(B748>=T!C$4,IF(B748<=T!C$5,Bogføring!G748,\"\"),\"\")","v":1020},"2022-01-04",2,null,null,null,1020,null,74021,{"$f":"IF(G748=\"\",\"\",IF(ISERROR(VLOOKUP(G748,Kontoplan!A:D,2,0)),\"Konto findes ikke!\",VLOOKUP(G748,Kontoplan!A:D,2,0)))","v":"Tilskud fra BRK/ drifttilskud"}]
[{"$f":"IF(B749>=T!C$4,IF(B749<=T!C$5,Bogføring!G749,\"\"),\"\")","v":2060},"2022-01-04",3,null,null,null,2060,60,null,{"$f":"IF(G749=\"\",\"\",IF(ISERROR(VLOOKUP(G749,Kontoplan!A:D,2,0)),\"Konto findes ikke!\",VLOOKUP(G749,Kontoplan!A:D,2,0)))","v":"Internet, mobiltelefon, Forsik."}]
[{"$f":"IF(B750>=T!C$4,IF(B750<=T!C$5,Bogføring!G750,\"\"),\"\")","v":12310},"2022-01-04",3,null,null,null,12310,null,60,{"$f":"IF(G750=\"\",\"\",IF(ISERROR(VLOOKUP(G750,Kontoplan!A:D,2,0)),\"Konto findes ikke!\",VLOOKUP(G750,Kontoplan!A:D,2,0)))","v":"Bank konto"}]
[{"$f":"IF(B751>=T!C$4,IF(B751<=T!C$5,Bogføring!G751,\"\"),\"\")","v":2060},"2022-01-04",4,null,null,null,2060,450,null,{"$f":"IF(G751=\"\",\"\",IF(ISERROR(VLOOKUP(G751,Kontoplan!A:D,2,0)),\"Konto findes ikke!\",VLOOKUP(G751,Kontoplan!A:D,2,0)))","v":"Internet, mobiltelefon, Forsik."}]
[{"$f":"IF(B752>=T!C$4,IF(B752<=T!C$5,Bogføring!G752,\"\"),\"\")","v":12310},"2022-01-04",4,null,null,null,12310,null,450,{"$f":"IF(G752=\"\",\"\",IF(ISERROR(VLOOKUP(G752,Kontoplan!A:D,2,0)),\"Konto findes ikke!\",VLOOKUP(G752,Kontoplan!A:D,2,0)))","v":"Bank konto"}]
[{"$f":"IF(B753>=T!C$4,IF(B753<=T!C$5,Bogføring!G753,\"\"),\"\")","v":2060},"2022-01-05",5,null,null,null,2060,19,null,{"$f":"IF(G753=\"\",\"\",IF(ISERROR(VLOOKUP(G753,Kontoplan!A:D,2,0)),\"Konto findes ikke!\",VLOOKUP(G753,Kontoplan!A:D,2,0)))","v":"Internet, mobiltelefon, Forsik."}]
[{"$f":"IF(B754>=T!C$4,IF(B754<=T!C$5,Bogføring!G754,\"\"),\"\")","v":12310},"2022-01-05",5,null,null,null,12310,null,19,{"$f":"IF(G754=\"\",\"\",IF(ISERROR(VLOOKUP(G754,Kontoplan!A:D,2,0)),\"Konto findes ikke!\",VLOOKUP(G754,Kontoplan!A:D,2,0)))","v":"Bank konto"}]
[{"$f":"IF(B755>=T!C$4,IF(B755<=T!C$5,Bogføring!G755,\"\"),\"\")","v":12310},"2022-01-05",6,null,null,null,12310,15000,null,{"$f":"IF(G755=\"\",\"\",IF(ISERROR(VLOOKUP(G755,Kontoplan!A:D,2,0)),\"Konto findes ikke!\",VLOOKUP(G755,Kontoplan!A:D,2,0)))","v":"Bank konto"}]
[{"$f":"IF(B756>=T!C$4,IF(B756<=T!C$5,Bogføring!G756,\"\"),\"\")","v":1025},"2022-01-05",6,null,null,null,1025,null,15000,{"$f":"IF(G756=\"\",\"\",IF(ISERROR(VLOOKUP(G756,Kontoplan!A:D,2,0)),\"Konto findes ikke!\",VLOOKUP(G756,Kontoplan!A:D,2,0)))","v":"Tilskud fra BRK "}]
[{"$f":"IF(B757>=T!C$4,IF(B757<=T!C$5,Bogføring!G757,\"\"),\"\")","v":2025},"2022-01-05",7,null,null,null,2025,120.31,null,{"$f":"IF(G757=\"\",\"\",IF(ISERROR(VLOOKUP(G757,Kontoplan!A:D,2,0)),\"Konto findes ikke!\",VLOOKUP(G757,Kontoplan!A:D,2,0)))","v":"Regnskabsservice"}]
[{"$f":"IF(B758>=T!C$4,IF(B758<=T!C$5,Bogføring!G758,\"\"),\"\")","v":12310},"2022-01-05",7,null,null,null,12310,null,120.31,{"$f":"IF(G758=\"\",\"\",IF(ISERROR(VLOOKUP(G758,Kontoplan!A:D,2,0)),\"Konto findes ikke!\",VLOOKUP(G758,Kontoplan!A:D,2,0)))","v":"Bank konto"}]
[{"$f":"IF(B759>=T!C$4,IF(B759<=T!C$5,Bogføring!G759,\"\"),\"\")","v":3125},"2022-01-05",8,null,null,null,3125,246.46,null,{"$f":"IF(G759=\"\",\"\",IF(ISERROR(VLOOKUP(G759,Kontoplan!A:D,2,0)),\"Konto findes ikke!\",VLOOKUP(G759,Kontoplan!A:D,2,0)))","v":"Samlet betaling"}]
[{"$f":"IF(B760>=T!C$4,IF(B760<=T!C$5,Bogføring!G760,\"\"),\"\")","v":12310},"2022-01-05",8,null,null,null,12310,null,246.46,{"$f":"IF(G760=\"\",\"\",IF(ISERROR(VLOOKUP(G760,Kontoplan!A:D,2,0)),\"Konto findes ikke!\",VLOOKUP(G760,Kontoplan!A:D,2,0)))","v":"Bank konto"}]
[{"$f":"IF(B761>=T!C$4,IF(B761<=T!C$5,Bogføring!G761,\"\"),\"\")","v":2060},"2022-01-05",9,null,null,null,2060,114.96,null,{"$f":"IF(G761=\"\",\"\",IF(ISERROR(VLOOKUP(G761,Kontoplan!A:D,2,0)),\"Konto findes ikke!\",VLOOKUP(G761,Kontoplan!A:D,2,0)))","v":"Internet, mobiltelefon, Forsik."}]
[{"$f":"IF(B762>=T!C$4,IF(B762<=T!C$5,Bogføring!G762,\"\"),\"\")","v":12310},"2022-01-05",9,null,null,null,12310,null,114.96,{"$f":"IF(G762=\"\",\"\",IF(ISERROR(VLOOKUP(G762,Kontoplan!A:D,2,0)),\"Konto findes ikke!\",VLOOKUP(G762,Kontoplan!A:D,2,0)))","v":"Bank konto"}]
[{"$f":"IF(B763>=T!C$4,IF(B763<=T!C$5,Bogføring!G763,\"\"),\"\")","v":2165},"2022-01-10",10,null,null,null,2165,1401.19,null,{"$f":"IF(G763=\"\",\"\",IF(ISERROR(VLOOKUP(G763,Kontoplan!A:D,2,0)),\"Konto findes ikke!\",VLOOKUP(G763,Kontoplan!A:D,2,0)))","v":"G4S tyverialarm"}]
[{"$f":"IF(B764>=T!C$4,IF(B764<=T!C$5,Bogføring!G764,\"\"),\"\")","v":12310},"2022-01-10",10,null,null,null,12310,null,1401.19,{"$f":"IF(G764=\"\",\"\",IF(ISERROR(VLOOKUP(G764,Kontoplan!A:D,2,0)),\"Konto findes ikke!\",VLOOKUP(G764,Kontoplan!A:D,2,0)))","v":"Bank konto"}]
[{"$f":"IF(B765>=T!C$4,IF(B765<=T!C$5,Bogføring!G765,\"\"),\"\")","v":3130},"2022-01-17",11,null,null,null,3130,3664,null,{"$f":"IF(G765=\"\",\"\",IF(ISERROR(VLOOKUP(G765,Kontoplan!A:D,2,0)),\"Konto findes ikke!\",VLOOKUP(G765,Kontoplan!A:D,2,0)))","v":"A-skat & Am-bidrag"}]
[{"$f":"IF(B766>=T!C$4,IF(B766<=T!C$5,Bogføring!G766,\"\"),\"\")","v":12310},"2022-01-17",11,null,null,null,12310,null,3664,{"$f":"IF(G766=\"\",\"\",IF(ISERROR(VLOOKUP(G766,Kontoplan!A:D,2,0)),\"Konto findes ikke!\",VLOOKUP(G766,Kontoplan!A:D,2,0)))","v":"Bank konto"}]
[{"$f":"IF(B767>=T!C$4,IF(B767<=T!C$5,Bogføring!G767,\"\"),\"\")","v":2165},"2022-01-19",12,null,null,null,2165,2384.75,null,{"$f":"IF(G767=\"\",\"\",IF(ISERROR(VLOOKUP(G767,Kontoplan!A:D,2,0)),\"Konto findes ikke!\",VLOOKUP(G767,Kontoplan!A:D,2,0)))","v":"G4S tyverialarm"}]
[{"$f":"IF(B768>=T!C$4,IF(B768<=T!C$5,Bogføring!G768,\"\"),\"\")","v":12310},"2022-01-19",12,null,null,null,12310,null,2384.75,{"$f":"IF(G768=\"\",\"\",IF(ISERROR(VLOOKUP(G768,Kontoplan!A:D,2,0)),\"Konto findes ikke!\",VLOOKUP(G768,Kontoplan!A:D,2,0)))","v":"Bank konto"}]
[{"$f":"IF(B769>=T!C$4,IF(B769<=T!C$5,Bogføring!G769,\"\"),\"\")","v":12320},"2022-01-23",13,null,null,null,12320,1425,null,{"$f":"IF(G769=\"\",\"\",IF(ISERROR(VLOOKUP(G769,Kontoplan!A:D,2,0)),\"Konto findes ikke!\",VLOOKUP(G769,Kontoplan!A:D,2,0)))","v":"Kasse"}]
[{"$f":"IF(B770>=T!C$4,IF(B770<=T!C$5,Bogføring!G770,\"\"),\"\")","v":1000},"2022-01-23",13,null,null,null,1000,null,1425,{"$f":"IF(G770=\"\",\"\",IF(ISERROR(VLOOKUP(G770,Kontoplan!A:D,2,0)),\"Konto findes ikke!\",VLOOKUP(G770,Kontoplan!A:D,2,0)))","v":"Entre"}]
[{"$f":"IF(B771>=T!C$4,IF(B771<=T!C$5,Bogføring!G771,\"\"),\"\")","v":12310},"2022-01-24",14,null,null,null,12310,11493.46,null,{"$f":"IF(G771=\"\",\"\",IF(ISERROR(VLOOKUP(G771,Kontoplan!A:D,2,0)),\"Konto findes ikke!\",VLOOKUP(G771,Kontoplan!A:D,2,0)))","v":"Bank konto"}]
[{"$f":"IF(B772>=T!C$4,IF(B772<=T!C$5,Bogføring!G772,\"\"),\"\")","v":1120},"2022-01-24",14,null,null,null,1120,null,11493.46,{"$f":"IF(G772=\"\",\"\",IF(ISERROR(VLOOKUP(G772,Kontoplan!A:D,2,0)),\"Konto findes ikke!\",VLOOKUP(G772,Kontoplan!A:D,2,0)))","v":"Lønsum retur"}]
[{"$f":"IF(B773>=T!C$4,IF(B773<=T!C$5,Bogføring!G773,\"\"),\"\")","v":3110},"2022-01-28",15,null,null,null,3110,10000,null,{"$f":"IF(G773=\"\",\"\",IF(ISERROR(VLOOKUP(G773,Kontoplan!A:D,2,0)),\"Konto findes ikke!\",VLOOKUP(G773,Kontoplan!A:D,2,0)))","v":"Lønninger incl ATP -AM"}]
[{"$f":"IF(B774>=T!C$4,IF(B774<=T!C$5,Bogføring!G774,\"\"),\"\")","v":12310},"2022-01-28",15,null,null,null,12310,null,4769.45,{"$f":"IF(G774=\"\",\"\",IF(ISERROR(VLOOKUP(G774,Kontoplan!A:D,2,0)),\"Konto findes ikke!\",VLOOKUP(G774,Kontoplan!A:D,2,0)))","v":"Bank konto"}]
[{"$f":"IF(B775>=T!C$4,IF(B775<=T!C$5,Bogføring!G775,\"\"),\"\")","v":12360},"2022-01-28",15,null,null,null,12360,null,4402,{"$f":"IF(G775=\"\",\"\",IF(ISERROR(VLOOKUP(G775,Kontoplan!A:D,2,0)),\"Konto findes ikke!\",VLOOKUP(G775,Kontoplan!A:D,2,0)))","v":"Skyldig A-skat"}]
[{"$f":"IF(B776>=T!C$4,IF(B776<=T!C$5,Bogføring!G776,\"\"),\"\")","v":12361},"2022-01-28",15,null,null,null,12361,null,797,{"$f":"IF(G776=\"\",\"\",IF(ISERROR(VLOOKUP(G776,Kontoplan!A:D,2,0)),\"Konto findes ikke!\",VLOOKUP(G776,Kontoplan!A:D,2,0)))","v":"Skyldig AM "}]
[{"$f":"IF(B777>=T!C$4,IF(B777<=T!C$5,Bogføring!G777,\"\"),\"\")","v":12362},"2022-01-28",15,null,null,null,12362,null,31.55,{"$f":"IF(G777=\"\",\"\",IF(ISERROR(VLOOKUP(G777,Kontoplan!A:D,2,0)),\"Konto findes ikke!\",VLOOKUP(G777,Kontoplan!A:D,2,0)))","v":"Skyldig ATP"}]
[{"$f":"IF(B778>=T!C$4,IF(B778<=T!C$5,Bogføring!G778,\"\"),\"\")","v":3120},"2022-01-28",15,null,null,null,3120,63.1,null,{"$f":"IF(G778=\"\",\"\",IF(ISERROR(VLOOKUP(G778,Kontoplan!A:D,2,0)),\"Konto findes ikke!\",VLOOKUP(G778,Kontoplan!A:D,2,0)))","v":"ATP"}]
[{"$f":"IF(B779>=T!C$4,IF(B779<=T!C$5,Bogføring!G779,\"\"),\"\")","v":12362},"2022-01-28",15,null,null,null,12362,null,63.1,{"$f":"IF(G779=\"\",\"\",IF(ISERROR(VLOOKUP(G779,Kontoplan!A:D,2,0)),\"Konto findes ikke!\",VLOOKUP(G779,Kontoplan!A:D,2,0)))","v":"Skyldig ATP"}]
[{"$f":"IF(B780>=T!C$4,IF(B780<=T!C$5,Bogføring!G780,\"\"),\"\")","v":3110},"2022-01-28",15,null,null,null,3110,200,null,{"$f":"IF(G780=\"\",\"\",IF(ISERROR(VLOOKUP(G780,Kontoplan!A:D,2,0)),\"Konto findes ikke!\",VLOOKUP(G780,Kontoplan!A:D,2,0)))","v":"Lønninger incl ATP -AM"}]
[{"$f":"IF(B781>=T!C$4,IF(B781<=T!C$5,Bogføring!G781,\"\"),\"\")","v":12364},"2022-01-28",15,null,null,null,12364,null,200,{"$f":"IF(G781=\"\",\"\",IF(ISERROR(VLOOKUP(G781,Kontoplan!A:D,2,0)),\"Konto findes ikke!\",VLOOKUP(G781,Kontoplan!A:D,2,0)))","v":"Skyldig feriepenge"}]
[{"$f":"IF(B782>=T!C$4,IF(B782<=T!C$5,Bogføring!G782,\"\"),\"\")","v":2000},"2022-01-31",16,null,null,null,2000,1,null,{"$f":"IF(G782=\"\",\"\",IF(ISERROR(VLOOKUP(G782,Kontoplan!A:D,2,0)),\"Konto findes ikke!\",VLOOKUP(G782,Kontoplan!A:D,2,0)))","v":"Bankgebyr"}]
[{"$f":"IF(B783>=T!C$4,IF(B783<=T!C$5,Bogføring!G783,\"\"),\"\")","v":12310},"2022-01-31",16,null,null,null,12310,null,1,{"$f":"IF(G783=\"\",\"\",IF(ISERROR(VLOOKUP(G783,Kontoplan!A:D,2,0)),\"Konto findes ikke!\",VLOOKUP(G783,Kontoplan!A:D,2,0)))","v":"Bank konto"}]
[{"$f":"IF(B784>=T!C$4,IF(B784<=T!C$5,Bogføring!G784,\"\"),\"\")","v":2110},"2022-02-01",17,null,null,null,2110,377.75,null,{"$f":"IF(G784=\"\",\"\",IF(ISERROR(VLOOKUP(G784,Kontoplan!A:D,2,0)),\"Konto findes ikke!\",VLOOKUP(G784,Kontoplan!A:D,2,0)))","v":"Kontorhold - Porto - IT"}]
[{"$f":"IF(B785>=T!C$4,IF(B785<=T!C$5,Bogføring!G785,\"\"),\"\")","v":12310},"2022-02-01",17,null,null,null,12310,null,377.75,{"$f":"IF(G785=\"\",\"\",IF(ISERROR(VLOOKUP(G785,Kontoplan!A:D,2,0)),\"Konto findes ikke!\",VLOOKUP(G785,Kontoplan!A:D,2,0)))","v":"Bank konto"}]
[{"$f":"IF(B786>=T!C$4,IF(B786<=T!C$5,Bogføring!G786,\"\"),\"\")","v":2040},"2022-02-01",18,null,null,null,2040,11364.64,null,{"$f":"IF(G786=\"\",\"\",IF(ISERROR(VLOOKUP(G786,Kontoplan!A:D,2,0)),\"Konto findes ikke!\",VLOOKUP(G786,Kontoplan!A:D,2,0)))","v":"El, Vand og Varme"}]
[{"$f":"IF(B787>=T!C$4,IF(B787<=T!C$5,Bogføring!G787,\"\"),\"\")","v":12310},"2022-02-01",18,null,null,null,12310,null,11364.64,{"$f":"IF(G787=\"\",\"\",IF(ISERROR(VLOOKUP(G787,Kontoplan!A:D,2,0)),\"Konto findes ikke!\",VLOOKUP(G787,Kontoplan!A:D,2,0)))","v":"Bank konto"}]
[{"$f":"IF(B788>=T!C$4,IF(B788<=T!C$5,Bogføring!G788,\"\"),\"\")","v":2040},"2022-02-01",19,null,null,null,2040,3604.07,null,{"$f":"IF(G788=\"\",\"\",IF(ISERROR(VLOOKUP(G788,Kontoplan!A:D,2,0)),\"Konto findes ikke!\",VLOOKUP(G788,Kontoplan!A:D,2,0)))","v":"El, Vand og Varme"}]
[{"$f":"IF(B789>=T!C$4,IF(B789<=T!C$5,Bogføring!G789,\"\"),\"\")","v":12310},"2022-02-01",19,null,null,null,12310,null,3604.07,{"$f":"IF(G789=\"\",\"\",IF(ISERROR(VLOOKUP(G789,Kontoplan!A:D,2,0)),\"Konto findes ikke!\",VLOOKUP(G789,Kontoplan!A:D,2,0)))","v":"Bank konto"}]
[{"$f":"IF(B790>=T!C$4,IF(B790<=T!C$5,Bogføring!G790,\"\"),\"\")","v":2025},"2022-02-05",20,null,null,null,2025,123.44,null,{"$f":"IF(G790=\"\",\"\",IF(ISERROR(VLOOKUP(G790,Kontoplan!A:D,2,0)),\"Konto findes ikke!\",VLOOKUP(G790,Kontoplan!A:D,2,0)))","v":"Regnskabsservice"}]
[{"$f":"IF(B791>=T!C$4,IF(B791<=T!C$5,Bogføring!G791,\"\"),\"\")","v":12310},"2022-02-05",20,null,null,null,12310,null,123.44,{"$f":"IF(G791=\"\",\"\",IF(ISERROR(VLOOKUP(G791,Kontoplan!A:D,2,0)),\"Konto findes ikke!\",VLOOKUP(G791,Kontoplan!A:D,2,0)))","v":"Bank konto"}]
[{"$f":"IF(B792>=T!C$4,IF(B792<=T!C$5,Bogføring!G792,\"\"),\"\")","v":2060},"2022-02-07",21,null,null,null,2060,19,null,{"$f":"IF(G792=\"\",\"\",IF(ISERROR(VLOOKUP(G792,Kontoplan!A:D,2,0)),\"Konto findes ikke!\",VLOOKUP(G792,Kontoplan!A:D,2,0)))","v":"Internet, mobiltelefon, Forsik."}]
[{"$f":"IF(B793>=T!C$4,IF(B793<=T!C$5,Bogføring!G793,\"\"),\"\")","v":12310},"2022-02-07",21,null,null,null,12310,null,19,{"$f":"IF(G793=\"\",\"\",IF(ISERROR(VLOOKUP(G793,Kontoplan!A:D,2,0)),\"Konto findes ikke!\",VLOOKUP(G793,Kontoplan!A:D,2,0)))","v":"Bank konto"}]
[{"$f":"IF(B794>=T!C$4,IF(B794<=T!C$5,Bogføring!G794,\"\"),\"\")","v":3120},"2022-02-07",22,null,null,null,3120,283.95,null,{"$f":"IF(G794=\"\",\"\",IF(ISERROR(VLOOKUP(G794,Kontoplan!A:D,2,0)),\"Konto findes ikke!\",VLOOKUP(G794,Kontoplan!A:D,2,0)))","v":"ATP"}]
[{"$f":"IF(B795>=T!C$4,IF(B795<=T!C$5,Bogføring!G795,\"\"),\"\")","v":12310},"2022-02-07",22,null,null,null,12310,null,283.95,{"$f":"IF(G795=\"\",\"\",IF(ISERROR(VLOOKUP(G795,Kontoplan!A:D,2,0)),\"Konto findes ikke!\",VLOOKUP(G795,Kontoplan!A:D,2,0)))","v":"Bank konto"}]
[{"$f":"IF(B796>=T!C$4,IF(B796<=T!C$5,Bogføring!G796,\"\"),\"\")","v":3150},"2022-02-07",23,null,null,null,3150,922.26,null,{"$f":"IF(G796=\"\",\"\",IF(ISERROR(VLOOKUP(G796,Kontoplan!A:D,2,0)),\"Konto findes ikke!\",VLOOKUP(G796,Kontoplan!A:D,2,0)))","v":"Indefrosne feriepenge"}]
[{"$f":"IF(B797>=T!C$4,IF(B797<=T!C$5,Bogføring!G797,\"\"),\"\")","v":12310},"2022-02-07",23,null,null,null,12310,null,922.26,{"$f":"IF(G797=\"\",\"\",IF(ISERROR(VLOOKUP(G797,Kontoplan!A:D,2,0)),\"Konto findes ikke!\",VLOOKUP(G797,Kontoplan!A:D,2,0)))","v":"Bank konto"}]
[{"$f":"IF(B798>=T!C$4,IF(B798<=T!C$5,Bogføring!G798,\"\"),\"\")","v":12360},"2022-02-10",24,null,null,null,12360,4402,null,{"$f":"IF(G798=\"\",\"\",IF(ISERROR(VLOOKUP(G798,Kontoplan!A:D,2,0)),\"Konto findes ikke!\",VLOOKUP(G798,Kontoplan!A:D,2,0)))","v":"Skyldig A-skat"}]
[{"$f":"IF(B799>=T!C$4,IF(B799<=T!C$5,Bogføring!G799,\"\"),\"\")","v":12361},"2022-02-10",24,null,null,null,12361,797,null,{"$f":"IF(G799=\"\",\"\",IF(ISERROR(VLOOKUP(G799,Kontoplan!A:D,2,0)),\"Konto findes ikke!\",VLOOKUP(G799,Kontoplan!A:D,2,0)))","v":"Skyldig AM "}]
[{"$f":"IF(B800>=T!C$4,IF(B800<=T!C$5,Bogføring!G800,\"\"),\"\")","v":12310},"2022-02-10",24,null,null,null,12310,null,5199,{"$f":"IF(G800=\"\",\"\",IF(ISERROR(VLOOKUP(G800,Kontoplan!A:D,2,0)),\"Konto findes ikke!\",VLOOKUP(G800,Kontoplan!A:D,2,0)))","v":"Bank konto"}]
[{"$f":"IF(B801>=T!C$4,IF(B801<=T!C$5,Bogføring!G801,\"\"),\"\")","v":12310},"2022-02-14",25,null,null,null,12310,2.9,null,{"$f":"IF(G801=\"\",\"\",IF(ISERROR(VLOOKUP(G801,Kontoplan!A:D,2,0)),\"Konto findes ikke!\",VLOOKUP(G801,Kontoplan!A:D,2,0)))","v":"Bank konto"}]
[{"$f":"IF(B802>=T!C$4,IF(B802<=T!C$5,Bogføring!G802,\"\"),\"\")","v":1110},"2022-02-14",25,null,null,null,1110,null,2.9,{"$f":"IF(G802=\"\",\"\",IF(ISERROR(VLOOKUP(G802,Kontoplan!A:D,2,0)),\"Konto findes ikke!\",VLOOKUP(G802,Kontoplan!A:D,2,0)))","v":"A-skat Retur"}]
[{"$f":"IF(B803>=T!C$4,IF(B803<=T!C$5,Bogføring!G803,\"\"),\"\")","v":2065},"2022-02-17",26,null,null,null,2065,134.75,null,{"$f":"IF(G803=\"\",\"\",IF(ISERROR(VLOOKUP(G803,Kontoplan!A:D,2,0)),\"Konto findes ikke!\",VLOOKUP(G803,Kontoplan!A:D,2,0)))","v":"Udstilling"}]
[{"$f":"IF(B804>=T!C$4,IF(B804<=T!C$5,Bogføring!G804,\"\"),\"\")","v":12310},"2022-02-17",26,null,null,null,12310,null,134.75,{"$f":"IF(G804=\"\",\"\",IF(ISERROR(VLOOKUP(G804,Kontoplan!A:D,2,0)),\"Konto findes ikke!\",VLOOKUP(G804,Kontoplan!A:D,2,0)))","v":"Bank konto"}]
[{"$f":"IF(B805>=T!C$4,IF(B805<=T!C$5,Bogføring!G805,\"\"),\"\")","v":3110},"2022-02-25",27,null,null,null,3110,10000,null,{"$f":"IF(G805=\"\",\"\",IF(ISERROR(VLOOKUP(G805,Kontoplan!A:D,2,0)),\"Konto findes ikke!\",VLOOKUP(G805,Kontoplan!A:D,2,0)))","v":"Lønninger incl ATP -AM"}]
[{"$f":"IF(B806>=T!C$4,IF(B806<=T!C$5,Bogføring!G806,\"\"),\"\")","v":12310},"2022-02-25",27,null,null,null,12310,null,4952.45,{"$f":"IF(G806=\"\",\"\",IF(ISERROR(VLOOKUP(G806,Kontoplan!A:D,2,0)),\"Konto findes ikke!\",VLOOKUP(G806,Kontoplan!A:D,2,0)))","v":"Bank konto"}]
[{"$f":"IF(B807>=T!C$4,IF(B807<=T!C$5,Bogføring!G807,\"\"),\"\")","v":12360},"2022-02-25",27,null,null,null,12360,null,4219,{"$f":"IF(G807=\"\",\"\",IF(ISERROR(VLOOKUP(G807,Kontoplan!A:D,2,0)),\"Konto findes ikke!\",VLOOKUP(G807,Kontoplan!A:D,2,0)))","v":"Skyldig A-skat"}]
[{"$f":"IF(B808>=T!C$4,IF(B808<=T!C$5,Bogføring!G808,\"\"),\"\")","v":12361},"2022-02-25",27,null,null,null,12361,null,797,{"$f":"IF(G808=\"\",\"\",IF(ISERROR(VLOOKUP(G808,Kontoplan!A:D,2,0)),\"Konto findes ikke!\",VLOOKUP(G808,Kontoplan!A:D,2,0)))","v":"Skyldig AM "}]
[{"$f":"IF(B809>=T!C$4,IF(B809<=T!C$5,Bogføring!G809,\"\"),\"\")","v":12362},"2022-02-25",27,null,null,null,12362,null,31.55,{"$f":"IF(G809=\"\",\"\",IF(ISERROR(VLOOKUP(G809,Kontoplan!A:D,2,0)),\"Konto findes ikke!\",VLOOKUP(G809,Kontoplan!A:D,2,0)))","v":"Skyldig ATP"}]
[{"$f":"IF(B810>=T!C$4,IF(B810<=T!C$5,Bogføring!G810,\"\"),\"\")","v":3120},"2022-02-25",27,null,null,null,3120,63.1,null,{"$f":"IF(G810=\"\",\"\",IF(ISERROR(VLOOKUP(G810,Kontoplan!A:D,2,0)),\"Konto findes ikke!\",VLOOKUP(G810,Kontoplan!A:D,2,0)))","v":"ATP"}]
[{"$f":"IF(B811>=T!C$4,IF(B811<=T!C$5,Bogføring!G811,\"\"),\"\")","v":12362},"2022-02-25",27,null,null,null,12362,null,63.1,{"$f":"IF(G811=\"\",\"\",IF(ISERROR(VLOOKUP(G811,Kontoplan!A:D,2,0)),\"Konto findes ikke!\",VLOOKUP(G811,Kontoplan!A:D,2,0)))","v":"Skyldig ATP"}]
[{"$f":"IF(B812>=T!C$4,IF(B812<=T!C$5,Bogføring!G812,\"\"),\"\")","v":3110},"2022-02-25",27,null,null,null,3110,200,null,{"$f":"IF(G812=\"\",\"\",IF(ISERROR(VLOOKUP(G812,Kontoplan!A:D,2,0)),\"Konto findes ikke!\",VLOOKUP(G812,Kontoplan!A:D,2,0)))","v":"Lønninger incl ATP -AM"}]
[{"$f":"IF(B813>=T!C$4,IF(B813<=T!C$5,Bogføring!G813,\"\"),\"\")","v":12364},"2022-02-25",27,null,null,null,12364,null,200,{"$f":"IF(G813=\"\",\"\",IF(ISERROR(VLOOKUP(G813,Kontoplan!A:D,2,0)),\"Konto findes ikke!\",VLOOKUP(G813,Kontoplan!A:D,2,0)))","v":"Skyldig feriepenge"}]
[{"$f":"IF(B814>=T!C$4,IF(B814<=T!C$5,Bogføring!G814,\"\"),\"\")","v":12310},"2022-02-28",28,null,null,null,12310,3700,null,{"$f":"IF(G814=\"\",\"\",IF(ISERROR(VLOOKUP(G814,Kontoplan!A:D,2,0)),\"Konto findes ikke!\",VLOOKUP(G814,Kontoplan!A:D,2,0)))","v":"Bank konto"}]
[{"$f":"IF(B815>=T!C$4,IF(B815<=T!C$5,Bogføring!G815,\"\"),\"\")","v":1000},"2022-02-28",28,null,null,null,1000,null,3700,{"$f":"IF(G815=\"\",\"\",IF(ISERROR(VLOOKUP(G815,Kontoplan!A:D,2,0)),\"Konto findes ikke!\",VLOOKUP(G815,Kontoplan!A:D,2,0)))","v":"Entre"}]
[{"$f":"IF(B816>=T!C$4,IF(B816<=T!C$5,Bogføring!G816,\"\"),\"\")","v":2000},"2022-02-28",29,null,null,null,2000,1,null,{"$f":"IF(G816=\"\",\"\",IF(ISERROR(VLOOKUP(G816,Kontoplan!A:D,2,0)),\"Konto findes ikke!\",VLOOKUP(G816,Kontoplan!A:D,2,0)))","v":"Bankgebyr"}]
[{"$f":"IF(B817>=T!C$4,IF(B817<=T!C$5,Bogføring!G817,\"\"),\"\")","v":12310},"2022-02-28",29,null,null,null,12310,null,1,{"$f":"IF(G817=\"\",\"\",IF(ISERROR(VLOOKUP(G817,Kontoplan!A:D,2,0)),\"Konto findes ikke!\",VLOOKUP(G817,Kontoplan!A:D,2,0)))","v":"Bank konto"}]
[{"$f":"IF(B818>=T!C$4,IF(B818<=T!C$5,Bogføring!G818,\"\"),\"\")","v":2060},"2022-03-01",30,null,null,null,2060,377.75,null,{"$f":"IF(G818=\"\",\"\",IF(ISERROR(VLOOKUP(G818,Kontoplan!A:D,2,0)),\"Konto findes ikke!\",VLOOKUP(G818,Kontoplan!A:D,2,0)))","v":"Internet, mobiltelefon, Forsik."}]
[{"$f":"IF(B819>=T!C$4,IF(B819<=T!C$5,Bogføring!G819,\"\"),\"\")","v":12310},"2022-03-01",30,null,null,null,12310,null,377.75,{"$f":"IF(G819=\"\",\"\",IF(ISERROR(VLOOKUP(G819,Kontoplan!A:D,2,0)),\"Konto findes ikke!\",VLOOKUP(G819,Kontoplan!A:D,2,0)))","v":"Bank konto"}]
[{"$f":"IF(B820>=T!C$4,IF(B820<=T!C$5,Bogføring!G820,\"\"),\"\")","v":2130},"2022-03-04",31,null,null,null,2130,2318.75,null,{"$f":"IF(G820=\"\",\"\",IF(ISERROR(VLOOKUP(G820,Kontoplan!A:D,2,0)),\"Konto findes ikke!\",VLOOKUP(G820,Kontoplan!A:D,2,0)))","v":"Annoncer"}]
[{"$f":"IF(B821>=T!C$4,IF(B821<=T!C$5,Bogføring!G821,\"\"),\"\")","v":12310},"2022-03-04",31,null,null,null,12310,null,2318.75,{"$f":"IF(G821=\"\",\"\",IF(ISERROR(VLOOKUP(G821,Kontoplan!A:D,2,0)),\"Konto findes ikke!\",VLOOKUP(G821,Kontoplan!A:D,2,0)))","v":"Bank konto"}]
[{"$f":"IF(B822>=T!C$4,IF(B822<=T!C$5,Bogføring!G822,\"\"),\"\")","v":2195},"2022-03-06",32,null,null,null,2195,2500,null,{"$f":"IF(G822=\"\",\"\",IF(ISERROR(VLOOKUP(G822,Kontoplan!A:D,2,0)),\"Konto findes ikke!\",VLOOKUP(G822,Kontoplan!A:D,2,0)))","v":"Arkitekt"}]
[{"$f":"IF(B823>=T!C$4,IF(B823<=T!C$5,Bogføring!G823,\"\"),\"\")","v":12310},"2022-03-06",32,null,null,null,12310,null,2500,{"$f":"IF(G823=\"\",\"\",IF(ISERROR(VLOOKUP(G823,Kontoplan!A:D,2,0)),\"Konto findes ikke!\",VLOOKUP(G823,Kontoplan!A:D,2,0)))","v":"Bank konto"}]
[{"$f":"IF(B824>=T!C$4,IF(B824<=T!C$5,Bogføring!G824,\"\"),\"\")","v":2060},"2022-03-07",33,null,null,null,2060,19,null,{"$f":"IF(G824=\"\",\"\",IF(ISERROR(VLOOKUP(G824,Kontoplan!A:D,2,0)),\"Konto findes ikke!\",VLOOKUP(G824,Kontoplan!A:D,2,0)))","v":"Internet, mobiltelefon, Forsik."}]
[{"$f":"IF(B825>=T!C$4,IF(B825<=T!C$5,Bogføring!G825,\"\"),\"\")","v":12310},"2022-03-07",33,null,null,null,12310,null,19,{"$f":"IF(G825=\"\",\"\",IF(ISERROR(VLOOKUP(G825,Kontoplan!A:D,2,0)),\"Konto findes ikke!\",VLOOKUP(G825,Kontoplan!A:D,2,0)))","v":"Bank konto"}]
[{"$f":"IF(B826>=T!C$4,IF(B826<=T!C$5,Bogføring!G826,\"\"),\"\")","v":2040},"2022-03-10",34,null,null,null,2040,540.72,null,{"$f":"IF(G826=\"\",\"\",IF(ISERROR(VLOOKUP(G826,Kontoplan!A:D,2,0)),\"Konto findes ikke!\",VLOOKUP(G826,Kontoplan!A:D,2,0)))","v":"El, Vand og Varme"}]
[{"$f":"IF(B827>=T!C$4,IF(B827<=T!C$5,Bogføring!G827,\"\"),\"\")","v":12310},"2022-03-10",34,null,null,null,12310,null,540.72,{"$f":"IF(G827=\"\",\"\",IF(ISERROR(VLOOKUP(G827,Kontoplan!A:D,2,0)),\"Konto findes ikke!\",VLOOKUP(G827,Kontoplan!A:D,2,0)))","v":"Bank konto"}]
[{"$f":"IF(B828>=T!C$4,IF(B828<=T!C$5,Bogføring!G828,\"\"),\"\")","v":12360},"2022-03-10",35,null,null,null,12360,4219,null,{"$f":"IF(G828=\"\",\"\",IF(ISERROR(VLOOKUP(G828,Kontoplan!A:D,2,0)),\"Konto findes ikke!\",VLOOKUP(G828,Kontoplan!A:D,2,0)))","v":"Skyldig A-skat"}]
[{"$f":"IF(B829>=T!C$4,IF(B829<=T!C$5,Bogføring!G829,\"\"),\"\")","v":12361},"2022-03-10",35,null,null,null,12361,797,null,{"$f":"IF(G829=\"\",\"\",IF(ISERROR(VLOOKUP(G829,Kontoplan!A:D,2,0)),\"Konto findes ikke!\",VLOOKUP(G829,Kontoplan!A:D,2,0)))","v":"Skyldig AM "}]
[{"$f":"IF(B830>=T!C$4,IF(B830<=T!C$5,Bogføring!G830,\"\"),\"\")","v":12310},"2022-03-10",35,null,null,null,12310,null,5016,{"$f":"IF(G830=\"\",\"\",IF(ISERROR(VLOOKUP(G830,Kontoplan!A:D,2,0)),\"Konto findes ikke!\",VLOOKUP(G830,Kontoplan!A:D,2,0)))","v":"Bank konto"}]
[{"$f":"IF(B831>=T!C$4,IF(B831<=T!C$5,Bogføring!G831,\"\"),\"\")","v":2110},"2022-03-11",36,null,null,null,2110,647.65,null,{"$f":"IF(G831=\"\",\"\",IF(ISERROR(VLOOKUP(G831,Kontoplan!A:D,2,0)),\"Konto findes ikke!\",VLOOKUP(G831,Kontoplan!A:D,2,0)))","v":"Kontorhold - Porto - IT"}]
[{"$f":"IF(B832>=T!C$4,IF(B832<=T!C$5,Bogføring!G832,\"\"),\"\")","v":12310},"2022-03-11",36,null,null,null,12310,null,647.65,{"$f":"IF(G832=\"\",\"\",IF(ISERROR(VLOOKUP(G832,Kontoplan!A:D,2,0)),\"Konto findes ikke!\",VLOOKUP(G832,Kontoplan!A:D,2,0)))","v":"Bank konto"}]
[{"$f":"IF(B833>=T!C$4,IF(B833<=T!C$5,Bogføring!G833,\"\"),\"\")","v":2025},"2022-03-11",37,null,null,null,2025,123.44,null,{"$f":"IF(G833=\"\",\"\",IF(ISERROR(VLOOKUP(G833,Kontoplan!A:D,2,0)),\"Konto findes ikke!\",VLOOKUP(G833,Kontoplan!A:D,2,0)))","v":"Regnskabsservice"}]
[{"$f":"IF(B834>=T!C$4,IF(B834<=T!C$5,Bogføring!G834,\"\"),\"\")","v":12310},"2022-03-11",37,null,null,null,12310,null,123.44,{"$f":"IF(G834=\"\",\"\",IF(ISERROR(VLOOKUP(G834,Kontoplan!A:D,2,0)),\"Konto findes ikke!\",VLOOKUP(G834,Kontoplan!A:D,2,0)))","v":"Bank konto"}]
[{"$f":"IF(B835>=T!C$4,IF(B835<=T!C$5,Bogføring!G835,\"\"),\"\")","v":2110},"2022-03-21",38,null,null,null,2110,108,null,{"$f":"IF(G835=\"\",\"\",IF(ISERROR(VLOOKUP(G835,Kontoplan!A:D,2,0)),\"Konto findes ikke!\",VLOOKUP(G835,Kontoplan!A:D,2,0)))","v":"Kontorhold - Porto - IT"}]
[{"$f":"IF(B836>=T!C$4,IF(B836<=T!C$5,Bogføring!G836,\"\"),\"\")","v":12310},"2022-03-21",38,null,null,null,12310,null,108,{"$f":"IF(G836=\"\",\"\",IF(ISERROR(VLOOKUP(G836,Kontoplan!A:D,2,0)),\"Konto findes ikke!\",VLOOKUP(G836,Kontoplan!A:D,2,0)))","v":"Bank konto"}]
[{"$f":"IF(B837>=T!C$4,IF(B837<=T!C$5,Bogføring!G837,\"\"),\"\")","v":2065},"2022-03-21",39,null,null,null,2065,770.63,null,{"$f":"IF(G837=\"\",\"\",IF(ISERROR(VLOOKUP(G837,Kontoplan!A:D,2,0)),\"Konto findes ikke!\",VLOOKUP(G837,Kontoplan!A:D,2,0)))","v":"Udstilling"}]
[{"$f":"IF(B838>=T!C$4,IF(B838<=T!C$5,Bogføring!G838,\"\"),\"\")","v":12310},"2022-03-21",39,null,null,null,12310,null,770.63,{"$f":"IF(G838=\"\",\"\",IF(ISERROR(VLOOKUP(G838,Kontoplan!A:D,2,0)),\"Konto findes ikke!\",VLOOKUP(G838,Kontoplan!A:D,2,0)))","v":"Bank konto"}]
[{"$f":"IF(B839>=T!C$4,IF(B839<=T!C$5,Bogføring!G839,\"\"),\"\")","v":3110},"2022-03-30",40,null,null,null,3110,10000,null,{"$f":"IF(G839=\"\",\"\",IF(ISERROR(VLOOKUP(G839,Kontoplan!A:D,2,0)),\"Konto findes ikke!\",VLOOKUP(G839,Kontoplan!A:D,2,0)))","v":"Lønninger incl ATP -AM"}]
[{"$f":"IF(B840>=T!C$4,IF(B840<=T!C$5,Bogføring!G840,\"\"),\"\")","v":12310},"2022-03-30",40,null,null,null,12310,null,4952.45,{"$f":"IF(G840=\"\",\"\",IF(ISERROR(VLOOKUP(G840,Kontoplan!A:D,2,0)),\"Konto findes ikke!\",VLOOKUP(G840,Kontoplan!A:D,2,0)))","v":"Bank konto"}]
[{"$f":"IF(B841>=T!C$4,IF(B841<=T!C$5,Bogføring!G841,\"\"),\"\")","v":12360},"2022-03-30",40,null,null,null,12360,null,4219,{"$f":"IF(G841=\"\",\"\",IF(ISERROR(VLOOKUP(G841,Kontoplan!A:D,2,0)),\"Konto findes ikke!\",VLOOKUP(G841,Kontoplan!A:D,2,0)))","v":"Skyldig A-skat"}]
[{"$f":"IF(B842>=T!C$4,IF(B842<=T!C$5,Bogføring!G842,\"\"),\"\")","v":12361},"2022-03-30",40,null,null,null,12361,null,797,{"$f":"IF(G842=\"\",\"\",IF(ISERROR(VLOOKUP(G842,Kontoplan!A:D,2,0)),\"Konto findes ikke!\",VLOOKUP(G842,Kontoplan!A:D,2,0)))","v":"Skyldig AM "}]
[{"$f":"IF(B843>=T!C$4,IF(B843<=T!C$5,Bogføring!G843,\"\"),\"\")","v":12362},"2022-03-30",40,null,null,null,12362,null,31.55,{"$f":"IF(G843=\"\",\"\",IF(ISERROR(VLOOKUP(G843,Kontoplan!A:D,2,0)),\"Konto findes ikke!\",VLOOKUP(G843,Kontoplan!A:D,2,0)))","v":"Skyldig ATP"}]
[{"$f":"IF(B844>=T!C$4,IF(B844<=T!C$5,Bogføring!G844,\"\"),\"\")","v":3120},"2022-03-30",40,null,null,null,3120,63.1,null,{"$f":"IF(G844=\"\",\"\",IF(ISERROR(VLOOKUP(G844,Kontoplan!A:D,2,0)),\"Konto findes ikke!\",VLOOKUP(G844,Kontoplan!A:D,2,0)))","v":"ATP"}]
[{"$f":"IF(B845>=T!C$4,IF(B845<=T!C$5,Bogføring!G845,\"\"),\"\")","v":12362},"2022-03-30",40,null,null,null,12362,null,63.1,{"$f":"IF(G845=\"\",\"\",IF(ISERROR(VLOOKUP(G845,Kontoplan!A:D,2,0)),\"Konto findes ikke!\",VLOOKUP(G845,Kontoplan!A:D,2,0)))","v":"Skyldig ATP"}]
[{"$f":"IF(B846>=T!C$4,IF(B846<=T!C$5,Bogføring!G846,\"\"),\"\")","v":3110},"2022-03-30",40,null,null,null,3110,200,null,{"$f":"IF(G846=\"\",\"\",IF(ISERROR(VLOOKUP(G846,Kontoplan!A:D,2,0)),\"Konto findes ikke!\",VLOOKUP(G846,Kontoplan!A:D,2,0)))","v":"Lønninger incl ATP -AM"}]
[{"$f":"IF(B847>=T!C$4,IF(B847<=T!C$5,Bogføring!G847,\"\"),\"\")","v":12364},"2022-03-30",40,null,null,null,12364,null,200,{"$f":"IF(G847=\"\",\"\",IF(ISERROR(VLOOKUP(G847,Kontoplan!A:D,2,0)),\"Konto findes ikke!\",VLOOKUP(G847,Kontoplan!A:D,2,0)))","v":"Skyldig feriepenge"}]
[{"$f":"IF(B848>=T!C$4,IF(B848<=T!C$5,Bogføring!G848,\"\"),\"\")","v":2000},"2022-04-01",41,null,null,null,2000,106,null,{"$f":"IF(G848=\"\",\"\",IF(ISERROR(VLOOKUP(G848,Kontoplan!A:D,2,0)),\"Konto findes ikke!\",VLOOKUP(G848,Kontoplan!A:D,2,0)))","v":"Bankgebyr"}]
[{"$f":"IF(B849>=T!C$4,IF(B849<=T!C$5,Bogføring!G849,\"\"),\"\")","v":12310},"2022-04-01",41,null,null,null,12310,null,106,{"$f":"IF(G849=\"\",\"\",IF(ISERROR(VLOOKUP(G849,Kontoplan!A:D,2,0)),\"Konto findes ikke!\",VLOOKUP(G849,Kontoplan!A:D,2,0)))","v":"Bank konto"}]
[{"$f":"IF(B850>=T!C$4,IF(B850<=T!C$5,Bogføring!G850,\"\"),\"\")","v":2060},"2022-04-01",42,null,null,null,2060,377.75,null,{"$f":"IF(G850=\"\",\"\",IF(ISERROR(VLOOKUP(G850,Kontoplan!A:D,2,0)),\"Konto findes ikke!\",VLOOKUP(G850,Kontoplan!A:D,2,0)))","v":"Internet, mobiltelefon, Forsik."}]
[{"$f":"IF(B851>=T!C$4,IF(B851<=T!C$5,Bogføring!G851,\"\"),\"\")","v":12310},"2022-04-01",42,null,null,null,12310,null,377.75,{"$f":"IF(G851=\"\",\"\",IF(ISERROR(VLOOKUP(G851,Kontoplan!A:D,2,0)),\"Konto findes ikke!\",VLOOKUP(G851,Kontoplan!A:D,2,0)))","v":"Bank konto"}]
[{"$f":"IF(B852>=T!C$4,IF(B852<=T!C$5,Bogføring!G852,\"\"),\"\")","v":2090},"2022-04-02",43,null,null,null,2090,100,null,{"$f":"IF(G852=\"\",\"\",IF(ISERROR(VLOOKUP(G852,Kontoplan!A:D,2,0)),\"Konto findes ikke!\",VLOOKUP(G852,Kontoplan!A:D,2,0)))","v":"Kontingent til andre Foreninger"}]
[{"$f":"IF(B853>=T!C$4,IF(B853<=T!C$5,Bogføring!G853,\"\"),\"\")","v":12310},"2022-04-02",43,null,null,null,12310,null,100,{"$f":"IF(G853=\"\",\"\",IF(ISERROR(VLOOKUP(G853,Kontoplan!A:D,2,0)),\"Konto findes ikke!\",VLOOKUP(G853,Kontoplan!A:D,2,0)))","v":"Bank konto"}]
[{"$f":"IF(B854>=T!C$4,IF(B854<=T!C$5,Bogføring!G854,\"\"),\"\")","v":2060},"2022-04-05",44,null,null,null,2060,19,null,{"$f":"IF(G854=\"\",\"\",IF(ISERROR(VLOOKUP(G854,Kontoplan!A:D,2,0)),\"Konto findes ikke!\",VLOOKUP(G854,Kontoplan!A:D,2,0)))","v":"Internet, mobiltelefon, Forsik."}]
[{"$f":"IF(B855>=T!C$4,IF(B855<=T!C$5,Bogføring!G855,\"\"),\"\")","v":12310},"2022-04-05",44,null,null,null,12310,null,19,{"$f":"IF(G855=\"\",\"\",IF(ISERROR(VLOOKUP(G855,Kontoplan!A:D,2,0)),\"Konto findes ikke!\",VLOOKUP(G855,Kontoplan!A:D,2,0)))","v":"Bank konto"}]
[{"$f":"IF(B856>=T!C$4,IF(B856<=T!C$5,Bogføring!G856,\"\"),\"\")","v":2166},"2022-04-05",45,null,null,null,2166,7598.9,null,{"$f":"IF(G856=\"\",\"\",IF(ISERROR(VLOOKUP(G856,Kontoplan!A:D,2,0)),\"Konto findes ikke!\",VLOOKUP(G856,Kontoplan!A:D,2,0)))","v":"Forsikringer"}]
[{"$f":"IF(B857>=T!C$4,IF(B857<=T!C$5,Bogføring!G857,\"\"),\"\")","v":12310},"2022-04-05",45,null,null,null,12310,null,7598.9,{"$f":"IF(G857=\"\",\"\",IF(ISERROR(VLOOKUP(G857,Kontoplan!A:D,2,0)),\"Konto findes ikke!\",VLOOKUP(G857,Kontoplan!A:D,2,0)))","v":"Bank konto"}]
[{"$f":"IF(B858>=T!C$4,IF(B858<=T!C$5,Bogføring!G858,\"\"),\"\")","v":2065},"2022-04-07",46,null,null,null,2065,50,null,{"$f":"IF(G858=\"\",\"\",IF(ISERROR(VLOOKUP(G858,Kontoplan!A:D,2,0)),\"Konto findes ikke!\",VLOOKUP(G858,Kontoplan!A:D,2,0)))","v":"Udstilling"}]
[{"$f":"IF(B859>=T!C$4,IF(B859<=T!C$5,Bogføring!G859,\"\"),\"\")","v":12310},"2022-04-07",46,null,null,null,12310,null,50,{"$f":"IF(G859=\"\",\"\",IF(ISERROR(VLOOKUP(G859,Kontoplan!A:D,2,0)),\"Konto findes ikke!\",VLOOKUP(G859,Kontoplan!A:D,2,0)))","v":"Bank konto"}]
[{"$f":"IF(B860>=T!C$4,IF(B860<=T!C$5,Bogføring!G860,\"\"),\"\")","v":12360},"2022-04-11",47,null,null,null,12360,4219,null,{"$f":"IF(G860=\"\",\"\",IF(ISERROR(VLOOKUP(G860,Kontoplan!A:D,2,0)),\"Konto findes ikke!\",VLOOKUP(G860,Kontoplan!A:D,2,0)))","v":"Skyldig A-skat"}]
[{"$f":"IF(B861>=T!C$4,IF(B861<=T!C$5,Bogføring!G861,\"\"),\"\")","v":12361},"2022-04-11",47,null,null,null,12361,797,null,{"$f":"IF(G861=\"\",\"\",IF(ISERROR(VLOOKUP(G861,Kontoplan!A:D,2,0)),\"Konto findes ikke!\",VLOOKUP(G861,Kontoplan!A:D,2,0)))","v":"Skyldig AM "}]
[{"$f":"IF(B862>=T!C$4,IF(B862<=T!C$5,Bogføring!G862,\"\"),\"\")","v":12310},"2022-04-11",47,null,null,null,12310,null,5016,{"$f":"IF(G862=\"\",\"\",IF(ISERROR(VLOOKUP(G862,Kontoplan!A:D,2,0)),\"Konto findes ikke!\",VLOOKUP(G862,Kontoplan!A:D,2,0)))","v":"Bank konto"}]
[{"$f":"IF(B863>=T!C$4,IF(B863<=T!C$5,Bogføring!G863,\"\"),\"\")","v":3125},"2022-04-19",48,null,null,null,3125,246.46,null,{"$f":"IF(G863=\"\",\"\",IF(ISERROR(VLOOKUP(G863,Kontoplan!A:D,2,0)),\"Konto findes ikke!\",VLOOKUP(G863,Kontoplan!A:D,2,0)))","v":"Samlet betaling"}]
[{"$f":"IF(B864>=T!C$4,IF(B864<=T!C$5,Bogføring!G864,\"\"),\"\")","v":12310},"2022-04-19",48,null,null,null,12310,null,246.46,{"$f":"IF(G864=\"\",\"\",IF(ISERROR(VLOOKUP(G864,Kontoplan!A:D,2,0)),\"Konto findes ikke!\",VLOOKUP(G864,Kontoplan!A:D,2,0)))","v":"Bank konto"}]
[{"$f":"IF(B865>=T!C$4,IF(B865<=T!C$5,Bogføring!G865,\"\"),\"\")","v":2025},"2022-04-19",49,null,null,null,2025,123.44,null,{"$f":"IF(G865=\"\",\"\",IF(ISERROR(VLOOKUP(G865,Kontoplan!A:D,2,0)),\"Konto findes ikke!\",VLOOKUP(G865,Kontoplan!A:D,2,0)))","v":"Regnskabsservice"}]
[{"$f":"IF(B866>=T!C$4,IF(B866<=T!C$5,Bogføring!G866,\"\"),\"\")","v":12310},"2022-04-19",49,null,null,null,12310,null,123.44,{"$f":"IF(G866=\"\",\"\",IF(ISERROR(VLOOKUP(G866,Kontoplan!A:D,2,0)),\"Konto findes ikke!\",VLOOKUP(G866,Kontoplan!A:D,2,0)))","v":"Bank konto"}]
[{"$f":"IF(B867>=T!C$4,IF(B867<=T!C$5,Bogføring!G867,\"\"),\"\")","v":2010},"2022-04-26",50,null,null,null,2010,27.5,null,{"$f":"IF(G867=\"\",\"\",IF(ISERROR(VLOOKUP(G867,Kontoplan!A:D,2,0)),\"Konto findes ikke!\",VLOOKUP(G867,Kontoplan!A:D,2,0)))","v":"Danløn"}]
[{"$f":"IF(B868>=T!C$4,IF(B868<=T!C$5,Bogføring!G868,\"\"),\"\")","v":12310},"2022-04-26",50,null,null,null,12310,null,27.5,{"$f":"IF(G868=\"\",\"\",IF(ISERROR(VLOOKUP(G868,Kontoplan!A:D,2,0)),\"Konto findes ikke!\",VLOOKUP(G868,Kontoplan!A:D,2,0)))","v":"Bank konto"}]
[{"$f":"IF(B869>=T!C$4,IF(B869<=T!C$5,Bogføring!G869,\"\"),\"\")","v":2065},"2022-04-26",51,null,null,null,2065,7393.75,null,{"$f":"IF(G869=\"\",\"\",IF(ISERROR(VLOOKUP(G869,Kontoplan!A:D,2,0)),\"Konto findes ikke!\",VLOOKUP(G869,Kontoplan!A:D,2,0)))","v":"Udstilling"}]
[{"$f":"IF(B870>=T!C$4,IF(B870<=T!C$5,Bogføring!G870,\"\"),\"\")","v":12310},"2022-04-26",51,null,null,null,12310,null,7393.75,{"$f":"IF(G870=\"\",\"\",IF(ISERROR(VLOOKUP(G870,Kontoplan!A:D,2,0)),\"Konto findes ikke!\",VLOOKUP(G870,Kontoplan!A:D,2,0)))","v":"Bank konto"}]
[{"$f":"IF(B871>=T!C$4,IF(B871<=T!C$5,Bogføring!G871,\"\"),\"\")","v":2030},"2022-04-27",52,null,null,null,2030,329.7,null,{"$f":"IF(G871=\"\",\"\",IF(ISERROR(VLOOKUP(G871,Kontoplan!A:D,2,0)),\"Konto findes ikke!\",VLOOKUP(G871,Kontoplan!A:D,2,0)))","v":"Bygnings vedligehold"}]
[{"$f":"IF(B872>=T!C$4,IF(B872<=T!C$5,Bogføring!G872,\"\"),\"\")","v":12310},"2022-04-27",52,null,null,null,12310,null,329.7,{"$f":"IF(G872=\"\",\"\",IF(ISERROR(VLOOKUP(G872,Kontoplan!A:D,2,0)),\"Konto findes ikke!\",VLOOKUP(G872,Kontoplan!A:D,2,0)))","v":"Bank konto"}]
[{"$f":"IF(B873>=T!C$4,IF(B873<=T!C$5,Bogføring!G873,\"\"),\"\")","v":2110},"2022-04-27",53,null,null,null,2110,350,null,{"$f":"IF(G873=\"\",\"\",IF(ISERROR(VLOOKUP(G873,Kontoplan!A:D,2,0)),\"Konto findes ikke!\",VLOOKUP(G873,Kontoplan!A:D,2,0)))","v":"Kontorhold - Porto - IT"}]
[{"$f":"IF(B874>=T!C$4,IF(B874<=T!C$5,Bogføring!G874,\"\"),\"\")","v":12310},"2022-04-27",53,null,null,null,12310,null,350,{"$f":"IF(G874=\"\",\"\",IF(ISERROR(VLOOKUP(G874,Kontoplan!A:D,2,0)),\"Konto findes ikke!\",VLOOKUP(G874,Kontoplan!A:D,2,0)))","v":"Bank konto"}]
[{"$f":"IF(B875>=T!C$4,IF(B875<=T!C$5,Bogføring!G875,\"\"),\"\")","v":2065},"2022-04-27",54,null,null,null,2065,2981.5,null,{"$f":"IF(G875=\"\",\"\",IF(ISERROR(VLOOKUP(G875,Kontoplan!A:D,2,0)),\"Konto findes ikke!\",VLOOKUP(G875,Kontoplan!A:D,2,0)))","v":"Udstilling"}]
[{"$f":"IF(B876>=T!C$4,IF(B876<=T!C$5,Bogføring!G876,\"\"),\"\")","v":12310},"2022-04-27",54,null,null,null,12310,null,2981.5,{"$f":"IF(G876=\"\",\"\",IF(ISERROR(VLOOKUP(G876,Kontoplan!A:D,2,0)),\"Konto findes ikke!\",VLOOKUP(G876,Kontoplan!A:D,2,0)))","v":"Bank konto"}]
[{"$f":"IF(B877>=T!C$4,IF(B877<=T!C$5,Bogføring!G877,\"\"),\"\")","v":3110},"2022-04-28",55,null,null,null,3110,10000,null,{"$f":"IF(G877=\"\",\"\",IF(ISERROR(VLOOKUP(G877,Kontoplan!A:D,2,0)),\"Konto findes ikke!\",VLOOKUP(G877,Kontoplan!A:D,2,0)))","v":"Lønninger incl ATP -AM"}]
[{"$f":"IF(B878>=T!C$4,IF(B878<=T!C$5,Bogføring!G878,\"\"),\"\")","v":12310},"2022-04-28",55,null,null,null,12310,null,4952.45,{"$f":"IF(G878=\"\",\"\",IF(ISERROR(VLOOKUP(G878,Kontoplan!A:D,2,0)),\"Konto findes ikke!\",VLOOKUP(G878,Kontoplan!A:D,2,0)))","v":"Bank konto"}]
[{"$f":"IF(B879>=T!C$4,IF(B879<=T!C$5,Bogføring!G879,\"\"),\"\")","v":12360},"2022-04-28",55,null,null,null,12360,null,4219,{"$f":"IF(G879=\"\",\"\",IF(ISERROR(VLOOKUP(G879,Kontoplan!A:D,2,0)),\"Konto findes ikke!\",VLOOKUP(G879,Kontoplan!A:D,2,0)))","v":"Skyldig A-skat"}]
[{"$f":"IF(B880>=T!C$4,IF(B880<=T!C$5,Bogføring!G880,\"\"),\"\")","v":12361},"2022-04-28",55,null,null,null,12361,null,797,{"$f":"IF(G880=\"\",\"\",IF(ISERROR(VLOOKUP(G880,Kontoplan!A:D,2,0)),\"Konto findes ikke!\",VLOOKUP(G880,Kontoplan!A:D,2,0)))","v":"Skyldig AM "}]
[{"$f":"IF(B881>=T!C$4,IF(B881<=T!C$5,Bogføring!G881,\"\"),\"\")","v":12362},"2022-04-28",55,null,null,null,12362,null,31.55,{"$f":"IF(G881=\"\",\"\",IF(ISERROR(VLOOKUP(G881,Kontoplan!A:D,2,0)),\"Konto findes ikke!\",VLOOKUP(G881,Kontoplan!A:D,2,0)))","v":"Skyldig ATP"}]
[{"$f":"IF(B882>=T!C$4,IF(B882<=T!C$5,Bogføring!G882,\"\"),\"\")","v":3120},"2022-04-28",55,null,null,null,3120,63.1,null,{"$f":"IF(G882=\"\",\"\",IF(ISERROR(VLOOKUP(G882,Kontoplan!A:D,2,0)),\"Konto findes ikke!\",VLOOKUP(G882,Kontoplan!A:D,2,0)))","v":"ATP"}]
[{"$f":"IF(B883>=T!C$4,IF(B883<=T!C$5,Bogføring!G883,\"\"),\"\")","v":12362},"2022-04-28",55,null,null,null,12362,null,63.1,{"$f":"IF(G883=\"\",\"\",IF(ISERROR(VLOOKUP(G883,Kontoplan!A:D,2,0)),\"Konto findes ikke!\",VLOOKUP(G883,Kontoplan!A:D,2,0)))","v":"Skyldig ATP"}]
[{"$f":"IF(B884>=T!C$4,IF(B884<=T!C$5,Bogføring!G884,\"\"),\"\")","v":3110},"2022-04-28",55,null,null,null,3110,200,null,{"$f":"IF(G884=\"\",\"\",IF(ISERROR(VLOOKUP(G884,Kontoplan!A:D,2,0)),\"Konto findes ikke!\",VLOOKUP(G884,Kontoplan!A:D,2,0)))","v":"Lønninger incl ATP -AM"}]
[{"$f":"IF(B885>=T!C$4,IF(B885<=T!C$5,Bogføring!G885,\"\"),\"\")","v":12364},"2022-04-28",55,null,null,null,12364,null,200,{"$f":"IF(G885=\"\",\"\",IF(ISERROR(VLOOKUP(G885,Kontoplan!A:D,2,0)),\"Konto findes ikke!\",VLOOKUP(G885,Kontoplan!A:D,2,0)))","v":"Skyldig feriepenge"}]
[{"$f":"IF(B886>=T!C$4,IF(B886<=T!C$5,Bogføring!G886,\"\"),\"\")","v":2000},"2022-04-29",56,null,null,null,2000,1.5,null,{"$f":"IF(G886=\"\",\"\",IF(ISERROR(VLOOKUP(G886,Kontoplan!A:D,2,0)),\"Konto findes ikke!\",VLOOKUP(G886,Kontoplan!A:D,2,0)))","v":"Bankgebyr"}]
[{"$f":"IF(B887>=T!C$4,IF(B887<=T!C$5,Bogføring!G887,\"\"),\"\")","v":12310},"2022-04-29",56,null,null,null,12310,null,1.5,{"$f":"IF(G887=\"\",\"\",IF(ISERROR(VLOOKUP(G887,Kontoplan!A:D,2,0)),\"Konto findes ikke!\",VLOOKUP(G887,Kontoplan!A:D,2,0)))","v":"Bank konto"}]
[{"$f":"IF(B888>=T!C$4,IF(B888<=T!C$5,Bogføring!G888,\"\"),\"\")","v":2040},"2022-05-02",57,null,null,null,2040,8712.0499999999993,null,{"$f":"IF(G888=\"\",\"\",IF(ISERROR(VLOOKUP(G888,Kontoplan!A:D,2,0)),\"Konto findes ikke!\",VLOOKUP(G888,Kontoplan!A:D,2,0)))","v":"El, Vand og Varme"}]
[{"$f":"IF(B889>=T!C$4,IF(B889<=T!C$5,Bogføring!G889,\"\"),\"\")","v":12310},"2022-05-02",57,null,null,null,12310,null,8712.0499999999993,{"$f":"IF(G889=\"\",\"\",IF(ISERROR(VLOOKUP(G889,Kontoplan!A:D,2,0)),\"Konto findes ikke!\",VLOOKUP(G889,Kontoplan!A:D,2,0)))","v":"Bank konto"}]
[{"$f":"IF(B890>=T!C$4,IF(B890<=T!C$5,Bogføring!G890,\"\"),\"\")","v":2040},"2022-05-02",58,null,null,null,2040,3733.54,null,{"$f":"IF(G890=\"\",\"\",IF(ISERROR(VLOOKUP(G890,Kontoplan!A:D,2,0)),\"Konto findes ikke!\",VLOOKUP(G890,Kontoplan!A:D,2,0)))","v":"El, Vand og Varme"}]
[{"$f":"IF(B891>=T!C$4,IF(B891<=T!C$5,Bogføring!G891,\"\"),\"\")","v":12310},"2022-05-02",58,null,null,null,12310,null,3733.54,{"$f":"IF(G891=\"\",\"\",IF(ISERROR(VLOOKUP(G891,Kontoplan!A:D,2,0)),\"Konto findes ikke!\",VLOOKUP(G891,Kontoplan!A:D,2,0)))","v":"Bank konto"}]
[{"$f":"IF(B892>=T!C$4,IF(B892<=T!C$5,Bogføring!G892,\"\"),\"\")","v":2060},"2022-05-02",59,null,null,null,2060,377.75,null,{"$f":"IF(G892=\"\",\"\",IF(ISERROR(VLOOKUP(G892,Kontoplan!A:D,2,0)),\"Konto findes ikke!\",VLOOKUP(G892,Kontoplan!A:D,2,0)))","v":"Internet, mobiltelefon, Forsik."}]
[{"$f":"IF(B893>=T!C$4,IF(B893<=T!C$5,Bogføring!G893,\"\"),\"\")","v":12310},"2022-05-02",59,null,null,null,12310,null,377.75,{"$f":"IF(G893=\"\",\"\",IF(ISERROR(VLOOKUP(G893,Kontoplan!A:D,2,0)),\"Konto findes ikke!\",VLOOKUP(G893,Kontoplan!A:D,2,0)))","v":"Bank konto"}]
[{"$f":"IF(B894>=T!C$4,IF(B894<=T!C$5,Bogføring!G894,\"\"),\"\")","v":2075},"2022-05-03",60,null,null,null,2075,170,null,{"$f":"IF(G894=\"\",\"\",IF(ISERROR(VLOOKUP(G894,Kontoplan!A:D,2,0)),\"Konto findes ikke!\",VLOOKUP(G894,Kontoplan!A:D,2,0)))","v":"Gaver"}]
[{"$f":"IF(B895>=T!C$4,IF(B895<=T!C$5,Bogføring!G895,\"\"),\"\")","v":12310},"2022-05-03",60,null,null,null,12310,null,170,{"$f":"IF(G895=\"\",\"\",IF(ISERROR(VLOOKUP(G895,Kontoplan!A:D,2,0)),\"Konto findes ikke!\",VLOOKUP(G895,Kontoplan!A:D,2,0)))","v":"Bank konto"}]
[{"$f":"IF(B896>=T!C$4,IF(B896<=T!C$5,Bogføring!G896,\"\"),\"\")","v":2170},"2022-05-03",61,null,null,null,2170,306.10000000000002,null,{"$f":"IF(G896=\"\",\"\",IF(ISERROR(VLOOKUP(G896,Kontoplan!A:D,2,0)),\"Konto findes ikke!\",VLOOKUP(G896,Kontoplan!A:D,2,0)))","v":"Afholdelse af GF"}]
[{"$f":"IF(B897>=T!C$4,IF(B897<=T!C$5,Bogføring!G897,\"\"),\"\")","v":12310},"2022-05-03",61,null,null,null,12310,null,306.10000000000002,{"$f":"IF(G897=\"\",\"\",IF(ISERROR(VLOOKUP(G897,Kontoplan!A:D,2,0)),\"Konto findes ikke!\",VLOOKUP(G897,Kontoplan!A:D,2,0)))","v":"Bank konto"}]
[{"$f":"IF(B898>=T!C$4,IF(B898<=T!C$5,Bogføring!G898,\"\"),\"\")","v":2035},"2022-05-03",62,null,null,null,2035,713.64,null,{"$f":"IF(G898=\"\",\"\",IF(ISERROR(VLOOKUP(G898,Kontoplan!A:D,2,0)),\"Konto findes ikke!\",VLOOKUP(G898,Kontoplan!A:D,2,0)))","v":"Grønne områder"}]
[{"$f":"IF(B899>=T!C$4,IF(B899<=T!C$5,Bogføring!G899,\"\"),\"\")","v":12310},"2022-05-03",62,null,null,null,12310,null,713.64,{"$f":"IF(G899=\"\",\"\",IF(ISERROR(VLOOKUP(G899,Kontoplan!A:D,2,0)),\"Konto findes ikke!\",VLOOKUP(G899,Kontoplan!A:D,2,0)))","v":"Bank konto"}]
[{"$f":"IF(B900>=T!C$4,IF(B900<=T!C$5,Bogføring!G900,\"\"),\"\")","v":12310},"2022-05-03",63,null,null,null,12310,476.1,null,{"$f":"IF(G900=\"\",\"\",IF(ISERROR(VLOOKUP(G900,Kontoplan!A:D,2,0)),\"Konto findes ikke!\",VLOOKUP(G900,Kontoplan!A:D,2,0)))","v":"Bank konto"}]
[{"$f":"IF(B901>=T!C$4,IF(B901<=T!C$5,Bogføring!G901,\"\"),\"\")","v":1130},"2022-05-03",63,null,null,null,1130,null,476.1,{"$f":"IF(G901=\"\",\"\",IF(ISERROR(VLOOKUP(G901,Kontoplan!A:D,2,0)),\"Konto findes ikke!\",VLOOKUP(G901,Kontoplan!A:D,2,0)))","v":"Diverse Indtægter"}]
[{"$f":"IF(B902>=T!C$4,IF(B902<=T!C$5,Bogføring!G902,\"\"),\"\")","v":2100},"2022-05-04",64,null,null,null,2100,242,null,{"$f":"IF(G902=\"\",\"\",IF(ISERROR(VLOOKUP(G902,Kontoplan!A:D,2,0)),\"Konto findes ikke!\",VLOOKUP(G902,Kontoplan!A:D,2,0)))","v":"Forplejning til møder/Rejser"}]
[{"$f":"IF(B903>=T!C$4,IF(B903<=T!C$5,Bogføring!G903,\"\"),\"\")","v":12310},"2022-05-04",64,null,null,null,12310,null,242,{"$f":"IF(G903=\"\",\"\",IF(ISERROR(VLOOKUP(G903,Kontoplan!A:D,2,0)),\"Konto findes ikke!\",VLOOKUP(G903,Kontoplan!A:D,2,0)))","v":"Bank konto"}]
[{"$f":"IF(B904>=T!C$4,IF(B904<=T!C$5,Bogføring!G904,\"\"),\"\")","v":12310},"2022-05-04",65,null,null,null,12310,20000,null,{"$f":"IF(G904=\"\",\"\",IF(ISERROR(VLOOKUP(G904,Kontoplan!A:D,2,0)),\"Konto findes ikke!\",VLOOKUP(G904,Kontoplan!A:D,2,0)))","v":"Bank konto"}]
[{"$f":"IF(B905>=T!C$4,IF(B905<=T!C$5,Bogføring!G905,\"\"),\"\")","v":1030},"2022-05-04",65,null,null,null,1030,null,20000,{"$f":"IF(G905=\"\",\"\",IF(ISERROR(VLOOKUP(G905,Kontoplan!A:D,2,0)),\"Konto findes ikke!\",VLOOKUP(G905,Kontoplan!A:D,2,0)))","v":"Tilskud fra KVB"}]
[{"$f":"IF(B906>=T!C$4,IF(B906<=T!C$5,Bogføring!G906,\"\"),\"\")","v":12320},"2022-05-04",66,null,null,null,12320,605,null,{"$f":"IF(G906=\"\",\"\",IF(ISERROR(VLOOKUP(G906,Kontoplan!A:D,2,0)),\"Konto findes ikke!\",VLOOKUP(G906,Kontoplan!A:D,2,0)))","v":"Kasse"}]
[{"$f":"IF(B907>=T!C$4,IF(B907<=T!C$5,Bogføring!G907,\"\"),\"\")","v":1000},"2022-05-04",66,null,null,null,1000,null,550,{"$f":"IF(G907=\"\",\"\",IF(ISERROR(VLOOKUP(G907,Kontoplan!A:D,2,0)),\"Konto findes ikke!\",VLOOKUP(G907,Kontoplan!A:D,2,0)))","v":"Entre"}]
[{"$f":"IF(B908>=T!C$4,IF(B908<=T!C$5,Bogføring!G908,\"\"),\"\")","v":1010},"2022-05-04",66,null,null,null,1010,null,55,{"$f":"IF(G908=\"\",\"\",IF(ISERROR(VLOOKUP(G908,Kontoplan!A:D,2,0)),\"Konto findes ikke!\",VLOOKUP(G908,Kontoplan!A:D,2,0)))","v":"Kiosk salg"}]
[{"$f":"IF(B909>=T!C$4,IF(B909<=T!C$5,Bogføring!G909,\"\"),\"\")","v":12320},"2022-05-05",67,null,null,null,12320,1265,null,{"$f":"IF(G909=\"\",\"\",IF(ISERROR(VLOOKUP(G909,Kontoplan!A:D,2,0)),\"Konto findes ikke!\",VLOOKUP(G909,Kontoplan!A:D,2,0)))","v":"Kasse"}]
[{"$f":"IF(B910>=T!C$4,IF(B910<=T!C$5,Bogføring!G910,\"\"),\"\")","v":1000},"2022-05-05",67,null,null,null,1000,null,1255,{"$f":"IF(G910=\"\",\"\",IF(ISERROR(VLOOKUP(G910,Kontoplan!A:D,2,0)),\"Konto findes ikke!\",VLOOKUP(G910,Kontoplan!A:D,2,0)))","v":"Entre"}]
[{"$f":"IF(B911>=T!C$4,IF(B911<=T!C$5,Bogføring!G911,\"\"),\"\")","v":1010},"2022-05-05",67,null,null,null,1010,null,10,{"$f":"IF(G911=\"\",\"\",IF(ISERROR(VLOOKUP(G911,Kontoplan!A:D,2,0)),\"Konto findes ikke!\",VLOOKUP(G911,Kontoplan!A:D,2,0)))","v":"Kiosk salg"}]
[{"$f":"IF(B912>=T!C$4,IF(B912<=T!C$5,Bogføring!G912,\"\"),\"\")","v":12430},"2022-05-05",67,null,null,null,12430,120,null,{"$f":"IF(G912=\"\",\"\",IF(ISERROR(VLOOKUP(G912,Kontoplan!A:D,2,0)),\"Konto findes ikke!\",VLOOKUP(G912,Kontoplan!A:D,2,0)))","v":"Tilgode PayPal"}]
[{"$f":"IF(B913>=T!C$4,IF(B913<=T!C$5,Bogføring!G913,\"\"),\"\")","v":1000},"2022-05-05",67,null,null,null,1000,null,120,{"$f":"IF(G913=\"\",\"\",IF(ISERROR(VLOOKUP(G913,Kontoplan!A:D,2,0)),\"Konto findes ikke!\",VLOOKUP(G913,Kontoplan!A:D,2,0)))","v":"Entre"}]
[{"$f":"IF(B914>=T!C$4,IF(B914<=T!C$5,Bogføring!G914,\"\"),\"\")","v":2005},"2022-05-05",67,null,null,null,2005,2.34,null,{"$f":"IF(G914=\"\",\"\",IF(ISERROR(VLOOKUP(G914,Kontoplan!A:D,2,0)),\"Konto findes ikke!\",VLOOKUP(G914,Kontoplan!A:D,2,0)))","v":"Gebyr Izettle"}]
[{"$f":"IF(B915>=T!C$4,IF(B915<=T!C$5,Bogføring!G915,\"\"),\"\")","v":12430},"2022-05-05",67,null,null,null,12430,null,2.34,{"$f":"IF(G915=\"\",\"\",IF(ISERROR(VLOOKUP(G915,Kontoplan!A:D,2,0)),\"Konto findes ikke!\",VLOOKUP(G915,Kontoplan!A:D,2,0)))","v":"Tilgode PayPal"}]
[{"$f":"IF(B916>=T!C$4,IF(B916<=T!C$5,Bogføring!G916,\"\"),\"\")","v":12310},"2022-05-04",68,null,null,null,12310,56,null,{"$f":"IF(G916=\"\",\"\",IF(ISERROR(VLOOKUP(G916,Kontoplan!A:D,2,0)),\"Konto findes ikke!\",VLOOKUP(G916,Kontoplan!A:D,2,0)))","v":"Bank konto"}]
[{"$f":"IF(B917>=T!C$4,IF(B917<=T!C$5,Bogføring!G917,\"\"),\"\")","v":1130},"2022-05-04",68,null,null,null,1130,null,56,{"$f":"IF(G917=\"\",\"\",IF(ISERROR(VLOOKUP(G917,Kontoplan!A:D,2,0)),\"Konto findes ikke!\",VLOOKUP(G917,Kontoplan!A:D,2,0)))","v":"Diverse Indtægter"}]
[{"$f":"IF(B918>=T!C$4,IF(B918<=T!C$5,Bogføring!G918,\"\"),\"\")","v":2060},"2022-05-05",69,null,null,null,2060,19,null,{"$f":"IF(G918=\"\",\"\",IF(ISERROR(VLOOKUP(G918,Kontoplan!A:D,2,0)),\"Konto findes ikke!\",VLOOKUP(G918,Kontoplan!A:D,2,0)))","v":"Internet, mobiltelefon, Forsik."}]
[{"$f":"IF(B919>=T!C$4,IF(B919<=T!C$5,Bogføring!G919,\"\"),\"\")","v":12310},"2022-05-05",69,null,null,null,12310,null,19,{"$f":"IF(G919=\"\",\"\",IF(ISERROR(VLOOKUP(G919,Kontoplan!A:D,2,0)),\"Konto findes ikke!\",VLOOKUP(G919,Kontoplan!A:D,2,0)))","v":"Bank konto"}]
[{"$f":"IF(B920>=T!C$4,IF(B920<=T!C$5,Bogføring!G920,\"\"),\"\")","v":2080},"2022-05-06",70,null,null,null,2080,1200,null,{"$f":"IF(G920=\"\",\"\",IF(ISERROR(VLOOKUP(G920,Kontoplan!A:D,2,0)),\"Konto findes ikke!\",VLOOKUP(G920,Kontoplan!A:D,2,0)))","v":"Indkøb af bøger"}]
[{"$f":"IF(B921>=T!C$4,IF(B921<=T!C$5,Bogføring!G921,\"\"),\"\")","v":12310},"2022-05-06",70,null,null,null,12310,null,1200,{"$f":"IF(G921=\"\",\"\",IF(ISERROR(VLOOKUP(G921,Kontoplan!A:D,2,0)),\"Konto findes ikke!\",VLOOKUP(G921,Kontoplan!A:D,2,0)))","v":"Bank konto"}]
[{"$f":"IF(B922>=T!C$4,IF(B922<=T!C$5,Bogføring!G922,\"\"),\"\")","v":2065},"2022-05-06",71,null,null,null,2065,56,null,{"$f":"IF(G922=\"\",\"\",IF(ISERROR(VLOOKUP(G922,Kontoplan!A:D,2,0)),\"Konto findes ikke!\",VLOOKUP(G922,Kontoplan!A:D,2,0)))","v":"Udstilling"}]
[{"$f":"IF(B923>=T!C$4,IF(B923<=T!C$5,Bogføring!G923,\"\"),\"\")","v":12310},"2022-05-06",71,null,null,null,12310,null,56,{"$f":"IF(G923=\"\",\"\",IF(ISERROR(VLOOKUP(G923,Kontoplan!A:D,2,0)),\"Konto findes ikke!\",VLOOKUP(G923,Kontoplan!A:D,2,0)))","v":"Bank konto"}]
[{"$f":"IF(B924>=T!C$4,IF(B924<=T!C$5,Bogføring!G924,\"\"),\"\")","v":12320},"2022-05-06",72,null,null,null,12320,530,null,{"$f":"IF(G924=\"\",\"\",IF(ISERROR(VLOOKUP(G924,Kontoplan!A:D,2,0)),\"Konto findes ikke!\",VLOOKUP(G924,Kontoplan!A:D,2,0)))","v":"Kasse"}]
[{"$f":"IF(B925>=T!C$4,IF(B925<=T!C$5,Bogføring!G925,\"\"),\"\")","v":1000},"2022-05-06",72,null,null,null,1000,null,520,{"$f":"IF(G925=\"\",\"\",IF(ISERROR(VLOOKUP(G925,Kontoplan!A:D,2,0)),\"Konto findes ikke!\",VLOOKUP(G925,Kontoplan!A:D,2,0)))","v":"Entre"}]
[{"$f":"IF(B926>=T!C$4,IF(B926<=T!C$5,Bogføring!G926,\"\"),\"\")","v":1010},"2022-05-06",72,null,null,null,1010,null,10,{"$f":"IF(G926=\"\",\"\",IF(ISERROR(VLOOKUP(G926,Kontoplan!A:D,2,0)),\"Konto findes ikke!\",VLOOKUP(G926,Kontoplan!A:D,2,0)))","v":"Kiosk salg"}]
[{"$f":"IF(B927>=T!C$4,IF(B927<=T!C$5,Bogføring!G927,\"\"),\"\")","v":12430},"2022-05-06",72,null,null,null,12430,765,null,{"$f":"IF(G927=\"\",\"\",IF(ISERROR(VLOOKUP(G927,Kontoplan!A:D,2,0)),\"Konto findes ikke!\",VLOOKUP(G927,Kontoplan!A:D,2,0)))","v":"Tilgode PayPal"}]
[{"$f":"IF(B928>=T!C$4,IF(B928<=T!C$5,Bogføring!G928,\"\"),\"\")","v":1000},"2022-05-06",72,null,null,null,1000,null,765,{"$f":"IF(G928=\"\",\"\",IF(ISERROR(VLOOKUP(G928,Kontoplan!A:D,2,0)),\"Konto findes ikke!\",VLOOKUP(G928,Kontoplan!A:D,2,0)))","v":"Entre"}]
[{"$f":"IF(B929>=T!C$4,IF(B929<=T!C$5,Bogføring!G929,\"\"),\"\")","v":2005},"2022-05-06",72,null,null,null,2005,14.92,null,{"$f":"IF(G929=\"\",\"\",IF(ISERROR(VLOOKUP(G929,Kontoplan!A:D,2,0)),\"Konto findes ikke!\",VLOOKUP(G929,Kontoplan!A:D,2,0)))","v":"Gebyr Izettle"}]
[{"$f":"IF(B930>=T!C$4,IF(B930<=T!C$5,Bogføring!G930,\"\"),\"\")","v":12430},"2022-05-06",72,null,null,null,12430,null,14.92,{"$f":"IF(G930=\"\",\"\",IF(ISERROR(VLOOKUP(G930,Kontoplan!A:D,2,0)),\"Konto findes ikke!\",VLOOKUP(G930,Kontoplan!A:D,2,0)))","v":"Tilgode PayPal"}]
[{"$f":"IF(B931>=T!C$4,IF(B931<=T!C$5,Bogføring!G931,\"\"),\"\")","v":12320},"2022-05-07",73,null,null,null,12320,60,null,{"$f":"IF(G931=\"\",\"\",IF(ISERROR(VLOOKUP(G931,Kontoplan!A:D,2,0)),\"Konto findes ikke!\",VLOOKUP(G931,Kontoplan!A:D,2,0)))","v":"Kasse"}]
[{"$f":"IF(B932>=T!C$4,IF(B932<=T!C$5,Bogføring!G932,\"\"),\"\")","v":1000},"2022-05-07",73,null,null,null,1000,null,60,{"$f":"IF(G932=\"\",\"\",IF(ISERROR(VLOOKUP(G932,Kontoplan!A:D,2,0)),\"Konto findes ikke!\",VLOOKUP(G932,Kontoplan!A:D,2,0)))","v":"Entre"}]
[{"$f":"IF(B933>=T!C$4,IF(B933<=T!C$5,Bogføring!G933,\"\"),\"\")","v":12430},"2022-05-07",73,null,null,null,12430,345,null,{"$f":"IF(G933=\"\",\"\",IF(ISERROR(VLOOKUP(G933,Kontoplan!A:D,2,0)),\"Konto findes ikke!\",VLOOKUP(G933,Kontoplan!A:D,2,0)))","v":"Tilgode PayPal"}]
[{"$f":"IF(B934>=T!C$4,IF(B934<=T!C$5,Bogføring!G934,\"\"),\"\")","v":1000},"2022-05-07",73,null,null,null,1000,null,345,{"$f":"IF(G934=\"\",\"\",IF(ISERROR(VLOOKUP(G934,Kontoplan!A:D,2,0)),\"Konto findes ikke!\",VLOOKUP(G934,Kontoplan!A:D,2,0)))","v":"Entre"}]
[{"$f":"IF(B935>=T!C$4,IF(B935<=T!C$5,Bogføring!G935,\"\"),\"\")","v":2005},"2022-05-07",73,null,null,null,2005,6.73,null,{"$f":"IF(G935=\"\",\"\",IF(ISERROR(VLOOKUP(G935,Kontoplan!A:D,2,0)),\"Konto findes ikke!\",VLOOKUP(G935,Kontoplan!A:D,2,0)))","v":"Gebyr Izettle"}]
[{"$f":"IF(B936>=T!C$4,IF(B936<=T!C$5,Bogføring!G936,\"\"),\"\")","v":12430},"2022-05-07",73,null,null,null,12430,null,6.73,{"$f":"IF(G936=\"\",\"\",IF(ISERROR(VLOOKUP(G936,Kontoplan!A:D,2,0)),\"Konto findes ikke!\",VLOOKUP(G936,Kontoplan!A:D,2,0)))","v":"Tilgode PayPal"}]
[{"$f":"IF(B937>=T!C$4,IF(B937<=T!C$5,Bogføring!G937,\"\"),\"\")","v":3120},"2022-05-09",74,null,null,null,3120,283.95,null,{"$f":"IF(G937=\"\",\"\",IF(ISERROR(VLOOKUP(G937,Kontoplan!A:D,2,0)),\"Konto findes ikke!\",VLOOKUP(G937,Kontoplan!A:D,2,0)))","v":"ATP"}]
[{"$f":"IF(B938>=T!C$4,IF(B938<=T!C$5,Bogføring!G938,\"\"),\"\")","v":12310},"2022-05-09",74,null,null,null,12310,null,283.95,{"$f":"IF(G938=\"\",\"\",IF(ISERROR(VLOOKUP(G938,Kontoplan!A:D,2,0)),\"Konto findes ikke!\",VLOOKUP(G938,Kontoplan!A:D,2,0)))","v":"Bank konto"}]
[{"$f":"IF(B939>=T!C$4,IF(B939<=T!C$5,Bogføring!G939,\"\"),\"\")","v":12310},"2022-05-09",75,null,null,null,12310,35,null,{"$f":"IF(G939=\"\",\"\",IF(ISERROR(VLOOKUP(G939,Kontoplan!A:D,2,0)),\"Konto findes ikke!\",VLOOKUP(G939,Kontoplan!A:D,2,0)))","v":"Bank konto"}]
[{"$f":"IF(B940>=T!C$4,IF(B940<=T!C$5,Bogføring!G940,\"\"),\"\")","v":1000},"2022-05-09",75,null,null,null,1000,null,35,{"$f":"IF(G940=\"\",\"\",IF(ISERROR(VLOOKUP(G940,Kontoplan!A:D,2,0)),\"Konto findes ikke!\",VLOOKUP(G940,Kontoplan!A:D,2,0)))","v":"Entre"}]
[{"$f":"IF(B941>=T!C$4,IF(B941<=T!C$5,Bogføring!G941,\"\"),\"\")","v":1000},"2022-05-09",76,null,null,null,1000,35,null,{"$f":"IF(G941=\"\",\"\",IF(ISERROR(VLOOKUP(G941,Kontoplan!A:D,2,0)),\"Konto findes ikke!\",VLOOKUP(G941,Kontoplan!A:D,2,0)))","v":"Entre"}]
[{"$f":"IF(B942>=T!C$4,IF(B942<=T!C$5,Bogføring!G942,\"\"),\"\")","v":12310},"2022-05-09",76,null,null,null,12310,null,35,{"$f":"IF(G942=\"\",\"\",IF(ISERROR(VLOOKUP(G942,Kontoplan!A:D,2,0)),\"Konto findes ikke!\",VLOOKUP(G942,Kontoplan!A:D,2,0)))","v":"Bank konto"}]
[{"$f":"IF(B943>=T!C$4,IF(B943<=T!C$5,Bogføring!G943,\"\"),\"\")","v":2100},"2022-05-09",77,null,null,null,2100,344.35,null,{"$f":"IF(G943=\"\",\"\",IF(ISERROR(VLOOKUP(G943,Kontoplan!A:D,2,0)),\"Konto findes ikke!\",VLOOKUP(G943,Kontoplan!A:D,2,0)))","v":"Forplejning til møder/Rejser"}]
[{"$f":"IF(B944>=T!C$4,IF(B944<=T!C$5,Bogføring!G944,\"\"),\"\")","v":12310},"2022-05-09",77,null,null,null,12310,null,344.35,{"$f":"IF(G944=\"\",\"\",IF(ISERROR(VLOOKUP(G944,Kontoplan!A:D,2,0)),\"Konto findes ikke!\",VLOOKUP(G944,Kontoplan!A:D,2,0)))","v":"Bank konto"}]
[{"$f":"IF(B945>=T!C$4,IF(B945<=T!C$5,Bogføring!G945,\"\"),\"\")","v":2100},"2022-05-09",78,null,null,null,2100,672,null,{"$f":"IF(G945=\"\",\"\",IF(ISERROR(VLOOKUP(G945,Kontoplan!A:D,2,0)),\"Konto findes ikke!\",VLOOKUP(G945,Kontoplan!A:D,2,0)))","v":"Forplejning til møder/Rejser"}]
[{"$f":"IF(B946>=T!C$4,IF(B946<=T!C$5,Bogføring!G946,\"\"),\"\")","v":12310},"2022-05-09",78,null,null,null,12310,null,672,{"$f":"IF(G946=\"\",\"\",IF(ISERROR(VLOOKUP(G946,Kontoplan!A:D,2,0)),\"Konto findes ikke!\",VLOOKUP(G946,Kontoplan!A:D,2,0)))","v":"Bank konto"}]
[{"$f":"IF(B947>=T!C$4,IF(B947<=T!C$5,Bogføring!G947,\"\"),\"\")","v":2100},"2022-05-09",79,null,null,null,2100,129.65,null,{"$f":"IF(G947=\"\",\"\",IF(ISERROR(VLOOKUP(G947,Kontoplan!A:D,2,0)),\"Konto findes ikke!\",VLOOKUP(G947,Kontoplan!A:D,2,0)))","v":"Forplejning til møder/Rejser"}]
[{"$f":"IF(B948>=T!C$4,IF(B948<=T!C$5,Bogføring!G948,\"\"),\"\")","v":12310},"2022-05-09",79,null,null,null,12310,null,129.65,{"$f":"IF(G948=\"\",\"\",IF(ISERROR(VLOOKUP(G948,Kontoplan!A:D,2,0)),\"Konto findes ikke!\",VLOOKUP(G948,Kontoplan!A:D,2,0)))","v":"Bank konto"}]
[{"$f":"IF(B949>=T!C$4,IF(B949<=T!C$5,Bogføring!G949,\"\"),\"\")","v":2100},"2022-05-09",80,null,null,null,2100,17.25,null,{"$f":"IF(G949=\"\",\"\",IF(ISERROR(VLOOKUP(G949,Kontoplan!A:D,2,0)),\"Konto findes ikke!\",VLOOKUP(G949,Kontoplan!A:D,2,0)))","v":"Forplejning til møder/Rejser"}]
[{"$f":"IF(B950>=T!C$4,IF(B950<=T!C$5,Bogføring!G950,\"\"),\"\")","v":12310},"2022-05-09",80,null,null,null,12310,null,17.25,{"$f":"IF(G950=\"\",\"\",IF(ISERROR(VLOOKUP(G950,Kontoplan!A:D,2,0)),\"Konto findes ikke!\",VLOOKUP(G950,Kontoplan!A:D,2,0)))","v":"Bank konto"}]
[{"$f":"IF(B951>=T!C$4,IF(B951<=T!C$5,Bogføring!G951,\"\"),\"\")","v":""},null,null,null,null,null,null,null,null,{"$f":"IF(G951=\"\",\"\",IF(ISERROR(VLOOKUP(G951,Kontoplan!A:D,2,0)),\"Konto findes ikke!\",VLOOKUP(G951,Kontoplan!A:D,2,0)))","v":""}]
[{"$f":"IF(B952>=T!C$4,IF(B952<=T!C$5,Bogføring!G952,\"\"),\"\")","v":""},null,null,null,null,null,null,null,null,{"$f":"IF(G952=\"\",\"\",IF(ISERROR(VLOOKUP(G952,Kontoplan!A:D,2,0)),\"Konto findes ikke!\",VLOOKUP(G952,Kontoplan!A:D,2,0)))","v":""}]
[{"$f":"IF(B953>=T!C$4,IF(B953<=T!C$5,Bogføring!G953,\"\"),\"\")","v":""},null,null,null,null,null,null,null,null,{"$f":"IF(G953=\"\",\"\",IF(ISERROR(VLOOKUP(G953,Kontoplan!A:D,2,0)),\"Konto findes ikke!\",VLOOKUP(G953,Kontoplan!A:D,2,0)))","v":""}]
[{"$f":"IF(B954>=T!C$4,IF(B954<=T!C$5,Bogføring!G954,\"\"),\"\")","v":""},null,null,null,null,null,null,null,null,{"$f":"IF(G954=\"\",\"\",IF(ISERROR(VLOOKUP(G954,Kontoplan!A:D,2,0)),\"Konto findes ikke!\",VLOOKUP(G954,Kontoplan!A:D,2,0)))","v":""}]
[{"$f":"IF(B955>=T!C$4,IF(B955<=T!C$5,Bogføring!G955,\"\"),\"\")","v":""},null,null,null,null,null,null,null,null,{"$f":"IF(G955=\"\",\"\",IF(ISERROR(VLOOKUP(G955,Kontoplan!A:D,2,0)),\"Konto findes ikke!\",VLOOKUP(G955,Kontoplan!A:D,2,0)))","v":""}]
[{"$f":"IF(B956>=T!C$4,IF(B956<=T!C$5,Bogføring!G956,\"\"),\"\")","v":""},null,null,null,null,null,null,null,null,{"$f":"IF(G956=\"\",\"\",IF(ISERROR(VLOOKUP(G956,Kontoplan!A:D,2,0)),\"Konto findes ikke!\",VLOOKUP(G956,Kontoplan!A:D,2,0)))","v":""}]
[{"$f":"IF(B957>=T!C$4,IF(B957<=T!C$5,Bogføring!G957,\"\"),\"\")","v":""},null,null,null,null,null,null,null,null,{"$f":"IF(G957=\"\",\"\",IF(ISERROR(VLOOKUP(G957,Kontoplan!A:D,2,0)),\"Konto findes ikke!\",VLOOKUP(G957,Kontoplan!A:D,2,0)))","v":""}]
[{"$f":"IF(B958>=T!C$4,IF(B958<=T!C$5,Bogføring!G958,\"\"),\"\")","v":""},null,null,null,null,null,null,null,null,{"$f":"IF(G958=\"\",\"\",IF(ISERROR(VLOOKUP(G958,Kontoplan!A:D,2,0)),\"Konto findes ikke!\",VLOOKUP(G958,Kontoplan!A:D,2,0)))","v":""}]
[{"$f":"IF(B959>=T!C$4,IF(B959<=T!C$5,Bogføring!G959,\"\"),\"\")","v":""},null,null,null,null,null,null,null,null,{"$f":"IF(G959=\"\",\"\",IF(ISERROR(VLOOKUP(G959,Kontoplan!A:D,2,0)),\"Konto findes ikke!\",VLOOKUP(G959,Kontoplan!A:D,2,0)))","v":""}]
[{"$f":"IF(B960>=T!C$4,IF(B960<=T!C$5,Bogføring!G960,\"\"),\"\")","v":""},null,null,null,null,null,null,null,null,{"$f":"IF(G960=\"\",\"\",IF(ISERROR(VLOOKUP(G960,Kontoplan!A:D,2,0)),\"Konto findes ikke!\",VLOOKUP(G960,Kontoplan!A:D,2,0)))","v":""}]
[null,null,null,null,null,null,null,null,null,{"$f":"IF(G961=\"\",\"\",IF(ISERROR(VLOOKUP(G961,Kontoplan!A:D,2,0)),\"Konto findes ikke!\",VLOOKUP(G961,Kontoplan!A:D,2,0)))","v":""}]
[]
[]
[]
[]
[]
[]
[]
[]
[]
[]
[]
[]
[]
[]
[]
[]
[]
[]
[]
[]
[]
[]
[]
[]
[]
[]
[]
[]
[]
[]
[]
[]
[]
[]
[]
[]
[]
[]
[]
[]
[]
[]
[]
[]
[]
[]
[]
[]
[]
[]
[]
[]
[]
[]
[]
[]
[]
[]
[]
[]
[]
[]
[]
[]
[]
[]
[]
[]
[]
[]
[]
[]
[]
[]
[]
[]
[]
[]
[]
[]
[]
[]
[]
[]
[]
[]
[]
[]
[]
[]
[]
[]
[]
[]
[]
[]
[]
[]
[]
[]
[]
[]
[]
[]
[]
[]
[]
[]
[]
[]
[]
[]
[]
[]
[]
[]
[]
[]
[]
[]
[]
[]
[]
[]
[]
[]
[]
[]
[]
[]
[]
[]
[]
[]
[]
[]
[]
[]
[]
[]
[]
[]
[]
[]
[]
[]
[]
[]
[]
[]
[]
[]
[]
[]
[]
[]
[]
[]
[]
[]
[]
[]
[]
[]
[]
[]
[]
[]
[]
[]
[]
[]
[]
[]
[]
[]
[]
[]
[]
[]
[]
[]
[]
[]
[]
[]
[]
[]
[]
[]
[]
[]
[]
[]
[]
[]
[]
[]
[]
[]
[]
[]
[]
[]
[]
[]
[]
[]
[]
[]
[]
[]
[]
[]
[]
[]
[]
[]
[]
[]
[]
[]
[]
[]
[]
[]
[]
[]
[]
[]
[]
[]
[]
[]
[]
[]
[]
[]
[]
[]
[]
[]
[]
[]
[]
[]
[]
[]
[]
[]
[]
[]
[]
[]
[]
[]
[]
[]
[]
[]
[]
[]
[]
[]
[]
[]
[]
[]
[]
[]
[]
[]
[]
[]
[]
[]
[]
[]
[]
[]
[]
[]
[]
[]
[]
[]
[]
[]
[]
[]
[]
[]
[]
[]
[]
[]
[]
[]
[]
[]
[]
[]
[]
[]
[]
[]
[]
[]
[]
[]
[]
[]
[]
[]
[]
[]
[]
[]
[]
[]
[]
[]
[]
[]
[]
[]
[]
[]
[]
[]
[]
[]
[]
[]
[]
[]
[]
[]
[]
[]
[]
[]
[]
[]
[]
[]
[]
[]
[]
[]
[]
[]
[]
[]
[]
[]
[]
[]
[]
[]
[]
[]
[]
[]
[]
[]
[]
[]
[]
[]
[]
[]
[]
[]
[]
[]
[]
[]
[]
[]
[]
[]
[]
[]
[]
[]
[]
[]
[]
[]
[]
[]
[]
[]
[]
[]
[]
[]
[]
[]
[]
[]
[]
[]
[]
[]
[]
[]
[]
[]
[]
[]
[]
[]
[]
[]
[]
[]
[]
[]
[]
[]
[]
[]
[]
[]
[]
[]
[]
[]
[]
[]
[]
[]
[]
[]
[]
[]
[]
[]
[]
[]
[]
[]
[]
[]
[]
[]
[]
[]
[]
[]
[]
[]
[]
[]
[]
[]
[]
[]
[]
[]
[]
[]
[]
[]
[]
[]
[]
[]
[]
[]
[]
[]
[]
[]
[]
[]
[]
[]
[]
[]
[]
[]
[]
[]
[]
[]
[]
[]
[]
[]
[]
[]
[]
[]
[]
[]
[]
[]
[]
[]
[]
[]
[]
[]
[]
[]
[]
[]
[]
[]
[]
[]
[]
[]
[]
[]
[]
[]
[]
[]
[]
[]
[]
[]
[]
[]
[]
[]
[]
[]
[]
[]
[]
[]
[]
[]
[]
[]
[]
[]
[]
[]
[]
[]
[]
[]
[]
[]
[]
[]
[]
[]
[]
[]
[]
[]
[]
[]
[]
[]
[]
[]
[]
[]
[]
[]
[]
[]
[]
[]
[]
[]
[]
[]
[]
[]
[]
[]
[]
[]
[]
[]
[]
[]
[]
[]
[]
[]
[]
[]
[]
[]
[]
[]
[]
[]
[]
[]
[]
[]
[]
[]
[]
[]
[]
[]
[]
[]
[]
[]
[]
[]
[]
[]
[]
[]
[]
[]
[]
[]
[]
[]
[]
[]
[]
[]
[]
[]
[]
[]
[]
[]
[]
[]
[]
[]
[]
[]
[]
[]
[]
[]
[]
[]
[]
[]
[]
[]
[]
[]
[]
[]
[]
[]
[]
[]
[]
[]
[]
[]
[]
[]
[]
[]
[]
[]
[]
[]
[]
[]
[]
[]
[]
[]
[]
[]
[]
[]
[]
[]
[]
[]
[]
[]
[]
[]
[]
[]
[]
[]
[]
[]
[]
[]
[]
[]
[]
[]
[]
[]
[]
[]
[]
[]
[]
[]
[]
[]
[]
[]
[]
[]
[]
[]
[]
[]
[]
[]
[]
[]
[]
[]
[]
[]
[]
[]
[]
[]
[]
[]
[]
[]
[]
[]
[]
[]
[]
[]
[]
[]
[]
[]
[]
[]
[]
[]
[]
[]
[]
[]
[]
[]
[]
[]
[]
[]
[]
[]
[]
[]
[]
[]
[]
[]
[]
[]
[]
[]
[]
[]
[]
[]
[]
[]
[]
[]
[]
[]
[]
[]
[]
[]
[]
[]
[]
[]
[]
[]
[]
[]
[]
[]
[]
[]
[]
[]
[]
[]
[]
[]
[]
[]
[]
[]
[]
[]
[]
[]
[]
[]
[]
[]
[]
[]
[]
[]
[]
[]
[]
[]
[]
[]
[]
[]
[]
[]
[]
[]
[]
[]
[]
[]
[]
[]
[]
[]
[]
[]
[]
[]
[]
[]
[]
[]
[]
[]
[]
[]
[]
[]
[]
[]
[]
[]
[]
[]
[]
[]
[]
[]
[]
[]
[]
[]
[]
[]
[]
[]
[]
[]
[]
[]
[]
[]
[]
[]
[]
[]
[]
[]
[]
[]
[]
[]
[]
[]
[]
[]
[]
[]
[]
[]
[]
[]
[]
[]
[]
[]
[]
[]
[]
[]
[]
[]
[]
[]
[]
[]
[]
[]
[]
[]
[]
[]
[]
[]
[]
[]
[]
[]
[]
[]
[]
[]
[]
[]
[]
[]
[]
[]
[]
[]
[]
[]
[]
[]
[]
[]
[]
[]
[]
[]
[]
[]
[]
[]
[]
[]
[]
[]
[]
[]
[]
[]
[]
[]
[]
[]
[]
[]
[]
[]
[]
[]
[]
[]
[]
[]
[]
[]
[]
[]
[]
[]
[]
[]
[]
[]
[]
[]
[]
[]
[]
[]
[]
[]
[]
[]
[]
[]
[]
[]
[]
[]
[]
[]
[]
[]
[]
[]
[]
[]
[]
[]
[]
[]
[]
[]
[]
[]
[]
[]
[]
[]
[]
[]
[]
[]
[]
[]
[]
[]
[]
[]
[]
[]
[]
[]
[]
[]
[]
[]
[]
[]
[]
[]
[]
[]
[]
[]
[]
[]
[]
[]
[]
[]
[]
[]
[]
[]
[]
[]
[]
[]
[]
[]
[]
[]
[]
[]
[]
[]
[]
[]
[]
[]
[]
[]
[]
[]
[]
[]
[]
[]
[]
[]
[]
[]
[]
[]
[]
[]
[]
[]
[]
[]
[]
[]
[]
[]
[]
[]
[]
[]
[]
[]
[]
[]
[]
[]
[]
[]
[]
[]
[]
[]
[]
[]
[]
[]
[]
[]
[]
[]
[]
[]
[]
[]
[]
[]
[]
[]
[]
[]
[]
[]
[]
[]
[]
[]
[]
[]
[]
[]
[]
[]
[]
[]
[]
[]
[]
[]
[]
[]
[]
[]
[]
[]
[]
[]
[]
[]
[]
[]
[]
[]
[]
[]
[]
[]
[]
[]
[]
[]
[]
[]
[]
[]
[]
[]
[]
[]
[]
[]
[]
[]
[]
[]
[]
[]
[]
[]
[]
[]
[]
[]
[]
[]
[]
[]
[]
[]
[]
[]
[]
[]
[]
[]
[]
[]
[]
[]
[]
[]
[]
[]
[]
[]
[]
[]
[]
[]
[]
[]
[]
[]
[]
[]
[]
[]
[]
[]
[]
[]
[]
[]
[]
[]
[]
[]
[]
[]
[]
[]
[]
[]
[]
[]
[]
[]
[]
[]
[]
[]
[]
[]
[]
[]
[]
[]
[]
[]
[]
[]
[]
[]
[]
[]
[]
[]
[]
[]
[]
[]
[]
[]
[]
[]
[]
[]
[]
[]
[]
[]
[]
[]
[]
[]
[]
[]
[]
[]
[]
[]
[]
[]
[]
[]
[]
[]
[]
[]
[]
[]
[]
[]
[]
[]
[]
[]
[]
[]
[]
[]
[]
[]
[]
[]
[]
[]
[]
[]
[]
[]
[]
[]
[]
[]
[]
[]
[]
[]
[]
[]
[]
[]
[]
[]
[]
[]
[]
[]
[]
[]
[]
[]
[]
[]
[]
[]
[]
[]
[]
[]
[]
[]
[]
[]
[]
[]
[]
[]
[]
[]
[]
[]
[]
[]
[]
[]
[]
[]
[]
[]
[]
[]
[]
[]
[]
[]
[]
[]
[]
[]
[]
[]
[]
[]
[]
[]
[]
[]
[]
[]
[]
[]
[]
[]
[]
[]
[]
[]
[]
[]
[]
[]
[]
[]
[]
[]
[]
[]
[]
[]
[]
[]
[]
[]
[]
[]
[]
[]
[]
[]
[]
[]
[]
[]
[]
[]
[]
[]
[]
[]
[]
[]
[]
[]
[]
[]
[]
[]
[]
[]
[]
[]
[]
[]
[]
[]
[]
[]
[]
[]
[]
[]
[]
[]
[]
[]
[]
[]
[]
[]
[]
[]
[]
[]
[]
[]
[]
[]
[]
[]
[]
[]
[]
[]
[]
[]
[]
[]
[]
[]
[]
[]
[]
[]
[]
[]
[]
[]
[]
[]
[]
[]
[]
[]
[]
[]
[]
[]
[]
[]
[]
[]
[]
[]
[]
[]
[]
[]
[]
[]
[]
[]
[]
[]
[]
[]
[]
[]
[]
[]
[]
[]
[]
[]
[]
[]
[]
[]
[]
[]
[]
[]
[]
[]
[]
[]
[]
[]
[]
[]
[]
[]
[]
[]
[]
[]
[]
[]
[]
[]
[]
[]
[]
[]
[]
[]
[]
[]
[]
[]
[]
[]
[]
[]
[]
[]
[]
[]
[]
[]
[]
[]
[]
[]
[]
[]
[]
[]
[]
[]
[]
[]
[]
[]
[]
[]
[]
[]
[]
[]
[]
[]
[]
[]
[]
[]
[]
[]
[]
[]
[]
[]
[]
[]
[]
[]
[]
[]
[]
[]
[]
[]
[]
[]
[]
[]
[]
[]
[]
[]
[]
[]
[]
[]
[]
[]
[]
[]
[]
[]
[]
[]
[]
[]
[]
[]
[]
[]
[]
[]
[]
[]
[]
[]
[]
[]
[]
[]
[]
[]
[]
[]
[]
[]
[]
[]
[]
[]
[]
[]
[]
[]
[]
[]
[]
[]
[]
[]
[]
[]
[]
[]
[]
[]
[]
[]
[]
[]
[null,null,null,null,null,null,null,null,null,{"$f":"IF(G2636=\"\",\"\",IF(ISERROR(VLOOKUP(G2636,[1]Kontoplan!A:D,2,0)),\"Konto findes ikke!\",VLOOKUP(G2636,[1]Kontoplan!A:D,2,0)))","v":""}]

{"sheet":"Kontoplan","index":1,"n_rows":93,"n_cols":10,"rows_kept":93,"cut":false,"hidden":true,"merged":[]}
["Konto","Kontobeskrivelse","Saldo","Kommentarer","Fra","Til"]
[1000,"Entre",{"$f":"SUMIFS(Bogføring!$I:$I,Bogføring!$B:$B,\">=\"&T!$C$4,Bogføring!$B:$B,\"<=\"&T!$C$5,Bogføring!$G:$G,A2)-SUMIFS(Bogføring!$H:$H,Bogføring!$B:$B,\">=\"&T!$C$4,Bogføring!$B:$B,\"<=\"&T!$C$5,Bogføring!$G:$G,A2)","v":8740},null,null,null,null,1000,null,"Entre"]
[1010,"Kiosk salg",{"$f":"SUMIFS(Bogføring!$I:$I,Bogføring!$B:$B,\">=\"&T!$C$4,Bogføring!$B:$B,\"<=\"&T!$C$5,Bogføring!$G:$G,A3)-SUMIFS(Bogføring!$H:$H,Bogføring!$B:$B,\">=\"&T!$C$4,Bogføring!$B:$B,\"<=\"&T!$C$5,Bogføring!$G:$G,A3)","v":75},null,null,null,null,1010,null,"Voksne"]
[1020,"Tilskud fra BRK/ drifttilskud",{"$f":"SUMIFS(Bogføring!$I:$I,Bogføring!$B:$B,\">=\"&T!$C$4,Bogføring!$B:$B,\"<=\"&T!$C$5,Bogføring!$G:$G,A4)-SUMIFS(Bogføring!$H:$H,Bogføring!$B:$B,\">=\"&T!$C$4,Bogføring!$B:$B,\"<=\"&T!$C$5,Bogføring!$G:$G,A4)","v":74021},null,null,null,null,1020,null,"Pensionister"]
[1025,"Tilskud fra BRK ",{"$f":"SUMIFS(Bogføring!$I:$I,Bogføring!$B:$B,\">=\"&T!$C$4,Bogføring!$B:$B,\"<=\"&T!$C$5,Bogføring!$G:$G,A5)-SUMIFS(Bogføring!$H:$H,Bogføring!$B:$B,\">=\"&T!$C$4,Bogføring!$B:$B,\"<=\"&T!$C$5,Bogføring!$G:$G,A5)","v":15000},null,null,null,null,1030,null,"Børn 6-16"]
[1030,"Tilskud fra KVB",{"$f":"SUMIFS(Bogføring!$I:$I,Bogføring!$B:$B,\">=\"&T!$C$4,Bogføring!$B:$B,\"<=\"&T!$C$5,Bogføring!$G:$G,A6)-SUMIFS(Bogføring!$H:$H,Bogføring!$B:$B,\">=\"&T!$C$4,Bogføring!$B:$B,\"<=\"&T!$C$5,Bogføring!$G:$G,A6)","v":20000},null,null,null,null,1040,null,"Soldater/veteraner"]
[1040,"Fonde/Gaver",{"$f":"SUMIFS(Bogføring!$I:$I,Bogføring!$B:$B,\">=\"&T!$C$4,Bogføring!$B:$B,\"<=\"&T!$C$5,Bogføring!$G:$G,A7)-SUMIFS(Bogføring!$H:$H,Bogføring!$B:$B,\">=\"&T!$C$4,Bogføring!$B:$B,\"<=\"&T!$C$5,Bogføring!$G:$G,A7)","v":0},null,null,null,null,1050,null,"Skoler"]
[1050,"Aktiviteter",{"$f":"SUMIFS(Bogføring!$I:$I,Bogføring!$B:$B,\">=\"&T!$C$4,Bogføring!$B:$B,\"<=\"&T!$C$5,Bogføring!$G:$G,A8)-SUMIFS(Bogføring!$H:$H,Bogføring!$B:$B,\">=\"&T!$C$4,Bogføring!$B:$B,\"<=\"&T!$C$5,Bogføring!$G:$G,A8)","v":0},null,null,null,null,1060,null,"Grupper"]
[1060,"Bog salg",{"$f":"SUMIFS(Bogføring!$I:$I,Bogføring!$B:$B,\">=\"&T!$C$4,Bogføring!$B:$B,\"<=\"&T!$C$5,Bogføring!$G:$G,A9)-SUMIFS(Bogføring!$H:$H,Bogføring!$B:$B,\">=\"&T!$C$4,Bogføring!$B:$B,\"<=\"&T!$C$5,Bogføring!$G:$G,A9)","v":0},null,null,null,null,1070,null,"Guide"]
[1070,"Pengegaver",{"$f":"SUMIFS(Bogføring!$I:$I,Bogføring!$B:$B,\">=\"&T!$C$4,Bogføring!$B:$B,\"<=\"&T!$C$5,Bogføring!$G:$G,A10)-SUMIFS(Bogføring!$H:$H,Bogføring!$B:$B,\">=\"&T!$C$4,Bogføring!$B:$B,\"<=\"&T!$C$5,Bogføring!$G:$G,A10)","v":0},null,null,null,null,1080,null,"Tilskud fra BRK/ drifttilskud"]
[1080,"Flaskepant retur",{"$f":"SUMIFS(Bogføring!$I:$I,Bogføring!$B:$B,\">=\"&T!$C$4,Bogføring!$B:$B,\"<=\"&T!$C$5,Bogføring!$G:$G,A11)-SUMIFS(Bogføring!$H:$H,Bogføring!$B:$B,\">=\"&T!$C$4,Bogføring!$B:$B,\"<=\"&T!$C$5,Bogføring!$G:$G,A11)","v":0},null,null,null,null,1090,null,"Tilskud fra BRK "]
[1090,"Kassedifferance",{"$f":"SUMIFS(Bogføring!$I:$I,Bogføring!$B:$B,\">=\"&T!$C$4,Bogføring!$B:$B,\"<=\"&T!$C$5,Bogføring!$G:$G,A12)-SUMIFS(Bogføring!$H:$H,Bogføring!$B:$B,\">=\"&T!$C$4,Bogføring!$B:$B,\"<=\"&T!$C$5,Bogføring!$G:$G,A12)","v":0},null,null,null,null,1100,null,"Tilskud fra KVB"]
[1100,null,{"$f":"SUMIFS(Bogføring!$I:$I,Bogføring!$B:$B,\">=\"&T!$C$4,Bogføring!$B:$B,\"<=\"&T!$C$5,Bogføring!$G:$G,A13)-SUMIFS(Bogføring!$H:$H,Bogføring!$B:$B,\">=\"&T!$C$4,Bogføring!$B:$B,\"<=\"&T!$C$5,Bogføring!$G:$G,A13)","v":0},null,null,null,null,1110,null,"Fonde/Gaver"]
[1110,"A-skat Retur",{"$f":"SUMIFS(Bogføring!$I:$I,Bogføring!$B:$B,\">=\"&T!$C$4,Bogføring!$B:$B,\"<=\"&T!$C$5,Bogføring!$G:$G,A14)-SUMIFS(Bogføring!$H:$H,Bogføring!$B:$B,\">=\"&T!$C$4,Bogføring!$B:$B,\"<=\"&T!$C$5,Bogføring!$G:$G,A14)","v":2.9},null,null,null,null,1120,null,"Pengegaver"]
[1115,"Løn Retur fra visma",{"$f":"SUMIFS(Bogføring!$I:$I,Bogføring!$B:$B,\">=\"&T!$C$4,Bogføring!$B:$B,\"<=\"&T!$C$5,Bogføring!$G:$G,A15)-SUMIFS(Bogføring!$H:$H,Bogføring!$B:$B,\">=\"&T!$C$4,Bogføring!$B:$B,\"<=\"&T!$C$5,Bogføring!$G:$G,A15)","v":0},null,null,null,null,1130,null,"Flaskepant retur"]
[1120,"Lønsum retur",{"$f":"SUMIFS(Bogføring!$I:$I,Bogføring!$B:$B,\">=\"&T!$C$4,Bogføring!$B:$B,\"<=\"&T!$C$5,Bogføring!$G:$G,A16)-SUMIFS(Bogføring!$H:$H,Bogføring!$B:$B,\">=\"&T!$C$4,Bogføring!$B:$B,\"<=\"&T!$C$5,Bogføring!$G:$G,A16)","v":11493.46},null,null,null,null,1140,null,"Kassedifferance"]
[1125,"Salg af inventar",{"$f":"SUMIFS(Bogføring!$I:$I,Bogføring!$B:$B,\">=\"&T!$C$4,Bogføring!$B:$B,\"<=\"&T!$C$5,Bogføring!$G:$G,A17)-SUMIFS(Bogføring!$H:$H,Bogføring!$B:$B,\">=\"&T!$C$4,Bogføring!$B:$B,\"<=\"&T!$C$5,Bogføring!$G:$G,A17)","v":0},null,null,null,null,1150,null,"A-skat Retur"]
[1130,"Diverse Indtægter",{"$f":"SUMIFS(Bogføring!$I:$I,Bogføring!$B:$B,\">=\"&T!$C$4,Bogføring!$B:$B,\"<=\"&T!$C$5,Bogføring!$G:$G,A18)-SUMIFS(Bogføring!$H:$H,Bogføring!$B:$B,\">=\"&T!$C$4,Bogføring!$B:$B,\"<=\"&T!$C$5,Bogføring!$G:$G,A18)","v":532.1},null,null,null,null,1160,null,"Løn Retur fra visma"]
[1200,null,null,null,null,null,null,1170,null,"Lønsum retur"]
[1210,"Bælter",{"$f":"SUMIFS(Bogføring!$I:$I,Bogføring!$B:$B,\">=\"&T!$C$4,Bogføring!$B:$B,\"<=\"&T!$C$5,Bogføring!$G:$G,A20)-SUMIFS(Bogføring!$H:$H,Bogføring!$B:$B,\">=\"&T!$C$4,Bogføring!$B:$B,\"<=\"&T!$C$5,Bogføring!$G:$G,A20)","v":0},null,null,null,null,1180,null,"Salg af inventar"]
[1220,"Bog salg",{"$f":"SUMIFS(Bogføring!$I:$I,Bogføring!$B:$B,\">=\"&T!$C$4,Bogføring!$B:$B,\"<=\"&T!$C$5,Bogføring!$G:$G,A21)-SUMIFS(Bogføring!$H:$H,Bogføring!$B:$B,\">=\"&T!$C$4,Bogføring!$B:$B,\"<=\"&T!$C$5,Bogføring!$G:$G,A21)","v":0},null,null,null,null,1190,null,"Diverse Indtægter"]
[1230,"Færdige Tinsoldater",{"$f":"SUMIFS(Bogføring!$I:$I,Bogføring!$B:$B,\">=\"&T!$C$4,Bogføring!$B:$B,\"<=\"&T!$C$5,Bogføring!$G:$G,A22)-SUMIFS(Bogføring!$H:$H,Bogføring!$B:$B,\">=\"&T!$C$4,Bogføring!$B:$B,\"<=\"&T!$C$5,Bogføring!$G:$G,A22)","v":0},null,null,null,null,1200,null,"Kiosksalg"]
[1240,"Landkort",{"$f":"SUMIFS(Bogføring!$I:$I,Bogføring!$B:$B,\">=\"&T!$C$4,Bogføring!$B:$B,\"<=\"&T!$C$5,Bogføring!$G:$G,A23)-SUMIFS(Bogføring!$H:$H,Bogføring!$B:$B,\">=\"&T!$C$4,Bogføring!$B:$B,\"<=\"&T!$C$5,Bogføring!$G:$G,A23)","v":0},null,null,null,null,1210,null,"Bælter"]
[1250,"Oplukker",{"$f":"SUMIFS(Bogføring!$I:$I,Bogføring!$B:$B,\">=\"&T!$C$4,Bogføring!$B:$B,\"<=\"&T!$C$5,Bogføring!$G:$G,A24)-SUMIFS(Bogføring!$H:$H,Bogføring!$B:$B,\">=\"&T!$C$4,Bogføring!$B:$B,\"<=\"&T!$C$5,Bogføring!$G:$G,A24)","v":0},null,null,null,null,1220,null,"Bogsalg"]
[1260,"Køleskabsmagneter",{"$f":"SUMIFS(Bogføring!$I:$I,Bogføring!$B:$B,\">=\"&T!$C$4,Bogføring!$B:$B,\"<=\"&T!$C$5,Bogføring!$G:$G,A25)-SUMIFS(Bogføring!$H:$H,Bogføring!$B:$B,\">=\"&T!$C$4,Bogføring!$B:$B,\"<=\"&T!$C$5,Bogføring!$G:$G,A25)","v":0},null,null,null,null,1230,null,"Færdige tinsoldater"]
[1270,"Postkort 3 stk.",{"$f":"SUMIFS(Bogføring!$I:$I,Bogføring!$B:$B,\">=\"&T!$C$4,Bogføring!$B:$B,\"<=\"&T!$C$5,Bogføring!$G:$G,A26)-SUMIFS(Bogføring!$H:$H,Bogføring!$B:$B,\">=\"&T!$C$4,Bogføring!$B:$B,\"<=\"&T!$C$5,Bogføring!$G:$G,A26)","v":0},null,null,null,null,1240,null,"Landkort og Plakater"]
[1280,"Postkort",{"$f":"SUMIFS(Bogføring!$I:$I,Bogføring!$B:$B,\">=\"&T!$C$4,Bogføring!$B:$B,\"<=\"&T!$C$5,Bogføring!$G:$G,A27)-SUMIFS(Bogføring!$H:$H,Bogføring!$B:$B,\">=\"&T!$C$4,Bogføring!$B:$B,\"<=\"&T!$C$5,Bogføring!$G:$G,A27)","v":0},null,null,null,null,1250,null,"Oplukker"]
[1290,"Sodavand",{"$f":"SUMIFS(Bogføring!$I:$I,Bogføring!$B:$B,\">=\"&T!$C$4,Bogføring!$B:$B,\"<=\"&T!$C$5,Bogføring!$G:$G,A28)-SUMIFS(Bogføring!$H:$H,Bogføring!$B:$B,\">=\"&T!$C$4,Bogføring!$B:$B,\"<=\"&T!$C$5,Bogføring!$G:$G,A28)","v":0},null,null,null,null,1260,null,"Køleskabsmagneter"]
[null,null,null,null,null,null,null,1270,null,"Postkort 3 stk."]
[null,null,null,null,null,null,null,1280,null,"Postkort 3 stk."]
[null,null,null,null,null,null,null,1290,null,"Sodavand"]
[1300,"Kage",{"$f":"SUMIFS(Bogføring!$I:$I,Bogføring!$B:$B,\">=\"&T!$C$4,Bogføring!$B:$B,\"<=\"&T!$C$5,Bogføring!$G:$G,A32)-SUMIFS(Bogføring!$H:$H,Bogføring!$B:$B,\">=\"&T!$C$4,Bogføring!$B:$B,\"<=\"&T!$C$5,Bogføring!$G:$G,A32)","v":0},null,null,null,{"$f":"SUM(C2:C18)","v":129864.45999999999},1300,null,"Kage"]
[2000,"Bankgebyr",{"$f":"SUMIFS(Bogføring!$H:$H,Bogføring!$B:$B,\">=\"&T!$C$4,Bogføring!$B:$B,\"<=\"&T!$C$5,Bogføring!$G:$G,A33)-SUMIFS(Bogføring!$I:$I,Bogføring!$B:$B,\">=\"&T!$C$4,Bogføring!$B:$B,\"<=\"&T!$C$5,Bogføring!$G:$G,A33)","v":109.5},null,null,null,null,2000]
[2005,"Gebyr Izettle",{"$f":"SUMIFS(Bogføring!$H:$H,Bogføring!$B:$B,\">=\"&T!$C$4,Bogføring!$B:$B,\"<=\"&T!$C$5,Bogføring!$G:$G,A34)-SUMIFS(Bogføring!$I:$I,Bogføring!$B:$B,\">=\"&T!$C$4,Bogføring!$B:$B,\"<=\"&T!$C$5,Bogføring!$G:$G,A34)","v":23.99},null,null,null,null,2010]
[2010,"Danløn",{"$f":"SUMIFS(Bogføring!$H:$H,Bogføring!$B:$B,\">=\"&T!$C$4,Bogføring!$B:$B,\"<=\"&T!$C$5,Bogføring!$G:$G,A35)-SUMIFS(Bogføring!$I:$I,Bogføring!$B:$B,\">=\"&T!$C$4,Bogføring!$B:$B,\"<=\"&T!$C$5,Bogføring!$G:$G,A35)","v":27.5},null,null,null,null,2020]
[2015,"Advokat",{"$f":"SUMIFS(Bogføring!$H:$H,Bogføring!$B:$B,\">=\"&T!$C$4,Bogføring!$B:$B,\"<=\"&T!$C$5,Bogføring!$G:$G,A36)-SUMIFS(Bogføring!$I:$I,Bogføring!$B:$B,\">=\"&T!$C$4,Bogføring!$B:$B,\"<=\"&T!$C$5,Bogføring!$G:$G,A36)","v":0},null,null,null,null,2030]
[2020,"Revision",{"$f":"SUMIFS(Bogføring!$H:$H,Bogføring!$B:$B,\">=\"&T!$C$4,Bogføring!$B:$B,\"<=\"&T!$C$5,Bogføring!$G:$G,A37)-SUMIFS(Bogføring!$I:$I,Bogføring!$B:$B,\">=\"&T!$C$4,Bogføring!$B:$B,\"<=\"&T!$C$5,Bogføring!$G:$G,A37)","v":0},null,null,null,null,2035,null,"Advokat"]
[2025,"Regnskabsservice",{"$f":"SUMIFS(Bogføring!$H:$H,Bogføring!$B:$B,\">=\"&T!$C$4,Bogføring!$B:$B,\"<=\"&T!$C$5,Bogføring!$G:$G,A38)-SUMIFS(Bogføring!$I:$I,Bogføring!$B:$B,\">=\"&T!$C$4,Bogføring!$B:$B,\"<=\"&T!$C$5,Bogføring!$G:$G,A38)","v":490.63},null,null,null,null,2040]
[2030,"Bygnings vedligehold",{"$f":"SUMIFS(Bogføring!$H:$H,Bogføring!$B:$B,\">=\"&T!$C$4,Bogføring!$B:$B,\"<=\"&T!$C$5,Bogføring!$G:$G,A39)-SUMIFS(Bogføring!$I:$I,Bogføring!$B:$B,\">=\"&T!$C$4,Bogføring!$B:$B,\"<=\"&T!$C$5,Bogføring!$G:$G,A39)","v":329.7},null,null,null,null,2050]
[2035,"Grønne områder",{"$f":"SUMIFS(Bogføring!$H:$H,Bogføring!$B:$B,\">=\"&T!$C$4,Bogføring!$B:$B,\"<=\"&T!$C$5,Bogføring!$G:$G,A40)-SUMIFS(Bogføring!$I:$I,Bogføring!$B:$B,\">=\"&T!$C$4,Bogføring!$B:$B,\"<=\"&T!$C$5,Bogføring!$G:$G,A40)","v":713.64},null,null,null,null,2060]
[2037,"Rengørringsartikler",{"$f":"SUMIFS(Bogføring!$H:$H,Bogføring!$B:$B,\">=\"&T!$C$4,Bogføring!$B:$B,\"<=\"&T!$C$5,Bogføring!$G:$G,A41)-SUMIFS(Bogføring!$I:$I,Bogføring!$B:$B,\">=\"&T!$C$4,Bogføring!$B:$B,\"<=\"&T!$C$5,Bogføring!$G:$G,A41)","v":0},null,null,null,null,2070]
[2040,"El, Vand og Varme",{"$f":"SUMIFS(Bogføring!$H:$H,Bogføring!$B:$B,\">=\"&T!$C$4,Bogføring!$B:$B,\"<=\"&T!$C$5,Bogføring!$G:$G,A42)-SUMIFS(Bogføring!$I:$I,Bogføring!$B:$B,\">=\"&T!$C$4,Bogføring!$B:$B,\"<=\"&T!$C$5,Bogføring!$G:$G,A42)","v":27955.019999999997},null,null,null,null,null,null,"Microsoft"]
[2050,"Deltagelse i GF i Andre Foren.",{"$f":"SUMIFS(Bogføring!$H:$H,Bogføring!$B:$B,\">=\"&T!$C$4,Bogføring!$B:$B,\"<=\"&T!$C$5,Bogføring!$G:$G,A43)-SUMIFS(Bogføring!$I:$I,Bogføring!$B:$B,\">=\"&T!$C$4,Bogføring!$B:$B,\"<=\"&T!$C$5,Bogføring!$G:$G,A43)","v":0},null,null,null,null,2080]
[2055,"Indkøb af øl + vand",{"$f":"SUMIFS(Bogføring!$H:$H,Bogføring!$B:$B,\">=\"&T!$C$4,Bogføring!$B:$B,\"<=\"&T!$C$5,Bogføring!$G:$G,A44)-SUMIFS(Bogføring!$I:$I,Bogføring!$B:$B,\">=\"&T!$C$4,Bogføring!$B:$B,\"<=\"&T!$C$5,Bogføring!$G:$G,A44)","v":0},null,null,null,null,2090]
[2060,"Internet, mobiltelefon, Forsik.",{"$f":"SUMIFS(Bogføring!$H:$H,Bogføring!$B:$B,\">=\"&T!$C$4,Bogføring!$B:$B,\"<=\"&T!$C$5,Bogføring!$G:$G,A45)-SUMIFS(Bogføring!$I:$I,Bogføring!$B:$B,\">=\"&T!$C$4,Bogføring!$B:$B,\"<=\"&T!$C$5,Bogføring!$G:$G,A45)","v":2230.96},null,null,null,null,2100,null,"havemaskiner"]
[2065,"Udstilling",{"$f":"SUMIFS(Bogføring!$H:$H,Bogføring!$B:$B,\">=\"&T!$C$4,Bogføring!$B:$B,\"<=\"&T!$C$5,Bogføring!$G:$G,A46)-SUMIFS(Bogføring!$I:$I,Bogføring!$B:$B,\">=\"&T!$C$4,Bogføring!$B:$B,\"<=\"&T!$C$5,Bogføring!$G:$G,A46)","v":11386.63},null,null,null,null,2110]
[2070,"Tin og sortkrudt",{"$f":"SUMIFS(Bogføring!$H:$H,Bogføring!$B:$B,\">=\"&T!$C$4,Bogføring!$B:$B,\"<=\"&T!$C$5,Bogføring!$G:$G,A47)-SUMIFS(Bogføring!$I:$I,Bogføring!$B:$B,\">=\"&T!$C$4,Bogføring!$B:$B,\"<=\"&T!$C$5,Bogføring!$G:$G,A47)","v":0}]
[2075,"Gaver",{"$f":"SUMIFS(Bogføring!$H:$H,Bogføring!$B:$B,\">=\"&T!$C$4,Bogføring!$B:$B,\"<=\"&T!$C$5,Bogføring!$G:$G,A48)-SUMIFS(Bogføring!$I:$I,Bogføring!$B:$B,\">=\"&T!$C$4,Bogføring!$B:$B,\"<=\"&T!$C$5,Bogføring!$G:$G,A48)","v":170},null,null,null,null,2120]
[2080,"Indkøb af bøger",{"$f":"SUMIFS(Bogføring!$H:$H,Bogføring!$B:$B,\">=\"&T!$C$4,Bogføring!$B:$B,\"<=\"&T!$C$5,Bogføring!$G:$G,A49)-SUMIFS(Bogføring!$I:$I,Bogføring!$B:$B,\">=\"&T!$C$4,Bogføring!$B:$B,\"<=\"&T!$C$5,Bogføring!$G:$G,A49)","v":1200},null,null,null,null,2130]
[2090,"Kontingent til andre Foreninger",{"$f":"SUMIFS(Bogføring!$H:$H,Bogføring!$B:$B,\">=\"&T!$C$4,Bogføring!$B:$B,\"<=\"&T!$C$5,Bogføring!$G:$G,A50)-SUMIFS(Bogføring!$I:$I,Bogføring!$B:$B,\">=\"&T!$C$4,Bogføring!$B:$B,\"<=\"&T!$C$5,Bogføring!$G:$G,A50)","v":100},null,null,null,null,2140]
[2100,"Forplejning til møder/Rejser",{"$f":"SUMIFS(Bogføring!$H:$H,Bogføring!$B:$B,\">=\"&T!$C$4,Bogføring!$B:$B,\"<=\"&T!$C$5,Bogføring!$G:$G,A51)-SUMIFS(Bogføring!$I:$I,Bogføring!$B:$B,\">=\"&T!$C$4,Bogføring!$B:$B,\"<=\"&T!$C$5,Bogføring!$G:$G,A51)","v":1405.25},null,null,null,null,2150]
[2110,"Kontorhold - Porto - IT",{"$f":"SUMIFS(Bogføring!$H:$H,Bogføring!$B:$B,\">=\"&T!$C$4,Bogføring!$B:$B,\"<=\"&T!$C$5,Bogføring!$G:$G,A52)-SUMIFS(Bogføring!$I:$I,Bogføring!$B:$B,\">=\"&T!$C$4,Bogføring!$B:$B,\"<=\"&T!$C$5,Bogføring!$G:$G,A52)","v":1483.4},null,null,null,null,2160]
[2120,"Hjemmeside",{"$f":"SUMIFS(Bogføring!$H:$H,Bogføring!$B:$B,\">=\"&T!$C$4,Bogføring!$B:$B,\"<=\"&T!$C$5,Bogføring!$G:$G,A53)-SUMIFS(Bogføring!$I:$I,Bogføring!$B:$B,\">=\"&T!$C$4,Bogføring!$B:$B,\"<=\"&T!$C$5,Bogføring!$G:$G,A53)","v":0},null,null,null,null,2170]
[2130,"Annoncer",{"$f":"SUMIFS(Bogføring!$H:$H,Bogføring!$B:$B,\">=\"&T!$C$4,Bogføring!$B:$B,\"<=\"&T!$C$5,Bogføring!$G:$G,A54)-SUMIFS(Bogføring!$I:$I,Bogføring!$B:$B,\">=\"&T!$C$4,Bogføring!$B:$B,\"<=\"&T!$C$5,Bogføring!$G:$G,A54)","v":2318.75},null,null,null,null,2180]
[2135,"Tryksager",{"$f":"SUMIFS(Bogføring!$H:$H,Bogføring!$B:$B,\">=\"&T!$C$4,Bogføring!$B:$B,\"<=\"&T!$C$5,Bogføring!$G:$G,A55)-SUMIFS(Bogføring!$I:$I,Bogføring!$B:$B,\">=\"&T!$C$4,Bogføring!$B:$B,\"<=\"&T!$C$5,Bogføring!$G:$G,A55)","v":0},null,null,null,null,2190]
[2140,"Kassedifferance",{"$f":"SUMIFS(Bogføring!$H:$H,Bogføring!$B:$B,\">=\"&T!$C$4,Bogføring!$B:$B,\"<=\"&T!$C$5,Bogføring!$G:$G,A56)-SUMIFS(Bogføring!$I:$I,Bogføring!$B:$B,\">=\"&T!$C$4,Bogføring!$B:$B,\"<=\"&T!$C$5,Bogføring!$G:$G,A56)","v":0},null,null,null,null,2200]
[2150,"Øreafrundning",{"$f":"SUMIFS(Bogføring!$H:$H,Bogføring!$B:$B,\">=\"&T!$C$4,Bogføring!$B:$B,\"<=\"&T!$C$5,Bogføring!$G:$G,A57)-SUMIFS(Bogføring!$I:$I,Bogføring!$B:$B,\">=\"&T!$C$4,Bogføring!$B:$B,\"<=\"&T!$C$5,Bogføring!$G:$G,A57)","v":0},null,null,null,null,2210]
[2160,"Rejser",{"$f":"SUMIFS(Bogføring!$H:$H,Bogføring!$B:$B,\">=\"&T!$C$4,Bogføring!$B:$B,\"<=\"&T!$C$5,Bogføring!$G:$G,A58)-SUMIFS(Bogføring!$I:$I,Bogføring!$B:$B,\">=\"&T!$C$4,Bogføring!$B:$B,\"<=\"&T!$C$5,Bogføring!$G:$G,A58)","v":0},null,null,null,null,2220]
[2165,"G4S tyverialarm",{"$f":"SUMIFS(Bogføring!$H:$H,Bogføring!$B:$B,\">=\"&T!$C$4,Bogføring!$B:$B,\"<=\"&T!$C$5,Bogføring!$G:$G,A59)-SUMIFS(Bogføring!$I:$I,Bogføring!$B:$B,\">=\"&T!$C$4,Bogføring!$B:$B,\"<=\"&T!$C$5,Bogføring!$G:$G,A59)","v":3785.94},null,null,null,null,2230]
[2166,"Forsikringer",{"$f":"SUMIFS(Bogføring!$H:$H,Bogføring!$B:$B,\">=\"&T!$C$4,Bogføring!$B:$B,\"<=\"&T!$C$5,Bogføring!$G:$G,A60)-SUMIFS(Bogføring!$I:$I,Bogføring!$B:$B,\">=\"&T!$C$4,Bogføring!$B:$B,\"<=\"&T!$C$5,Bogføring!$G:$G,A60)","v":7598.9},null,null,null,null,2240]
[2170,"Afholdelse af GF",{"$f":"SUMIFS(Bogføring!$H:$H,Bogføring!$B:$B,\">=\"&T!$C$4,Bogføring!$B:$B,\"<=\"&T!$C$5,Bogføring!$G:$G,A61)-SUMIFS(Bogføring!$I:$I,Bogføring!$B:$B,\">=\"&T!$C$4,Bogføring!$B:$B,\"<=\"&T!$C$5,Bogføring!$G:$G,A61)","v":306.10000000000002},null,null,null,null,2250]
[2180,"Bestyrelses møder",{"$f":"SUMIFS(Bogføring!$H:$H,Bogføring!$B:$B,\">=\"&T!$C$4,Bogføring!$B:$B,\"<=\"&T!$C$5,Bogføring!$G:$G,A62)-SUMIFS(Bogføring!$I:$I,Bogføring!$B:$B,\">=\"&T!$C$4,Bogføring!$B:$B,\"<=\"&T!$C$5,Bogføring!$G:$G,A62)","v":0},null,null,null,null,2260]
[2190,"Diverse Udgifter",{"$f":"SUMIFS(Bogføring!$H:$H,Bogføring!$B:$B,\">=\"&T!$C$4,Bogføring!$B:$B,\"<=\"&T!$C$5,Bogføring!$G:$G,A63)-SUMIFS(Bogføring!$I:$I,Bogføring!$B:$B,\">=\"&T!$C$4,Bogføring!$B:$B,\"<=\"&T!$C$5,Bogføring!$G:$G,A63)","v":0},null,null,null,null,2270]
[2195,"Arkitekt",{"$f":"SUMIFS(Bogføring!$H:$H,Bogføring!$B:$B,\">=\"&T!$C$4,Bogføring!$B:$B,\"<=\"&T!$C$5,Bogføring!$G:$G,A64)-SUMIFS(Bogføring!$I:$I,Bogføring!$B:$B,\">=\"&T!$C$4,Bogføring!$B:$B,\"<=\"&T!$C$5,Bogføring!$G:$G,A64)","v":2500},null,null,null,null,2280]
[2200,"Kontingenter overført til KVB",{"$f":"SUMIFS(Bogføring!$H:$H,Bogføring!$B:$B,\">=\"&T!$C$4,Bogføring!$B:$B,\"<=\"&T!$C$5,Bogføring!$G:$G,A65)-SUMIFS(Bogføring!$I:$I,Bogføring!$B:$B,\">=\"&T!$C$4,Bogføring!$B:$B,\"<=\"&T!$C$5,Bogføring!$G:$G,A65)","v":0},null,null,null,null,2290]
[3100,"Lønomkostninger",{"$f":"SUMIFS(Bogføring!$H:$H,Bogføring!$B:$B,\">=\"&T!$C$4,Bogføring!$B:$B,\"<=\"&T!$C$5,Bogføring!$G:$G,A66)-SUMIFS(Bogføring!$I:$I,Bogføring!$B:$B,\">=\"&T!$C$4,Bogføring!$B:$B,\"<=\"&T!$C$5,Bogføring!$G:$G,A66)","v":0},null,null,null,null,2295,null,"xxxxxxx"]
[3110,"Lønninger incl ATP -AM",{"$f":"SUMIFS(Bogføring!$H:$H,Bogføring!$B:$B,\">=\"&T!$C$4,Bogføring!$B:$B,\"<=\"&T!$C$5,Bogføring!$G:$G,A67)-SUMIFS(Bogføring!$I:$I,Bogføring!$B:$B,\">=\"&T!$C$4,Bogføring!$B:$B,\"<=\"&T!$C$5,Bogføring!$G:$G,A67)","v":40800},null,null,null,null,2300]
[3120,"ATP",{"$f":"SUMIFS(Bogføring!$H:$H,Bogføring!$B:$B,\">=\"&T!$C$4,Bogføring!$B:$B,\"<=\"&T!$C$5,Bogføring!$G:$G,A68)-SUMIFS(Bogføring!$I:$I,Bogføring!$B:$B,\">=\"&T!$C$4,Bogføring!$B:$B,\"<=\"&T!$C$5,Bogføring!$G:$G,A68)","v":820.3},null,null,null,null,2310]
[3125,"Samlet betaling",{"$f":"SUMIFS(Bogføring!$H:$H,Bogføring!$B:$B,\">=\"&T!$C$4,Bogføring!$B:$B,\"<=\"&T!$C$5,Bogføring!$G:$G,A69)-SUMIFS(Bogføring!$I:$I,Bogføring!$B:$B,\">=\"&T!$C$4,Bogføring!$B:$B,\"<=\"&T!$C$5,Bogføring!$G:$G,A69)","v":492.92},null,null,null,null,2320]
[3130,"A-skat & Am-bidrag",{"$f":"SUMIFS(Bogføring!$H:$H,Bogføring!$B:$B,\">=\"&T!$C$4,Bogføring!$B:$B,\"<=\"&T!$C$5,Bogføring!$G:$G,A70)-SUMIFS(Bogføring!$I:$I,Bogføring!$B:$B,\">=\"&T!$C$4,Bogføring!$B:$B,\"<=\"&T!$C$5,Bogføring!$G:$G,A70)","v":3664},null,null,null,null,2330]
[3135,"Gl. Skat og Gebyr",{"$f":"SUMIFS(Bogføring!$H:$H,Bogføring!$B:$B,\">=\"&T!$C$4,Bogføring!$B:$B,\"<=\"&T!$C$5,Bogføring!$G:$G,A71)-SUMIFS(Bogføring!$I:$I,Bogføring!$B:$B,\">=\"&T!$C$4,Bogføring!$B:$B,\"<=\"&T!$C$5,Bogføring!$G:$G,A71)","v":0},null,null,null,null,2340]
[3140,"Lønsum",{"$f":"SUMIFS(Bogføring!$H:$H,Bogføring!$B:$B,\">=\"&T!$C$4,Bogføring!$B:$B,\"<=\"&T!$C$5,Bogføring!$G:$G,A72)-SUMIFS(Bogføring!$I:$I,Bogføring!$B:$B,\">=\"&T!$C$4,Bogføring!$B:$B,\"<=\"&T!$C$5,Bogføring!$G:$G,A72)","v":0},null,null,null,null,3000]
[3150,"Indefrosne feriepenge",{"$f":"SUMIFS(Bogføring!$H:$H,Bogføring!$B:$B,\">=\"&T!$C$4,Bogføring!$B:$B,\"<=\"&T!$C$5,Bogføring!$G:$G,A73)-SUMIFS(Bogføring!$I:$I,Bogføring!$B:$B,\">=\"&T!$C$4,Bogføring!$B:$B,\"<=\"&T!$C$5,Bogføring!$G:$G,A73)","v":922.26},null,null,null,null,3010]
[null,null,{"$f":"SUMIFS(Bogføring!$H:$H,Bogføring!$B:$B,\">=\"&T!$C$4,Bogføring!$B:$B,\"<=\"&T!$C$5,Bogføring!$G:$G,A74)-SUMIFS(Bogføring!$I:$I,Bogføring!$B:$B,\">=\"&T!$C$4,Bogføring!$B:$B,\"<=\"&T!$C$5,Bogføring!$G:$G,A74)","v":0},null,null,null,{"$f":"SUM(C33:C72)","v":109913.13},3020]
[null,null,null,null,null,null,{"$f":"G32-G74","v":19951.329999999987}]
[12310,"Bank konto",{"$f":"SUMIFS(Bogføring!$H:$H,Bogføring!$B:$B,\">=\"&T!$C$4,Bogføring!$B:$B,\"<=\"&T!$C$5,Bogføring!$G:$G,A76)-SUMIFS(Bogføring!$I:$I,Bogføring!$B:$B,\">=\"&T!$C$4,Bogføring!$B:$B,\"<=\"&T!$C$5,Bogføring!$G:$G,A76)","v":21291.5},null,null,null,null,3030]
[12320,"Kasse",{"$f":"SUMIFS(Bogføring!$H:$H,Bogføring!$B:$B,\">=\"&T!$C$4,Bogføring!$B:$B,\"<=\"&T!$C$5,Bogføring!$G:$G,A77)-SUMIFS(Bogføring!$I:$I,Bogføring!$B:$B,\">=\"&T!$C$4,Bogføring!$B:$B,\"<=\"&T!$C$5,Bogføring!$G:$G,A77)","v":4736},null,null,null,null,3040]
[12330,"Egenkapital",{"$f":"SUMIFS(Bogføring!$I:$I,Bogføring!$B:$B,\">=\"&T!$C$4,Bogføring!$B:$B,\"<=\"&T!$C$5,Bogføring!$G:$G,A78)-SUMIFS(Bogføring!$H:$H,Bogføring!$B:$B,\">=\"&T!$C$4,Bogføring!$B:$B,\"<=\"&T!$C$5,Bogføring!$G:$G,A78)+G75","v":21961.169999999987}]
[null,null,{"$f":"SUMIFS(Bogføring!$H:$H,Bogføring!$B:$B,\">=\"&T!$C$4,Bogføring!$B:$B,\"<=\"&T!$C$5,Bogføring!$G:$G,A79)-SUMIFS(Bogføring!$I:$I,Bogføring!$B:$B,\">=\"&T!$C$4,Bogføring!$B:$B,\"<=\"&T!$C$5,Bogføring!$G:$G,A79)","v":0}]
[12360,"Skyldig A-skat",{"$f":"SUMIFS(Bogføring!$I:$I,Bogføring!$B:$B,\">=\"&T!$C$4,Bogføring!$B:$B,\"<=\"&T!$C$5,Bogføring!$G:$G,A80)-SUMIFS(Bogføring!$H:$H,Bogføring!$B:$B,\">=\"&T!$C$4,Bogføring!$B:$B,\"<=\"&T!$C$5,Bogføring!$G:$G,A80)+F73","v":4219}]
[12361,"Skyldig AM ",{"$f":"SUMIFS(Bogføring!$I:$I,Bogføring!$B:$B,\">=\"&T!$C$4,Bogføring!$B:$B,\"<=\"&T!$C$5,Bogføring!$G:$G,A81)-SUMIFS(Bogføring!$H:$H,Bogføring!$B:$B,\">=\"&T!$C$4,Bogføring!$B:$B,\"<=\"&T!$C$5,Bogføring!$G:$G,A81)+F74","v":797}]
[12362,"Skyldig ATP",{"$f":"SUMIFS(Bogføring!$I:$I,Bogføring!$B:$B,\">=\"&T!$C$4,Bogføring!$B:$B,\"<=\"&T!$C$5,Bogføring!$G:$G,A82)-SUMIFS(Bogføring!$H:$H,Bogføring!$B:$B,\">=\"&T!$C$4,Bogføring!$B:$B,\"<=\"&T!$C$5,Bogføring!$G:$G,A82)+F75","v":378.60000000000008}]
[12364,"Skyldig feriepenge",{"$f":"SUMIFS(Bogføring!$I:$I,Bogføring!$B:$B,\">=\"&T!$C$4,Bogføring!$B:$B,\"<=\"&T!$C$5,Bogføring!$G:$G,A83)-SUMIFS(Bogføring!$H:$H,Bogføring!$B:$B,\">=\"&T!$C$4,Bogføring!$B:$B,\"<=\"&T!$C$5,Bogføring!$G:$G,A83)","v":800}]
[12365,"Forudbetalt omk.",{"$f":"SUMIFS(Bogføring!$I:$I,Bogføring!$B:$B,\">=\"&T!$C$4,Bogføring!$B:$B,\"<=\"&T!$C$5,Bogføring!$G:$G,A84)-SUMIFS(Bogføring!$H:$H,Bogføring!$B:$B,\">=\"&T!$C$4,Bogføring!$B:$B,\"<=\"&T!$C$5,Bogføring!$G:$G,A84)+F77","v":0}]
[12370,"Forudbetalt kontingent",{"$f":"SUMIFS(Bogføring!$I:$I,Bogføring!$B:$B,\">=\"&T!$C$4,Bogføring!$B:$B,\"<=\"&T!$C$5,Bogføring!$G:$G,A85)-SUMIFS(Bogføring!$H:$H,Bogføring!$B:$B,\">=\"&T!$C$4,Bogføring!$B:$B,\"<=\"&T!$C$5,Bogføring!$G:$G,A85)+F78","v":0}]
[12380,"Banklån",{"$f":"SUMIFS(Bogføring!$I:$I,Bogføring!$B:$B,\">=\"&T!$C$4,Bogføring!$B:$B,\"<=\"&T!$C$5,Bogføring!$G:$G,A86)-SUMIFS(Bogføring!$H:$H,Bogføring!$B:$B,\">=\"&T!$C$4,Bogføring!$B:$B,\"<=\"&T!$C$5,Bogføring!$G:$G,A86)+F79","v":0}]
[12390,"Andre Lån",{"$f":"SUMIFS(Bogføring!$I:$I,Bogføring!$B:$B,\">=\"&T!$C$4,Bogføring!$B:$B,\"<=\"&T!$C$5,Bogføring!$G:$G,A87)-SUMIFS(Bogføring!$H:$H,Bogføring!$B:$B,\">=\"&T!$C$4,Bogføring!$B:$B,\"<=\"&T!$C$5,Bogføring!$G:$G,A87)+F80","v":0}]
[12400,"Kreditorer samler konto",{"$f":"SUMIFS(Bogføring!$H:$H,Bogføring!$B:$B,\">=\"&T!$C$4,Bogføring!$B:$B,\"<=\"&T!$C$5,Bogføring!$G:$G,A88)-SUMIFS(Bogføring!$I:$I,Bogføring!$B:$B,\">=\"&T!$C$4,Bogføring!$B:$B,\"<=\"&T!$C$5,Bogføring!$G:$G,A88)","v":0},null,12370,12390]
[]
[12410,"Tilgodehavende Kontingenter",{"$f":"SUMIFS(Bogføring!$I:$I,Bogføring!$B:$B,\">=\"&T!$C$4,Bogføring!$B:$B,\"<=\"&T!$C$5,Bogføring!$G:$G,A90)-SUMIFS(Bogføring!$H:$H,Bogføring!$B:$B,\">=\"&T!$C$4,Bogføring!$B:$B,\"<=\"&T!$C$5,Bogføring!$G:$G,A90)+F86","v":0}]
[12420,null,{"$f":"SUMIFS(Bogføring!$I:$I,Bogføring!$B:$B,\">=\"&T!$C$4,Bogføring!$B:$B,\"<=\"&T!$C$5,Bogføring!$G:$G,A91)-SUMIFS(Bogføring!$H:$H,Bogføring!$B:$B,\">=\"&T!$C$4,Bogføring!$B:$B,\"<=\"&T!$C$5,Bogføring!$G:$G,A91)+F87","v":0}]
[12430,"Tilgode PayPal",{"$f":"SUMIFS(Bogføring!$I:$I,Bogføring!$B:$B,\">=\"&T!$C$4,Bogføring!$B:$B,\"<=\"&T!$C$5,Bogføring!$G:$G,A92)-SUMIFS(Bogføring!$H:$H,Bogføring!$B:$B,\">=\"&T!$C$4,Bogføring!$B:$B,\"<=\"&T!$C$5,Bogføring!$G:$G,A92)","v":-1206.01}]
[12500,"Debitorer samler konto",{"$f":"SUM(C90:C91)","v":0},null,12410,12420]

{"sheet":"Regnskab GF","index":2,"n_rows":46,"n_cols":6,"rows_kept":46,"cut":false,"hidden":true,"merged":[[1,0,1,6],[35,0,35,6],[20,0,20,5]]}
[]
["REGNSKAB FOR 3. ORDINÆRE GENERALFORSAMLING 13.01.18. "]
[]
[null,null,null,"Indtægt","Udgift","Resultat"]
["41 Kuv. Gule ærter/Stroganof",null,null,6450,3772]
["41 øl",null,null,null,430]
["Kaffe, småkager",null,null,null,64]
["12 Morgenmad inkl. bestyrelse",null,null,470,410]
["Værelser (10 enheder)",null,null,1125,784.16]
["Duge, servietter m.m.",null,null,null,611]
["Salg af 79 øl",null,null,1580]
["Salg af 27 snaps",null,null,540]
["Salg af 8 vand",null,null,80]
["11 mærker",null,null,550]
[null,null,null,null,0]
[null,null,null,null,0]
[null,null,null,null,0]
["Gave til ",null,null,null,0]
["I alt",null,null,{"$f":"SUM(D5:D18)","v":10795},{"$f":"SUM(E5:E18)","v":6071.16},{"$f":"D19-E19","v":4723.84}]
[]
["Salget på denne generalforsamling har vist sig at passe perfekt - det stemmer på øren - og det er dejligt. Ved optælling af beholdning af øl og snaps, er der 30 øl og lidt snaps, til næste arrangement."]
[]
[]
[null,null,null,"Indtægt","Udgift","TOTAL"]
["Kontant fra festen indsat i bank",null,null,null,null,2750]
[]
["Salg af 11 klister/stofmærker",null,null,550]
["Salg af 79 øl og 27 snaps = 106",null,null,2120]
["Salg af 8 vand",null,null,80]
["I alt",null,null,{"$f":"SUM(D27:D29)","v":2750},null,2750]
["Overskud",null,null,null,null,{"$f":"F25-F30","v":0}]
[]
[]
[]
[]
["Der er overskud af snaps til næste Generalforsamling, samt 30 øl til brug ved et senere arrangement. Som det fremgår er der ingen udgift til øl, da disse er købt i okt 2017 og indgår i 2017 regnskabet, ligesom snaps, da der var overskud fra sidste generalforsamlingdet indhentet u/b."]
[]
[]
[]
[]
[]
[]
[]
[]
[]
["Jens P. Christoffersson - formand"]

{"sheet":"Medlemsliste","index":3,"n_rows":180,"n_cols":30,"rows_kept":180,"cut":false,"hidden":true,"merged":[[5,39,5,41],[7,39,7,41],[0,0,3,8],[3,9,4,9],[0,9,0,10],[1,9,1,10],[2,9,2,10],[3,39,3,41],[4,39,4,41],[0,12,2,12]]}
[{"$f":"\"Medlemsliste for \"&T!B9","v":"Medlemsliste for xxxxxxxxxxxxx"},null,null,null,null,null,null,null,null," Antal medlemmer : ",null,{"$f":"COUNT(A5:A189)","v":155},null,{"$f":"COUNT($A:$A)","v":155},null,{"$f":"COUNT($A:$A)","v":155},null,{"$f":"COUNT($A:$A)","v":155},null,{"$f":"COUNT($A:$A)","v":155}]
[null,null,null,null,null,null,null,null,null," Betalende medlemmer : ",null,{"$f":"COUNTIF(L6:L190,\">0\")+1","v":1},null,{"$f":"COUNTIF(M:M,\">0\")","v":0},null,{"$f":"COUNTIF(O:O,\">0\")","v":0},null,{"$f":"COUNTIF(Q:Q,\">0\")","v":0},null,{"$f":"COUNTIF(S:S,\">0\")","v":0}]
[null,null,null,null,null,null,null,null,null,"Rest : ",null,{"$f":"L1-L2-3","v":151},null,{"$f":"N1-N2","v":155},null,{"$f":"P1-P2","v":155},null,{"$f":"R1-R2","v":155},null,{"$f":"T1-T2","v":155}]
[null,null,null,null,null,null,null,null,null,"Medl.nr. :",null,{"$f":"DATE(L5,4,1)","v":"2020-04-01"},null,{"$f":"DATE(N5,4,1)","v":"2021-04-01"},null,"2022-04-01",null,"2023-04-01",null,"2024-04-01",null,"2025-04-01",null,"2026-04-01",null,"2027-04-01",null,"2028-04-01",null,"2029-04-01"]
["Medl.nr. :","NAVN","ADRESSE ","POSTNR","By","TELEFON","E-MAIL","Indmeldt","Bemærkning:",null,"Bet. Dato",2020,"Bet. Dato",2021,null,2022,null,2023,null,2024,null,2025,null,2026,null,2027,null,2028,null,2029]
[1,"Jens P. Christoffersson ","Højvangsparken 8 st. 1.",3700,"Rønne",40373460,"jp.stoffer.555@gmail.com",null,"Formand, Medlem af FU ",{"$f":"IF(A6=\"\",\"\",A6)","v":1},{"$f":"IF(L6=0,\"\",INDEX(Bogføring!$B:$B,MATCH(Tabel2[[#This Row],[Medl.nr. :]],Bogføring!$E:$E,0),0))","v":""},{"$f":"SUMIFS(Bogføring!I:I,Bogføring!F:F,\"=\"&$L$5,Bogføring!E:E,\"=\"&A6)","v":0},{"$f":"IF(N6=0,\"\",SUMIFS(Bogføring!$B:$B,Bogføring!$F:$F,\"=\"&$N$5,Bogføring!$E:$E,\"=\"&A6))","v":""},{"$f":"SUMIFS(Bogføring!I:I,Bogføring!F:F,\"=\"&$N$5,Bogføring!E:E,\"=\"&A6)","v":0},{"$f":"IF(P6=0,\"\",SUMIFS(Bogføring!$B:$B,Bogføring!$F:$F,\"=\"&$P$5,Bogføring!$E:$E,\"=\"&A6))","v":""},{"$f":"SUMIFS(Bogføring!$I:$I,Bogføring!$F:$F,\"=\"&$P$5,Bogføring!$E:$E,\"=\"&A6)","v":0},{"$f":"IF(R6=0,\"\",SUMIFS(Bogføring!$B:$B,Bogføring!$F:$F,\"=\"&$R$5,Bogføring!$E:$E,\"=\"&A6))","v":""},{"$f":"SUMIFS(Bogføring!$I:$I,Bogføring!$F:$F,\"=\"&$R$5,Bogføring!$E:$E,\"=\"&A6)","v":0},{"$f":"IF(T6=0,\"\",SUMIFS(Bogføring!$B:$B,Bogføring!$F:$F,\"=\"&$T$5,Bogføring!$E:$E,\"=\"&A6))","v":""},{"$f":"SUMIFS(Bogføring!$I:$I,Bogføring!$F:$F,\"=\"&$T$5,Bogføring!$E:$E,\"=\"&A6)","v":0},null,{"$f":"SUMIFS(Bogføring!$I:$I,Bogføring!$F:$F,\"=\"&$V$5,Bogføring!$E:$E,\"=\"&A6)","v":0},null,{"$f":"SUMIFS(Bogføring!$I:$I,Bogføring!$F:$F,\"=\"&$X$5,Bogføring!$E:$E,\"=\"&A6)","v":0},null,{"$f":"SUMIFS(Bogføring!$I:$I,Bogføring!$F:$F,\"=\"&$Z$5,Bogføring!$E:$E,\"=\"&A6)","v":0},null,{"$f":"SUMIFS(Bogføring!$I:$I,Bogføring!$F:$F,\"=\"&$AB$5,Bogføring!$E:$E,\"=\"&A6)","v":0},null,{"$f":"SUMIFS(Bogføring!$I:$I,Bogføring!$F:$F,\"=\"&$AD$5,Bogføring!$E:$E,\"=\"&A6)","v":0}]
[2,"Jens Chr. Skaarup","Hedningestræde 1",3700,"Rønne",21240945,"bjskaarup@gmail.com",null,"Næstformand, Medlem af FU",2,{"$f":"IF(L7=0,\"\",INDEX(Bogføring!$B:$B,MATCH(Tabel2[[#This Row],[Medl.nr. :]],Bogføring!$E:$E,0),0))","v":""},{"$f":"SUMIFS(Bogføring!I:I,Bogføring!F:F,\"=\"&$L$5,Bogføring!E:E,\"=\"&A7)","v":0},{"$f":"IF(N7=0,\"\",SUMIFS(Bogføring!B:B,Bogføring!F:F,\"=\"&$N$5,Bogføring!E:E,\"=\"&A7))","v":""},{"$f":"SUMIFS(Bogføring!I:I,Bogføring!F:F,\"=\"&$N$5,Bogføring!E:E,\"=\"&A7)","v":0},{"$f":"IF(N7=0,\"\",SUMIFS(Bogføring!$B:$B,Bogføring!$F:$F,\"=\"&$P$5,Bogføring!$E:$E,\"=\"&A7))","v":""},{"$f":"SUMIFS(Bogføring!$I:$I,Bogføring!$F:$F,\"=\"&$P$5,Bogføring!$E:$E,\"=\"&A7)","v":0}]
[3,"Jens Ole Ipsen Fassel","Smedegård, Kirkedalsvej 17, Rutsker",3700,"Rønne",56969798,"f@ssel.dk",null,"Bestyrelsesmedlem",3,{"$f":"IF(L8=0,\"\",INDEX(Bogføring!$B:$B,MATCH(Tabel2[[#This Row],[Medl.nr. :]],Bogføring!$E:$E,0),0))","v":""},{"$f":"SUMIFS(Bogføring!I:I,Bogføring!F:F,\"=\"&$L$5,Bogføring!E:E,\"=\"&A8)","v":0},{"$f":"IF(N8=0,\"\",SUMIFS(Bogføring!B:B,Bogføring!F:F,\"=\"&$N$5,Bogføring!E:E,\"=\"&A8))","v":""},{"$f":"SUMIFS(Bogføring!I:I,Bogføring!F:F,\"=\"&$N$5,Bogføring!E:E,\"=\"&A8)","v":0},{"$f":"IF(N8=0,\"\",SUMIFS(Bogføring!$B:$B,Bogføring!$F:$F,\"=\"&$P$5,Bogføring!$E:$E,\"=\"&A8))","v":""},{"$f":"SUMIFS(Bogføring!$I:$I,Bogføring!$F:$F,\"=\"&$P$5,Bogføring!$E:$E,\"=\"&A8)","v":0}]
[4,"Finn Kjerulff Hansen","Sigurdsgade 13",3700,"Rønne",30254320,"fkh.segen@gmail.com",null,"Sekretær, Medlem af FU",4,{"$f":"IF(L9=0,\"\",INDEX(Bogføring!$B:$B,MATCH(Tabel2[[#This Row],[Medl.nr. :]],Bogføring!$E:$E,0),0))","v":""},{"$f":"SUMIFS(Bogføring!I:I,Bogføring!F:F,\"=\"&$L$5,Bogføring!E:E,\"=\"&A9)","v":0},{"$f":"IF(N9=0,\"\",SUMIFS(Bogføring!B:B,Bogføring!F:F,\"=\"&$N$5,Bogføring!E:E,\"=\"&A9))","v":""},{"$f":"SUMIFS(Bogføring!I:I,Bogføring!F:F,\"=\"&$N$5,Bogføring!E:E,\"=\"&A9)","v":0},{"$f":"IF(N9=0,\"\",SUMIFS(Bogføring!$B:$B,Bogføring!$F:$F,\"=\"&$P$5,Bogføring!$E:$E,\"=\"&A9))","v":""},{"$f":"SUMIFS(Bogføring!$I:$I,Bogføring!$F:$F,\"=\"&$P$5,Bogføring!$E:$E,\"=\"&A9)","v":0}]
[5,"Stefan Erik Asp","Thorkildsvej 43, 2. th.",3700,"Rønne",23820033,"stefan_easp@hotmail.com",null,"Web&Marketing, Medlem af FU",5,{"$f":"IF(L10=0,\"\",INDEX(Bogføring!$B:$B,MATCH(Tabel2[[#This Row],[Medl.nr. :]],Bogføring!$E:$E,0),0))","v":""},{"$f":"SUMIFS(Bogføring!I:I,Bogføring!F:F,\"=\"&$L$5,Bogføring!E:E,\"=\"&A10)","v":0},{"$f":"IF(N10=0,\"\",SUMIFS(Bogføring!B:B,Bogføring!F:F,\"=\"&$N$5,Bogføring!E:E,\"=\"&A10))","v":""},{"$f":"SUMIFS(Bogføring!I:I,Bogføring!F:F,\"=\"&$N$5,Bogføring!E:E,\"=\"&A10)","v":0},{"$f":"IF(N10=0,\"\",SUMIFS(Bogføring!$B:$B,Bogføring!$F:$F,\"=\"&$P$5,Bogføring!$E:$E,\"=\"&A10))","v":""},{"$f":"SUMIFS(Bogføring!$I:$I,Bogføring!$F:$F,\"=\"&$P$5,Bogføring!$E:$E,\"=\"&A10)","v":0}]
[6,"Henrik Frost Rasmussen","Bøgeløkken 5",3700,"Rønne",21260931,"frost_rasmussen@mail.tele.dk",null,"Bestyrelsesmedlem",6,{"$f":"IF(L11=0,\"\",INDEX(Bogføring!$B:$B,MATCH(Tabel2[[#This Row],[Medl.nr. :]],Bogføring!$E:$E,0),0))","v":""},{"$f":"SUMIFS(Bogføring!I:I,Bogføring!F:F,\"=\"&$L$5,Bogføring!E:E,\"=\"&A11)","v":0},{"$f":"IF(N11=0,\"\",SUMIFS(Bogføring!B:B,Bogføring!F:F,\"=\"&$N$5,Bogføring!E:E,\"=\"&A11))","v":""},{"$f":"SUMIFS(Bogføring!I:I,Bogføring!F:F,\"=\"&$N$5,Bogføring!E:E,\"=\"&A11)","v":0},{"$f":"IF(N11=0,\"\",SUMIFS(Bogføring!$B:$B,Bogføring!$F:$F,\"=\"&$P$5,Bogføring!$E:$E,\"=\"&A11))","v":""},{"$f":"SUMIFS(Bogføring!$I:$I,Bogføring!$F:$F,\"=\"&$P$5,Bogføring!$E:$E,\"=\"&A11)","v":0}]
[7,"Henrik Vensild","Storegade 29",3700,"Rønne",21254190,"h.vensild@mail.dk",null,"Bestyrelsesmedlem",7,{"$f":"IF(L12=0,\"\",INDEX(Bogføring!$B:$B,MATCH(Tabel2[[#This Row],[Medl.nr. :]],Bogføring!$E:$E,0),0))","v":""},{"$f":"SUMIFS(Bogføring!I:I,Bogføring!F:F,\"=\"&$L$5,Bogføring!E:E,\"=\"&A12)","v":0},{"$f":"IF(N12=0,\"\",SUMIFS(Bogføring!B:B,Bogføring!F:F,\"=\"&$N$5,Bogføring!E:E,\"=\"&A12))","v":""},{"$f":"SUMIFS(Bogføring!I:I,Bogføring!F:F,\"=\"&$N$5,Bogføring!E:E,\"=\"&A12)","v":0},{"$f":"IF(N12=0,\"\",SUMIFS(Bogføring!$B:$B,Bogføring!$F:$F,\"=\"&$P$5,Bogføring!$E:$E,\"=\"&A12))","v":""},{"$f":"SUMIFS(Bogføring!$I:$I,Bogføring!$F:$F,\"=\"&$P$5,Bogføring!$E:$E,\"=\"&A12)","v":0}]
[8,"Jacob Bjerring-Hansen","Bh. Museum, Sct. Mortensgade 29",3700,"Rønne",25601164,"jbh@bornholmsmuseum.dk",null,"Udpeget bestyrelssmedlem",8,{"$f":"IF(L13=0,\"\",INDEX(Bogføring!$B:$B,MATCH(Tabel2[[#This Row],[Medl.nr. :]],Bogføring!$E:$E,0),0))","v":""},{"$f":"SUMIFS(Bogføring!I:I,Bogføring!F:F,\"=\"&$L$5,Bogføring!E:E,\"=\"&A13)","v":0},{"$f":"IF(N13=0,\"\",SUMIFS(Bogføring!B:B,Bogføring!F:F,\"=\"&$N$5,Bogføring!E:E,\"=\"&A13))","v":""},{"$f":"SUMIFS(Bogføring!I:I,Bogføring!F:F,\"=\"&$N$5,Bogføring!E:E,\"=\"&A13)","v":0},{"$f":"IF(N13=0,\"\",SUMIFS(Bogføring!$B:$B,Bogføring!$F:$F,\"=\"&$P$5,Bogføring!$E:$E,\"=\"&A13))","v":""},{"$f":"SUMIFS(Bogføring!$I:$I,Bogføring!$F:$F,\"=\"&$P$5,Bogføring!$E:$E,\"=\"&A13)","v":0}]
[9,"Torben Hedeman Petersen ","GSE, Almegårds Kaserne",3700,"Rønne",24654997,"ghr-3b-gse01@mil.dk",null,"Udpeget bestyrelsesmedlem",9,{"$f":"IF(L14=0,\"\",INDEX(Bogføring!$B:$B,MATCH(Tabel2[[#This Row],[Medl.nr. :]],Bogføring!$E:$E,0),0))","v":""},{"$f":"SUMIFS(Bogføring!I:I,Bogføring!F:F,\"=\"&$L$5,Bogføring!E:E,\"=\"&A14)","v":0},{"$f":"IF(N14=0,\"\",SUMIFS(Bogføring!B:B,Bogføring!F:F,\"=\"&$N$5,Bogføring!E:E,\"=\"&A14))","v":""},{"$f":"SUMIFS(Bogføring!I:I,Bogføring!F:F,\"=\"&$N$5,Bogføring!E:E,\"=\"&A14)","v":0},{"$f":"IF(N14=0,\"\",SUMIFS(Bogføring!$B:$B,Bogføring!$F:$F,\"=\"&$P$5,Bogføring!$E:$E,\"=\"&A14))","v":""},{"$f":"SUMIFS(Bogføring!$I:$I,Bogføring!$F:$F,\"=\"&$P$5,Bogføring!$E:$E,\"=\"&A14)","v":0}]
[10,"Poul E. T. Figa ","Møllebakken 21 A",3740,"Svaneke",51515550,"petfiga@gmail.com",null,"Udpeget bestyrelsesmedlem",10,{"$f":"IF(L15=0,\"\",INDEX(Bogføring!$B:$B,MATCH(Tabel2[[#This Row],[Medl.nr. :]],Bogføring!$E:$E,0),0))","v":""},{"$f":"SUMIFS(Bogføring!I:I,Bogføring!F:F,\"=\"&$L$5,Bogføring!E:E,\"=\"&A15)","v":0},{"$f":"IF(N15=0,\"\",SUMIFS(Bogføring!B:B,Bogføring!F:F,\"=\"&$N$5,Bogføring!E:E,\"=\"&A15))","v":""},{"$f":"SUMIFS(Bogføring!I:I,Bogføring!F:F,\"=\"&$N$5,Bogføring!E:E,\"=\"&A15)","v":0},{"$f":"IF(N15=0,\"\",SUMIFS(Bogføring!$B:$B,Bogføring!$F:$F,\"=\"&$P$5,Bogføring!$E:$E,\"=\"&A15))","v":""},{"$f":"SUMIFS(Bogføring!$I:$I,Bogføring!$F:$F,\"=\"&$P$5,Bogføring!$E:$E,\"=\"&A15)","v":0}]
[11,"Bjarne Hansen                                            ","Lyrsbyvej 31",3751,"Østermarie",40212694,"bjarne-hansen@outlook.dk",null,"Kasserer, Medlem af FU",11,{"$f":"IF(L16=0,\"\",INDEX(Bogføring!$B:$B,MATCH(Tabel2[[#This Row],[Medl.nr. :]],Bogføring!$E:$E,0),0))","v":""},{"$f":"SUMIFS(Bogføring!I:I,Bogføring!F:F,\"=\"&$L$5,Bogføring!E:E,\"=\"&A16)","v":0},{"$f":"IF(N16=0,\"\",SUMIFS(Bogføring!B:B,Bogføring!F:F,\"=\"&$N$5,Bogføring!E:E,\"=\"&A16))","v":""},{"$f":"SUMIFS(Bogføring!I:I,Bogføring!F:F,\"=\"&$N$5,Bogføring!E:E,\"=\"&A16)","v":0},{"$f":"IF(N16=0,\"\",SUMIFS(Bogføring!$B:$B,Bogføring!$F:$F,\"=\"&$P$5,Bogføring!$E:$E,\"=\"&A16))","v":""},{"$f":"SUMIFS(Bogføring!$I:$I,Bogføring!$F:$F,\"=\"&$P$5,Bogføring!$E:$E,\"=\"&A16)","v":0}]
[12,"Jakob Pii","Østerled 20",3700,"Rønne",null,"pii@mil.dk",null,"Bilagskontrollant",12,{"$f":"IF(L17=0,\"\",INDEX(Bogføring!$B:$B,MATCH(Tabel2[[#This Row],[Medl.nr. :]],Bogføring!$E:$E,0),0))","v":""},{"$f":"SUMIFS(Bogføring!I:I,Bogføring!F:F,\"=\"&$L$5,Bogføring!E:E,\"=\"&A17)","v":0},{"$f":"IF(N17=0,\"\",SUMIFS(Bogføring!B:B,Bogføring!F:F,\"=\"&$N$5,Bogføring!E:E,\"=\"&A17))","v":""},{"$f":"SUMIFS(Bogføring!I:I,Bogføring!F:F,\"=\"&$N$5,Bogføring!E:E,\"=\"&A17)","v":0},{"$f":"IF(N17=0,\"\",SUMIFS(Bogføring!$B:$B,Bogføring!$F:$F,\"=\"&$P$5,Bogføring!$E:$E,\"=\"&A17))","v":""},{"$f":"SUMIFS(Bogføring!$I:$I,Bogføring!$F:$F,\"=\"&$P$5,Bogføring!$E:$E,\"=\"&A17)","v":0}]
[13,"Kai Platz ","Sandgade 8",3700,"Rønne",null,"kaiplatz@mail.dk",null,"ÆRESMEDLEM - Bilagskontrollant",13,{"$f":"IF(L18=0,\"\",INDEX(Bogføring!$B:$B,MATCH(Tabel2[[#This Row],[Medl.nr. :]],Bogføring!$E:$E,0),0))","v":""},{"$f":"SUMIFS(Bogføring!I:I,Bogføring!F:F,\"=\"&$L$5,Bogføring!E:E,\"=\"&A18)","v":0},{"$f":"IF(N18=0,\"\",SUMIFS(Bogføring!B:B,Bogføring!F:F,\"=\"&$N$5,Bogføring!E:E,\"=\"&A18))","v":""},{"$f":"SUMIFS(Bogføring!I:I,Bogføring!F:F,\"=\"&$N$5,Bogføring!E:E,\"=\"&A18)","v":0},{"$f":"IF(N18=0,\"\",SUMIFS(Bogføring!$B:$B,Bogføring!$F:$F,\"=\"&$P$5,Bogføring!$E:$E,\"=\"&A18))","v":""},{"$f":"SUMIFS(Bogføring!$I:$I,Bogføring!$F:$F,\"=\"&$P$5,Bogføring!$E:$E,\"=\"&A18)","v":0}]
[14,"Maud og Tom West","Sølunden 4",3700,"Rønne",null,"sbfmw@mail.dk",null,"Maud, Bilagskontrollantsuppleant",14,{"$f":"IF(L19=0,\"\",INDEX(Bogføring!$B:$B,MATCH(Tabel2[[#This Row],[Medl.nr. :]],Bogføring!$E:$E,0),0))","v":""},{"$f":"SUMIFS(Bogføring!I:I,Bogføring!F:F,\"=\"&$L$5,Bogføring!E:E,\"=\"&A19)","v":0},{"$f":"IF(N19=0,\"\",SUMIFS(Bogføring!B:B,Bogføring!F:F,\"=\"&$N$5,Bogføring!E:E,\"=\"&A19))","v":""},{"$f":"SUMIFS(Bogføring!I:I,Bogføring!F:F,\"=\"&$N$5,Bogføring!E:E,\"=\"&A19)","v":0},{"$f":"IF(N19=0,\"\",SUMIFS(Bogføring!$B:$B,Bogføring!$F:$F,\"=\"&$P$5,Bogføring!$E:$E,\"=\"&A19))","v":""},{"$f":"SUMIFS(Bogføring!$I:$I,Bogføring!$F:$F,\"=\"&$P$5,Bogføring!$E:$E,\"=\"&A19)","v":0}]
[15,"Klaus Linnert ","Hedebovej 22, Knudsker",3700,"Rønne",51330033,"klaus@linnert.dk",null,"Museumsleder",15,{"$f":"IF(L20=0,\"\",INDEX(Bogføring!$B:$B,MATCH(Tabel2[[#This Row],[Medl.nr. :]],Bogføring!$E:$E,0),0))","v":""},{"$f":"SUMIFS(Bogføring!I:I,Bogføring!F:F,\"=\"&$L$5,Bogføring!E:E,\"=\"&A20)","v":0},{"$f":"IF(N20=0,\"\",SUMIFS(Bogføring!B:B,Bogføring!F:F,\"=\"&$N$5,Bogføring!E:E,\"=\"&A20))","v":""},{"$f":"SUMIFS(Bogføring!I:I,Bogføring!F:F,\"=\"&$N$5,Bogføring!E:E,\"=\"&A20)","v":0},{"$f":"IF(N20=0,\"\",SUMIFS(Bogføring!$B:$B,Bogføring!$F:$F,\"=\"&$P$5,Bogføring!$E:$E,\"=\"&A20))","v":""},{"$f":"SUMIFS(Bogføring!$I:$I,Bogføring!$F:$F,\"=\"&$P$5,Bogføring!$E:$E,\"=\"&A20)","v":0}]
[16,"Per A. Nielsen","Ingemannsvej 2, Listed",3740,"Svaneke",56496374,"signeogper@gmail.com",null,"ÆRESMEDLEM",16,{"$f":"IF(L21=0,\"\",INDEX(Bogføring!$B:$B,MATCH(Tabel2[[#This Row],[Medl.nr. :]],Bogføring!$E:$E,0),0))","v":""},{"$f":"SUMIFS(Bogføring!I:I,Bogføring!F:F,\"=\"&$L$5,Bogføring!E:E,\"=\"&A21)","v":0},{"$f":"IF(N21=0,\"\",SUMIFS(Bogføring!B:B,Bogføring!F:F,\"=\"&$N$5,Bogføring!E:E,\"=\"&A21))","v":""},{"$f":"SUMIFS(Bogføring!I:I,Bogføring!F:F,\"=\"&$N$5,Bogføring!E:E,\"=\"&A21)","v":0},{"$f":"IF(N21=0,\"\",SUMIFS(Bogføring!$B:$B,Bogføring!$F:$F,\"=\"&$P$5,Bogføring!$E:$E,\"=\"&A21))","v":""},{"$f":"SUMIFS(Bogføring!$I:$I,Bogføring!$F:$F,\"=\"&$P$5,Bogføring!$E:$E,\"=\"&A21)","v":0}]
[17,"Knud K. Pallesen","Weidekampsgade 29, 5.tv.",2300,"København S.",35391251,"kpallesen@gmail.com",null,null,17,{"$f":"IF(L22=0,\"\",INDEX(Bogføring!$B:$B,MATCH(Tabel2[[#This Row],[Medl.nr. :]],Bogføring!$E:$E,0),0))","v":""},{"$f":"SUMIFS(Bogføring!I:I,Bogføring!F:F,\"=\"&$L$5,Bogføring!E:E,\"=\"&A22)","v":0},{"$f":"IF(N22=0,\"\",SUMIFS(Bogføring!B:B,Bogføring!F:F,\"=\"&$N$5,Bogføring!E:E,\"=\"&A22))","v":""},{"$f":"SUMIFS(Bogføring!I:I,Bogføring!F:F,\"=\"&$N$5,Bogføring!E:E,\"=\"&A22)","v":0},{"$f":"IF(N22=0,\"\",SUMIFS(Bogføring!$B:$B,Bogføring!$F:$F,\"=\"&$P$5,Bogføring!$E:$E,\"=\"&A22))","v":""},{"$f":"SUMIFS(Bogføring!$I:$I,Bogføring!$F:$F,\"=\"&$P$5,Bogføring!$E:$E,\"=\"&A22)","v":0}]
[18,"Kristian Hofgaard","Kong Georgs Vej 54, I.tv.",2000,"Frederiksberg",null,"hofgaardkristian@gmail.com",null,null,18,{"$f":"IF(L23=0,\"\",INDEX(Bogføring!$B:$B,MATCH(Tabel2[[#This Row],[Medl.nr. :]],Bogføring!$E:$E,0),0))","v":""},{"$f":"SUMIFS(Bogføring!I:I,Bogføring!F:F,\"=\"&$L$5,Bogføring!E:E,\"=\"&A23)","v":0},{"$f":"IF(N23=0,\"\",SUMIFS(Bogføring!B:B,Bogføring!F:F,\"=\"&$N$5,Bogføring!E:E,\"=\"&A23))","v":""},{"$f":"SUMIFS(Bogføring!I:I,Bogføring!F:F,\"=\"&$N$5,Bogføring!E:E,\"=\"&A23)","v":0},{"$f":"IF(N23=0,\"\",SUMIFS(Bogføring!$B:$B,Bogføring!$F:$F,\"=\"&$P$5,Bogføring!$E:$E,\"=\"&A23))","v":""},{"$f":"SUMIFS(Bogføring!$I:$I,Bogføring!$F:$F,\"=\"&$P$5,Bogføring!$E:$E,\"=\"&A23)","v":0}]
[19,"Søren Bech Jensen","Østergade 46 b, ",3700,"Rønne",null,"sbjdansk@gmail.com",null,null,19,{"$f":"IF(L24=0,\"\",INDEX(Bogføring!$B:$B,MATCH(Tabel2[[#This Row],[Medl.nr. :]],Bogføring!$E:$E,0),0))","v":""},{"$f":"SUMIFS(Bogføring!I:I,Bogføring!F:F,\"=\"&$L$5,Bogføring!E:E,\"=\"&A24)","v":0},{"$f":"IF(N24=0,\"\",SUMIFS(Bogføring!B:B,Bogføring!F:F,\"=\"&$N$5,Bogføring!E:E,\"=\"&A24))","v":""},{"$f":"SUMIFS(Bogføring!I:I,Bogføring!F:F,\"=\"&$N$5,Bogføring!E:E,\"=\"&A24)","v":0},{"$f":"IF(N24=0,\"\",SUMIFS(Bogføring!$B:$B,Bogføring!$F:$F,\"=\"&$P$5,Bogføring!$E:$E,\"=\"&A24))","v":""},{"$f":"SUMIFS(Bogføring!$I:$I,Bogføring!$F:$F,\"=\"&$P$5,Bogføring!$E:$E,\"=\"&A24)","v":0}]
[20,"Peder Jon Andersen","Gartnerhaven 8",2800,"Kgs. Lyngby",null,"peajay@pc.dk",null,null,20,{"$f":"IF(L25=0,\"\",INDEX(Bogføring!$B:$B,MATCH(Tabel2[[#This Row],[Medl.nr. :]],Bogføring!$E:$E,0),0))","v":""},{"$f":"SUMIFS(Bogføring!I:I,Bogføring!F:F,\"=\"&$L$5,Bogføring!E:E,\"=\"&A25)","v":0},{"$f":"IF(N25=0,\"\",SUMIFS(Bogføring!B:B,Bogføring!F:F,\"=\"&$N$5,Bogføring!E:E,\"=\"&A25))","v":""},{"$f":"SUMIFS(Bogføring!I:I,Bogføring!F:F,\"=\"&$N$5,Bogføring!E:E,\"=\"&A25)","v":0},{"$f":"IF(N25=0,\"\",SUMIFS(Bogføring!$B:$B,Bogføring!$F:$F,\"=\"&$P$5,Bogføring!$E:$E,\"=\"&A25))","v":""},{"$f":"SUMIFS(Bogføring!$I:$I,Bogføring!$F:$F,\"=\"&$P$5,Bogføring!$E:$E,\"=\"&A25)","v":0}]
[21,"Kaj E. Boesen","Birkevej 20",3770,"Allinge",null,"kaje.boesen@gmail.com",null,"Frivillig",21,{"$f":"IF(L26=0,\"\",INDEX(Bogføring!$B:$B,MATCH(Tabel2[[#This Row],[Medl.nr. :]],Bogføring!$E:$E,0),0))","v":""},{"$f":"SUMIFS(Bogføring!I:I,Bogføring!F:F,\"=\"&$L$5,Bogføring!E:E,\"=\"&A26)","v":0},{"$f":"IF(N26=0,\"\",SUMIFS(Bogføring!B:B,Bogføring!F:F,\"=\"&$N$5,Bogføring!E:E,\"=\"&A26))","v":""},{"$f":"SUMIFS(Bogføring!I:I,Bogføring!F:F,\"=\"&$N$5,Bogføring!E:E,\"=\"&A26)","v":0},{"$f":"IF(N26=0,\"\",SUMIFS(Bogføring!$B:$B,Bogføring!$F:$F,\"=\"&$P$5,Bogføring!$E:$E,\"=\"&A26))","v":""},{"$f":"SUMIFS(Bogføring!$I:$I,Bogføring!$F:$F,\"=\"&$P$5,Bogføring!$E:$E,\"=\"&A26)","v":0}]
[22,"Jørn-Ole Lund","Borgmester Nielsensvej 84",3700,"Rønne",null,"jomlund@hotmail.com",null,"Pluggegårdsvej 25, Nyker",22,{"$f":"IF(L27=0,\"\",INDEX(Bogføring!$B:$B,MATCH(Tabel2[[#This Row],[Medl.nr. :]],Bogføring!$E:$E,0),0))","v":""},{"$f":"SUMIFS(Bogføring!I:I,Bogføring!F:F,\"=\"&$L$5,Bogføring!E:E,\"=\"&A27)","v":0},{"$f":"IF(N27=0,\"\",SUMIFS(Bogføring!B:B,Bogføring!F:F,\"=\"&$N$5,Bogføring!E:E,\"=\"&A27))","v":""},{"$f":"SUMIFS(Bogføring!I:I,Bogføring!F:F,\"=\"&$N$5,Bogføring!E:E,\"=\"&A27)","v":0},{"$f":"IF(N27=0,\"\",SUMIFS(Bogføring!$B:$B,Bogføring!$F:$F,\"=\"&$P$5,Bogføring!$E:$E,\"=\"&A27))","v":""},{"$f":"SUMIFS(Bogføring!$I:$I,Bogføring!$F:$F,\"=\"&$P$5,Bogføring!$E:$E,\"=\"&A27)","v":0}]
[23,"Henrik H. Poulsen","Kirkebyvej 46",3751,"Østermarie",null,"hhp@cabh.dk",null,null,23,{"$f":"IF(L28=0,\"\",INDEX(Bogføring!$B:$B,MATCH(Tabel2[[#This Row],[Medl.nr. :]],Bogføring!$E:$E,0),0))","v":""},{"$f":"SUMIFS(Bogføring!I:I,Bogføring!F:F,\"=\"&$L$5,Bogføring!E:E,\"=\"&A28)","v":0},{"$f":"IF(N28=0,\"\",SUMIFS(Bogføring!B:B,Bogføring!F:F,\"=\"&$N$5,Bogføring!E:E,\"=\"&A28))","v":""},{"$f":"SUMIFS(Bogføring!I:I,Bogføring!F:F,\"=\"&$N$5,Bogføring!E:E,\"=\"&A28)","v":0},{"$f":"IF(N28=0,\"\",SUMIFS(Bogføring!$B:$B,Bogføring!$F:$F,\"=\"&$P$5,Bogføring!$E:$E,\"=\"&A28))","v":""},{"$f":"SUMIFS(Bogføring!$I:$I,Bogføring!$F:$F,\"=\"&$P$5,Bogføring!$E:$E,\"=\"&A28)","v":0}]
[24,"Knud og Randi Veje","Teglgårdsvej 12",3700,"Rønne",null,"rkveje@pc.dk",null,null,24,{"$f":"IF(L29=0,\"\",INDEX(Bogføring!$B:$B,MATCH(Tabel2[[#This Row],[Medl.nr. :]],Bogføring!$E:$E,0),0))","v":""},{"$f":"SUMIFS(Bogføring!I:I,Bogføring!F:F,\"=\"&$L$5,Bogføring!E:E,\"=\"&A29)","v":0},{"$f":"IF(N29=0,\"\",SUMIFS(Bogføring!B:B,Bogføring!F:F,\"=\"&$N$5,Bogføring!E:E,\"=\"&A29))","v":""},{"$f":"SUMIFS(Bogføring!I:I,Bogføring!F:F,\"=\"&$N$5,Bogføring!E:E,\"=\"&A29)","v":0},{"$f":"IF(N29=0,\"\",SUMIFS(Bogføring!$B:$B,Bogføring!$F:$F,\"=\"&$P$5,Bogføring!$E:$E,\"=\"&A29))","v":""},{"$f":"SUMIFS(Bogføring!$I:$I,Bogføring!$F:$F,\"=\"&$P$5,Bogføring!$E:$E,\"=\"&A29)","v":0}]
[25,"John Bloch Andersen","Tornegård, Almegårdsvej 12",3700,"Rønne",21612882,"bloch44@hotmail.com",null,"Paradisvej 11, -10",25,{"$f":"IF(L30=0,\"\",INDEX(Bogføring!$B:$B,MATCH(Tabel2[[#This Row],[Medl.nr. :]],Bogføring!$E:$E,0),0))","v":""},{"$f":"SUMIFS(Bogføring!I:I,Bogføring!F:F,\"=\"&$L$5,Bogføring!E:E,\"=\"&A30)","v":0},{"$f":"IF(N30=0,\"\",SUMIFS(Bogføring!B:B,Bogføring!F:F,\"=\"&$N$5,Bogføring!E:E,\"=\"&A30))","v":""},{"$f":"SUMIFS(Bogføring!I:I,Bogføring!F:F,\"=\"&$N$5,Bogføring!E:E,\"=\"&A30)","v":0},{"$f":"IF(N30=0,\"\",SUMIFS(Bogføring!$B:$B,Bogføring!$F:$F,\"=\"&$P$5,Bogføring!$E:$E,\"=\"&A30))","v":""},{"$f":"SUMIFS(Bogføring!$I:$I,Bogføring!$F:$F,\"=\"&$P$5,Bogføring!$E:$E,\"=\"&A30)","v":0}]
[26,"Margrethe & Jørn Birk","Sdr. Landevej 47, Aaker",3720,"Åkirkeby",56974743,"aakervvs@os.dk",null,null,26,{"$f":"IF(L31=0,\"\",INDEX(Bogføring!$B:$B,MATCH(Tabel2[[#This Row],[Medl.nr. :]],Bogføring!$E:$E,0),0))","v":""},{"$f":"SUMIFS(Bogføring!I:I,Bogføring!F:F,\"=\"&$L$5,Bogføring!E:E,\"=\"&A31)","v":0},{"$f":"IF(N31=0,\"\",SUMIFS(Bogføring!B:B,Bogføring!F:F,\"=\"&$N$5,Bogføring!E:E,\"=\"&A31))","v":""},{"$f":"SUMIFS(Bogføring!I:I,Bogføring!F:F,\"=\"&$N$5,Bogføring!E:E,\"=\"&A31)","v":0},{"$f":"IF(N31=0,\"\",SUMIFS(Bogføring!$B:$B,Bogføring!$F:$F,\"=\"&$P$5,Bogføring!$E:$E,\"=\"&A31))","v":""},{"$f":"SUMIFS(Bogføring!$I:$I,Bogføring!$F:$F,\"=\"&$P$5,Bogføring!$E:$E,\"=\"&A31)","v":0}]
[27,"Helge Holst","Bramsnæslund 12 Ejby",4070,"Kirke Hylling",null,"helgeaholst@gmail.com",null,null,27,{"$f":"IF(L32=0,\"\",INDEX(Bogføring!$B:$B,MATCH(Tabel2[[#This Row],[Medl.nr. :]],Bogføring!$E:$E,0),0))","v":""},{"$f":"SUMIFS(Bogføring!I:I,Bogføring!F:F,\"=\"&$L$5,Bogføring!E:E,\"=\"&A32)","v":0},{"$f":"IF(N32=0,\"\",SUMIFS(Bogføring!B:B,Bogføring!F:F,\"=\"&$N$5,Bogføring!E:E,\"=\"&A32))","v":""},{"$f":"SUMIFS(Bogføring!I:I,Bogføring!F:F,\"=\"&$N$5,Bogføring!E:E,\"=\"&A32)","v":0},{"$f":"IF(N32=0,\"\",SUMIFS(Bogføring!$B:$B,Bogføring!$F:$F,\"=\"&$P$5,Bogføring!$E:$E,\"=\"&A32))","v":""},{"$f":"SUMIFS(Bogføring!$I:$I,Bogføring!$F:$F,\"=\"&$P$5,Bogføring!$E:$E,\"=\"&A32)","v":0}]
[28,"Lars T. Jensen","Poul Ankersvej 17",3700,"Rønne",null,"bltjacn@gmail.com",null,null,28,{"$f":"IF(L33=0,\"\",INDEX(Bogføring!$B:$B,MATCH(Tabel2[[#This Row],[Medl.nr. :]],Bogføring!$E:$E,0),0))","v":""},{"$f":"SUMIFS(Bogføring!I:I,Bogføring!F:F,\"=\"&$L$5,Bogføring!E:E,\"=\"&A33)","v":0},{"$f":"IF(N33=0,\"\",SUMIFS(Bogføring!B:B,Bogføring!F:F,\"=\"&$N$5,Bogføring!E:E,\"=\"&A33))","v":""},{"$f":"SUMIFS(Bogføring!I:I,Bogføring!F:F,\"=\"&$N$5,Bogføring!E:E,\"=\"&A33)","v":0},{"$f":"IF(N33=0,\"\",SUMIFS(Bogføring!$B:$B,Bogføring!$F:$F,\"=\"&$P$5,Bogføring!$E:$E,\"=\"&A33))","v":""},{"$f":"SUMIFS(Bogføring!$I:$I,Bogføring!$F:$F,\"=\"&$P$5,Bogføring!$E:$E,\"=\"&A33)","v":0}]
[30,"Grethe og Finn J.H. Carlsen","Brøndshøj 7",3700,"Rønne",56950212,"finnc@post12.tele.dk",null,null,30,{"$f":"IF(L34=0,\"\",INDEX(Bogføring!$B:$B,MATCH(Tabel2[[#This Row],[Medl.nr. :]],Bogføring!$E:$E,0),0))","v":""},{"$f":"SUMIFS(Bogføring!I:I,Bogføring!F:F,\"=\"&$L$5,Bogføring!E:E,\"=\"&A34)","v":0},{"$f":"IF(N34=0,\"\",SUMIFS(Bogføring!B:B,Bogføring!F:F,\"=\"&$N$5,Bogføring!E:E,\"=\"&A34))","v":""},{"$f":"SUMIFS(Bogføring!I:I,Bogføring!F:F,\"=\"&$N$5,Bogføring!E:E,\"=\"&A34)","v":0},{"$f":"IF(N34=0,\"\",SUMIFS(Bogføring!$B:$B,Bogføring!$F:$F,\"=\"&$P$5,Bogføring!$E:$E,\"=\"&A34))","v":""},{"$f":"SUMIFS(Bogføring!$I:$I,Bogføring!$F:$F,\"=\"&$P$5,Bogføring!$E:$E,\"=\"&A34)","v":0}]
[31,"Ivar Jørgensen","Havnebryggen 1",3740,"Svaneke",null,"havnebryggen@gmail.com",null,null,31,{"$f":"IF(L35=0,\"\",INDEX(Bogføring!$B:$B,MATCH(Tabel2[[#This Row],[Medl.nr. :]],Bogføring!$E:$E,0),0))","v":""},{"$f":"SUMIFS(Bogføring!I:I,Bogføring!F:F,\"=\"&$L$5,Bogføring!E:E,\"=\"&A35)","v":0},{"$f":"IF(N35=0,\"\",SUMIFS(Bogføring!B:B,Bogføring!F:F,\"=\"&$N$5,Bogføring!E:E,\"=\"&A35))","v":""},{"$f":"SUMIFS(Bogføring!I:I,Bogføring!F:F,\"=\"&$N$5,Bogføring!E:E,\"=\"&A35)","v":0},{"$f":"IF(N35=0,\"\",SUMIFS(Bogføring!$B:$B,Bogføring!$F:$F,\"=\"&$P$5,Bogføring!$E:$E,\"=\"&A35))","v":""},{"$f":"SUMIFS(Bogføring!$I:$I,Bogføring!$F:$F,\"=\"&$P$5,Bogføring!$E:$E,\"=\"&A35)","v":0}]
[32,"Carsten Gjessing","Kirkepladsen 6",3700,"Rønne",null,"oz4cg@post3.tele.dk",null,null,32,{"$f":"IF(L36=0,\"\",INDEX(Bogføring!$B:$B,MATCH(Tabel2[[#This Row],[Medl.nr. :]],Bogføring!$E:$E,0),0))","v":""},{"$f":"SUMIFS(Bogføring!I:I,Bogføring!F:F,\"=\"&$L$5,Bogføring!E:E,\"=\"&A36)","v":0},{"$f":"IF(N36=0,\"\",SUMIFS(Bogføring!B:B,Bogføring!F:F,\"=\"&$N$5,Bogføring!E:E,\"=\"&A36))","v":""},{"$f":"SUMIFS(Bogføring!I:I,Bogføring!F:F,\"=\"&$N$5,Bogføring!E:E,\"=\"&A36)","v":0},{"$f":"IF(N36=0,\"\",SUMIFS(Bogføring!$B:$B,Bogføring!$F:$F,\"=\"&$P$5,Bogføring!$E:$E,\"=\"&A36))","v":""},{"$f":"SUMIFS(Bogføring!$I:$I,Bogføring!$F:$F,\"=\"&$P$5,Bogføring!$E:$E,\"=\"&A36)","v":0}]
[33,"Jan Kristiansen","Bækken 21",3700,"Rønne",null,"jandor51@youmail.dk",null,"Solbakkevej 4",33,{"$f":"IF(L37=0,\"\",INDEX(Bogføring!$B:$B,MATCH(Tabel2[[#This Row],[Medl.nr. :]],Bogføring!$E:$E,0),0))","v":""},{"$f":"SUMIFS(Bogføring!I:I,Bogføring!F:F,\"=\"&$L$5,Bogføring!E:E,\"=\"&A37)","v":0},{"$f":"IF(N37=0,\"\",SUMIFS(Bogføring!B:B,Bogføring!F:F,\"=\"&$N$5,Bogføring!E:E,\"=\"&A37))","v":""},{"$f":"SUMIFS(Bogføring!I:I,Bogføring!F:F,\"=\"&$N$5,Bogføring!E:E,\"=\"&A37)","v":0},{"$f":"IF(N37=0,\"\",SUMIFS(Bogføring!$B:$B,Bogføring!$F:$F,\"=\"&$P$5,Bogføring!$E:$E,\"=\"&A37))","v":""},{"$f":"SUMIFS(Bogføring!$I:$I,Bogføring!$F:$F,\"=\"&$P$5,Bogføring!$E:$E,\"=\"&A37)","v":0}]
[34,"Elin og Hans Jørgen Brandt","Præstegårdsvejen 7, Vestermarie",3700,"Rønne",null,"maresoe@hotmail.com",null,null,{"$f":"IF(A38=\"\",\"\",A38)","v":34},{"$f":"IF(L38=0,\"\",INDEX(Bogføring!$B:$B,MATCH(Tabel2[[#This Row],[Medl.nr. :]],Bogføring!$E:$E,0),0))","v":""},{"$f":"SUMIFS(Bogføring!I:I,Bogføring!F:F,\"=\"&$L$5,Bogføring!E:E,\"=\"&A38)","v":0},{"$f":"IF(N38=0,\"\",SUMIFS(Bogføring!B:B,Bogføring!F:F,\"=\"&$N$5,Bogføring!E:E,\"=\"&A38))","v":""},{"$f":"SUMIFS(Bogføring!I:I,Bogføring!F:F,\"=\"&$N$5,Bogføring!E:E,\"=\"&A38)","v":0},{"$f":"IF(N38=0,\"\",SUMIFS(Bogføring!$B:$B,Bogføring!$F:$F,\"=\"&$P$5,Bogføring!$E:$E,\"=\"&A38))","v":""},{"$f":"SUMIFS(Bogføring!$I:$I,Bogføring!$F:$F,\"=\"&$P$5,Bogføring!$E:$E,\"=\"&A38)","v":0}]
[35,"Niels Chr. Garde","Mulebyvej 24",3700,"Rønne",null,"niels-garde@hotmail.com",null,null,35,{"$f":"IF(L39=0,\"\",INDEX(Bogføring!$B:$B,MATCH(Tabel2[[#This Row],[Medl.nr. :]],Bogføring!$E:$E,0),0))","v":""},{"$f":"SUMIFS(Bogføring!I:I,Bogføring!F:F,\"=\"&$L$5,Bogføring!E:E,\"=\"&A39)","v":0},{"$f":"IF(N39=0,\"\",SUMIFS(Bogføring!B:B,Bogføring!F:F,\"=\"&$N$5,Bogføring!E:E,\"=\"&A39))","v":""},{"$f":"SUMIFS(Bogføring!I:I,Bogføring!F:F,\"=\"&$N$5,Bogføring!E:E,\"=\"&A39)","v":0},{"$f":"IF(N39=0,\"\",SUMIFS(Bogføring!$B:$B,Bogføring!$F:$F,\"=\"&$P$5,Bogføring!$E:$E,\"=\"&A39))","v":""},{"$f":"SUMIFS(Bogføring!$I:$I,Bogføring!$F:$F,\"=\"&$P$5,Bogføring!$E:$E,\"=\"&A39)","v":0}]
[36,"Connie og Flemming Lykke Koch","Møllevænget 11, Nyker",3700,"Rønne",20186030,"flkoch@outlook.com",null,null,36,{"$f":"IF(L40=0,\"\",INDEX(Bogføring!$B:$B,MATCH(Tabel2[[#This Row],[Medl.nr. :]],Bogføring!$E:$E,0),0))","v":""},{"$f":"SUMIFS(Bogføring!I:I,Bogføring!F:F,\"=\"&$L$5,Bogføring!E:E,\"=\"&A40)","v":0},{"$f":"IF(N40=0,\"\",SUMIFS(Bogføring!B:B,Bogføring!F:F,\"=\"&$N$5,Bogføring!E:E,\"=\"&A40))","v":""},{"$f":"SUMIFS(Bogføring!I:I,Bogføring!F:F,\"=\"&$N$5,Bogføring!E:E,\"=\"&A40)","v":0},{"$f":"IF(N40=0,\"\",SUMIFS(Bogføring!$B:$B,Bogføring!$F:$F,\"=\"&$P$5,Bogføring!$E:$E,\"=\"&A40))","v":""},{"$f":"SUMIFS(Bogføring!$I:$I,Bogføring!$F:$F,\"=\"&$P$5,Bogføring!$E:$E,\"=\"&A40)","v":0}]
[37,"Erik Andersen","Malmøvej 26",3700,"Rønne",null,"erik-ag@mail.dk ",null,null,37,{"$f":"IF(L41=0,\"\",INDEX(Bogføring!$B:$B,MATCH(Tabel2[[#This Row],[Medl.nr. :]],Bogføring!$E:$E,0),0))","v":""},{"$f":"SUMIFS(Bogføring!I:I,Bogføring!F:F,\"=\"&$L$5,Bogføring!E:E,\"=\"&A41)","v":0},{"$f":"IF(N41=0,\"\",SUMIFS(Bogføring!B:B,Bogføring!F:F,\"=\"&$N$5,Bogføring!E:E,\"=\"&A41))","v":""},{"$f":"SUMIFS(Bogføring!I:I,Bogføring!F:F,\"=\"&$N$5,Bogføring!E:E,\"=\"&A41)","v":0},{"$f":"IF(N41=0,\"\",SUMIFS(Bogføring!$B:$B,Bogføring!$F:$F,\"=\"&$P$5,Bogføring!$E:$E,\"=\"&A41))","v":""},{"$f":"SUMIFS(Bogføring!$I:$I,Bogføring!$F:$F,\"=\"&$P$5,Bogføring!$E:$E,\"=\"&A41)","v":0}]
[38,"Holger Pii","Byvangen 37",3700,"Rønne",null,"hpii@city.dk",null,null,38,{"$f":"IF(L42=0,\"\",INDEX(Bogføring!$B:$B,MATCH(Tabel2[[#This Row],[Medl.nr. :]],Bogføring!$E:$E,0),0))","v":""},{"$f":"SUMIFS(Bogføring!I:I,Bogføring!F:F,\"=\"&$L$5,Bogføring!E:E,\"=\"&A42)","v":0},{"$f":"IF(N42=0,\"\",SUMIFS(Bogføring!B:B,Bogføring!F:F,\"=\"&$N$5,Bogføring!E:E,\"=\"&A42))","v":""},{"$f":"SUMIFS(Bogføring!I:I,Bogføring!F:F,\"=\"&$N$5,Bogføring!E:E,\"=\"&A42)","v":0},{"$f":"IF(N42=0,\"\",SUMIFS(Bogføring!$B:$B,Bogføring!$F:$F,\"=\"&$P$5,Bogføring!$E:$E,\"=\"&A42))","v":""},{"$f":"SUMIFS(Bogføring!$I:$I,Bogføring!$F:$F,\"=\"&$P$5,Bogføring!$E:$E,\"=\"&A42)","v":0}]
[39,"Bente Kofod","Østergade 44 C",3700,"Rønne",24402236,"bhkofod@email.dk",null,null,39,{"$f":"IF(L43=0,\"\",INDEX(Bogføring!$B:$B,MATCH(Tabel2[[#This Row],[Medl.nr. :]],Bogføring!$E:$E,0),0))","v":""},{"$f":"SUMIFS(Bogføring!I:I,Bogføring!F:F,\"=\"&$L$5,Bogføring!E:E,\"=\"&A43)","v":0},{"$f":"IF(N43=0,\"\",SUMIFS(Bogføring!B:B,Bogføring!F:F,\"=\"&$N$5,Bogføring!E:E,\"=\"&A43))","v":""},{"$f":"SUMIFS(Bogføring!I:I,Bogføring!F:F,\"=\"&$N$5,Bogføring!E:E,\"=\"&A43)","v":0},{"$f":"IF(N43=0,\"\",SUMIFS(Bogføring!$B:$B,Bogføring!$F:$F,\"=\"&$P$5,Bogføring!$E:$E,\"=\"&A43))","v":""},{"$f":"SUMIFS(Bogføring!$I:$I,Bogføring!$F:$F,\"=\"&$P$5,Bogføring!$E:$E,\"=\"&A43)","v":0}]
[40,"Jens Baunsgaard","Teglkåsvej 36, Rutsker",3790,"Hasle",null,"j_baunsgaard@hotmail.com",null,null,40,{"$f":"IF(L44=0,\"\",INDEX(Bogføring!$B:$B,MATCH(Tabel2[[#This Row],[Medl.nr. :]],Bogføring!$E:$E,0),0))","v":""},{"$f":"SUMIFS(Bogføring!I:I,Bogføring!F:F,\"=\"&$L$5,Bogføring!E:E,\"=\"&A44)","v":0},{"$f":"IF(N44=0,\"\",SUMIFS(Bogføring!B:B,Bogføring!F:F,\"=\"&$N$5,Bogføring!E:E,\"=\"&A44))","v":""},{"$f":"SUMIFS(Bogføring!I:I,Bogføring!F:F,\"=\"&$N$5,Bogføring!E:E,\"=\"&A44)","v":0},{"$f":"IF(N44=0,\"\",SUMIFS(Bogføring!$B:$B,Bogføring!$F:$F,\"=\"&$P$5,Bogføring!$E:$E,\"=\"&A44))","v":""},{"$f":"SUMIFS(Bogføring!$I:$I,Bogføring!$F:$F,\"=\"&$P$5,Bogføring!$E:$E,\"=\"&A44)","v":0}]
[41,"Charlotte Henriksen","Malmøvej 7",3700,"Rønne",null,"kim.charlotte@stofanet.dk",2018,null,41,{"$f":"IF(L45=0,\"\",INDEX(Bogføring!$B:$B,MATCH(Tabel2[[#This Row],[Medl.nr. :]],Bogføring!$E:$E,0),0))","v":""},{"$f":"SUMIFS(Bogføring!I:I,Bogføring!F:F,\"=\"&$L$5,Bogføring!E:E,\"=\"&A45)","v":0},{"$f":"IF(N45=0,\"\",SUMIFS(Bogføring!B:B,Bogføring!F:F,\"=\"&$N$5,Bogføring!E:E,\"=\"&A45))","v":""},{"$f":"SUMIFS(Bogføring!I:I,Bogføring!F:F,\"=\"&$N$5,Bogføring!E:E,\"=\"&A45)","v":0},{"$f":"IF(N45=0,\"\",SUMIFS(Bogføring!$B:$B,Bogføring!$F:$F,\"=\"&$P$5,Bogføring!$E:$E,\"=\"&A45))","v":""},{"$f":"SUMIFS(Bogføring!$I:$I,Bogføring!$F:$F,\"=\"&$P$5,Bogføring!$E:$E,\"=\"&A45)","v":0}]
[42,"Hanne og Sten Hueg","Sofienborg, Lynggårdsvej 11, Olsker",3770,"Allinge",null,"sfhueg@godmail.dk",null,null,42,{"$f":"IF(L46=0,\"\",INDEX(Bogføring!$B:$B,MATCH(Tabel2[[#This Row],[Medl.nr. :]],Bogføring!$E:$E,0),0))","v":""},{"$f":"SUMIFS(Bogføring!I:I,Bogføring!F:F,\"=\"&$L$5,Bogføring!E:E,\"=\"&A46)","v":0},{"$f":"IF(N46=0,\"\",SUMIFS(Bogføring!B:B,Bogføring!F:F,\"=\"&$N$5,Bogføring!E:E,\"=\"&A46))","v":""},{"$f":"SUMIFS(Bogføring!I:I,Bogføring!F:F,\"=\"&$N$5,Bogføring!E:E,\"=\"&A46)","v":0},{"$f":"IF(N46=0,\"\",SUMIFS(Bogføring!$B:$B,Bogføring!$F:$F,\"=\"&$P$5,Bogføring!$E:$E,\"=\"&A46))","v":""},{"$f":"SUMIFS(Bogføring!$I:$I,Bogføring!$F:$F,\"=\"&$P$5,Bogføring!$E:$E,\"=\"&A46)","v":0}]
[43,"Zarina Tina Sose","Pilestræde 18",3700,"Rønne",null,"zizisose@outlook.dk",null,"Frivillig",43,{"$f":"IF(L47=0,\"\",INDEX(Bogføring!$B:$B,MATCH(Tabel2[[#This Row],[Medl.nr. :]],Bogføring!$E:$E,0),0))","v":""},{"$f":"SUMIFS(Bogføring!I:I,Bogføring!F:F,\"=\"&$L$5,Bogføring!E:E,\"=\"&A47)","v":0},{"$f":"IF(N47=0,\"\",SUMIFS(Bogføring!B:B,Bogføring!F:F,\"=\"&$N$5,Bogføring!E:E,\"=\"&A47))","v":""},{"$f":"SUMIFS(Bogføring!I:I,Bogføring!F:F,\"=\"&$N$5,Bogføring!E:E,\"=\"&A47)","v":0},{"$f":"IF(N47=0,\"\",SUMIFS(Bogføring!$B:$B,Bogføring!$F:$F,\"=\"&$P$5,Bogføring!$E:$E,\"=\"&A47))","v":""},{"$f":"SUMIFS(Bogføring!$I:$I,Bogføring!$F:$F,\"=\"&$P$5,Bogføring!$E:$E,\"=\"&A47)","v":0}]
[44,"Ole Bramsgaard","Borgergade 11",3700,"Rønne",21647153,"ole@bramsgaard.dk",null,null,44,{"$f":"IF(L48=0,\"\",INDEX(Bogføring!$B:$B,MATCH(Tabel2[[#This Row],[Medl.nr. :]],Bogføring!$E:$E,0),0))","v":""},{"$f":"SUMIFS(Bogføring!I:I,Bogføring!F:F,\"=\"&$L$5,Bogføring!E:E,\"=\"&A48)","v":0},{"$f":"IF(N48=0,\"\",SUMIFS(Bogføring!B:B,Bogføring!F:F,\"=\"&$N$5,Bogføring!E:E,\"=\"&A48))","v":""},{"$f":"SUMIFS(Bogføring!I:I,Bogføring!F:F,\"=\"&$N$5,Bogføring!E:E,\"=\"&A48)","v":0},{"$f":"IF(N48=0,\"\",SUMIFS(Bogføring!$B:$B,Bogføring!$F:$F,\"=\"&$P$5,Bogføring!$E:$E,\"=\"&A48))","v":""},{"$f":"SUMIFS(Bogføring!$I:$I,Bogføring!$F:$F,\"=\"&$P$5,Bogføring!$E:$E,\"=\"&A48)","v":0}]
[45,"Hanne Bærild Jacobsen","St. Torvegade 58",3700,"Rønne",null,"hbj0940@gmail.com",null,null,45,{"$f":"IF(L49=0,\"\",INDEX(Bogføring!$B:$B,MATCH(Tabel2[[#This Row],[Medl.nr. :]],Bogføring!$E:$E,0),0))","v":""},{"$f":"SUMIFS(Bogføring!I:I,Bogføring!F:F,\"=\"&$L$5,Bogføring!E:E,\"=\"&A49)","v":0},{"$f":"IF(N49=0,\"\",SUMIFS(Bogføring!B:B,Bogføring!F:F,\"=\"&$N$5,Bogføring!E:E,\"=\"&A49))","v":""},{"$f":"SUMIFS(Bogføring!I:I,Bogføring!F:F,\"=\"&$N$5,Bogføring!E:E,\"=\"&A49)","v":0},{"$f":"IF(N49=0,\"\",SUMIFS(Bogføring!$B:$B,Bogføring!$F:$F,\"=\"&$P$5,Bogføring!$E:$E,\"=\"&A49))","v":""},{"$f":"SUMIFS(Bogføring!$I:$I,Bogføring!$F:$F,\"=\"&$P$5,Bogføring!$E:$E,\"=\"&A49)","v":0}]
[46,"Anne og Niels-Kristian Pii","Langholmen 3",2630,"Tåstrup",null,"anne.pii@mail.dk",null,null,46,{"$f":"IF(L50=0,\"\",INDEX(Bogføring!$B:$B,MATCH(Tabel2[[#This Row],[Medl.nr. :]],Bogføring!$E:$E,0),0))","v":""},{"$f":"SUMIFS(Bogføring!I:I,Bogføring!F:F,\"=\"&$L$5,Bogføring!E:E,\"=\"&A50)","v":0},{"$f":"IF(N50=0,\"\",SUMIFS(Bogføring!B:B,Bogføring!F:F,\"=\"&$N$5,Bogføring!E:E,\"=\"&A50))","v":""},{"$f":"SUMIFS(Bogføring!I:I,Bogføring!F:F,\"=\"&$N$5,Bogføring!E:E,\"=\"&A50)","v":0},{"$f":"IF(N50=0,\"\",SUMIFS(Bogføring!$B:$B,Bogføring!$F:$F,\"=\"&$P$5,Bogføring!$E:$E,\"=\"&A50))","v":""},{"$f":"SUMIFS(Bogføring!$I:$I,Bogføring!$F:$F,\"=\"&$P$5,Bogføring!$E:$E,\"=\"&A50)","v":0}]
[47,"Arne V. Hansen","Gyldengårdsvej 5",3700,"Rønne",null,"arne.v@hansen.mail.dk",null,null,47,{"$f":"IF(L51=0,\"\",INDEX(Bogføring!$B:$B,MATCH(Tabel2[[#This Row],[Medl.nr. :]],Bogføring!$E:$E,0),0))","v":""},{"$f":"SUMIFS(Bogføring!I:I,Bogføring!F:F,\"=\"&$L$5,Bogføring!E:E,\"=\"&A51)","v":0},{"$f":"IF(N51=0,\"\",SUMIFS(Bogføring!B:B,Bogføring!F:F,\"=\"&$N$5,Bogføring!E:E,\"=\"&A51))","v":""},{"$f":"SUMIFS(Bogføring!I:I,Bogføring!F:F,\"=\"&$N$5,Bogføring!E:E,\"=\"&A51)","v":0},{"$f":"IF(N51=0,\"\",SUMIFS(Bogføring!$B:$B,Bogføring!$F:$F,\"=\"&$P$5,Bogføring!$E:$E,\"=\"&A51))","v":""},{"$f":"SUMIFS(Bogføring!$I:$I,Bogføring!$F:$F,\"=\"&$P$5,Bogføring!$E:$E,\"=\"&A51)","v":0}]
[48,"Marian og Holger Juul-Pedersen","Bagergade 1",3700,"Rønne",null,"juul-pedersen@hotmail.dk",null,null,48,{"$f":"IF(L52=0,\"\",INDEX(Bogføring!$B:$B,MATCH(Tabel2[[#This Row],[Medl.nr. :]],Bogføring!$E:$E,0),0))","v":""},{"$f":"SUMIFS(Bogføring!I:I,Bogføring!F:F,\"=\"&$L$5,Bogføring!E:E,\"=\"&A52)","v":0},{"$f":"IF(N52=0,\"\",SUMIFS(Bogføring!B:B,Bogføring!F:F,\"=\"&$N$5,Bogføring!E:E,\"=\"&A52))","v":""},{"$f":"SUMIFS(Bogføring!I:I,Bogføring!F:F,\"=\"&$N$5,Bogføring!E:E,\"=\"&A52)","v":0},{"$f":"IF(N52=0,\"\",SUMIFS(Bogføring!$B:$B,Bogføring!$F:$F,\"=\"&$P$5,Bogføring!$E:$E,\"=\"&A52))","v":""},{"$f":"SUMIFS(Bogføring!$I:$I,Bogføring!$F:$F,\"=\"&$P$5,Bogføring!$E:$E,\"=\"&A52)","v":0}]
[49,"C.U. Essemann-Beck","Sejersvej 29",3700,"Rønne",56955329,"essebeck3@gmail.com",null,null,49,{"$f":"IF(L53=0,\"\",INDEX(Bogføring!$B:$B,MATCH(Tabel2[[#This Row],[Medl.nr. :]],Bogføring!$E:$E,0),0))","v":""},{"$f":"SUMIFS(Bogføring!I:I,Bogføring!F:F,\"=\"&$L$5,Bogføring!E:E,\"=\"&A53)","v":0},{"$f":"IF(N53=0,\"\",SUMIFS(Bogføring!B:B,Bogføring!F:F,\"=\"&$N$5,Bogføring!E:E,\"=\"&A53))","v":""},{"$f":"SUMIFS(Bogføring!I:I,Bogføring!F:F,\"=\"&$N$5,Bogføring!E:E,\"=\"&A53)","v":0},{"$f":"IF(N53=0,\"\",SUMIFS(Bogføring!$B:$B,Bogføring!$F:$F,\"=\"&$P$5,Bogføring!$E:$E,\"=\"&A53))","v":""},{"$f":"SUMIFS(Bogføring!$I:$I,Bogføring!$F:$F,\"=\"&$P$5,Bogføring!$E:$E,\"=\"&A53)","v":0}]
[50,"Erik A. Larsen","Svanekevej 60",3700,"Rønne",56953180,"erik.a.larsen@mail.dk",null,null,50,{"$f":"IF(L54=0,\"\",INDEX(Bogføring!$B:$B,MATCH(Tabel2[[#This Row],[Medl.nr. :]],Bogføring!$E:$E,0),0))","v":""},{"$f":"SUMIFS(Bogføring!I:I,Bogføring!F:F,\"=\"&$L$5,Bogføring!E:E,\"=\"&A54)","v":0},{"$f":"IF(N54=0,\"\",SUMIFS(Bogføring!B:B,Bogføring!F:F,\"=\"&$N$5,Bogføring!E:E,\"=\"&A54))","v":""},{"$f":"SUMIFS(Bogføring!I:I,Bogføring!F:F,\"=\"&$N$5,Bogføring!E:E,\"=\"&A54)","v":0},{"$f":"IF(N54=0,\"\",SUMIFS(Bogføring!$B:$B,Bogføring!$F:$F,\"=\"&$P$5,Bogføring!$E:$E,\"=\"&A54))","v":""},{"$f":"SUMIFS(Bogføring!$I:$I,Bogføring!$F:$F,\"=\"&$P$5,Bogføring!$E:$E,\"=\"&A54)","v":0}]
[51,"Finn Jakobsen","Toftekrogen 2",3790,"Hasle",null,"finn@stortuen.dk",null,null,51,{"$f":"IF(L55=0,\"\",INDEX(Bogføring!$B:$B,MATCH(Tabel2[[#This Row],[Medl.nr. :]],Bogføring!$E:$E,0),0))","v":""},{"$f":"SUMIFS(Bogføring!I:I,Bogføring!F:F,\"=\"&$L$5,Bogføring!E:E,\"=\"&A55)","v":0},{"$f":"IF(N55=0,\"\",SUMIFS(Bogføring!B:B,Bogføring!F:F,\"=\"&$N$5,Bogføring!E:E,\"=\"&A55))","v":""},{"$f":"SUMIFS(Bogføring!I:I,Bogføring!F:F,\"=\"&$N$5,Bogføring!E:E,\"=\"&A55)","v":0},{"$f":"IF(N55=0,\"\",SUMIFS(Bogføring!$B:$B,Bogføring!$F:$F,\"=\"&$P$5,Bogføring!$E:$E,\"=\"&A55))","v":""},{"$f":"SUMIFS(Bogføring!$I:$I,Bogføring!$F:$F,\"=\"&$P$5,Bogføring!$E:$E,\"=\"&A55)","v":0}]
[52,"Jens Kofod","Søndre Mosevej 2, Snogebæk",3730,"Nexø",22115310,"jenskofod@outlook.com",null,null,52,{"$f":"IF(L56=0,\"\",INDEX(Bogføring!$B:$B,MATCH(Tabel2[[#This Row],[Medl.nr. :]],Bogføring!$E:$E,0),0))","v":""},{"$f":"SUMIFS(Bogføring!I:I,Bogføring!F:F,\"=\"&$L$5,Bogføring!E:E,\"=\"&A56)","v":0},{"$f":"IF(N56=0,\"\",SUMIFS(Bogføring!B:B,Bogføring!F:F,\"=\"&$N$5,Bogføring!E:E,\"=\"&A56))","v":""},{"$f":"SUMIFS(Bogføring!I:I,Bogføring!F:F,\"=\"&$N$5,Bogføring!E:E,\"=\"&A56)","v":0},{"$f":"IF(N56=0,\"\",SUMIFS(Bogføring!$B:$B,Bogføring!$F:$F,\"=\"&$P$5,Bogføring!$E:$E,\"=\"&A56))","v":""},{"$f":"SUMIFS(Bogføring!$I:$I,Bogføring!$F:$F,\"=\"&$P$5,Bogføring!$E:$E,\"=\"&A56)","v":0}]
[53,"Jørn Ole Jensen","Højegårdsvej 9",3700,"Rønne",null,"joj74@icloud.com",null,null,53,{"$f":"IF(L57=0,\"\",INDEX(Bogføring!$B:$B,MATCH(Tabel2[[#This Row],[Medl.nr. :]],Bogføring!$E:$E,0),0))","v":""},{"$f":"SUMIFS(Bogføring!I:I,Bogføring!F:F,\"=\"&$L$5,Bogføring!E:E,\"=\"&A57)","v":0},{"$f":"IF(N57=0,\"\",SUMIFS(Bogføring!B:B,Bogføring!F:F,\"=\"&$N$5,Bogføring!E:E,\"=\"&A57))","v":""},{"$f":"SUMIFS(Bogføring!I:I,Bogføring!F:F,\"=\"&$N$5,Bogføring!E:E,\"=\"&A57)","v":0},{"$f":"IF(N57=0,\"\",SUMIFS(Bogføring!$B:$B,Bogføring!$F:$F,\"=\"&$P$5,Bogføring!$E:$E,\"=\"&A57))","v":""},{"$f":"SUMIFS(Bogføring!$I:$I,Bogføring!$F:$F,\"=\"&$P$5,Bogføring!$E:$E,\"=\"&A57)","v":0}]
[54,"Ole Ingvorsen","Duebjerggård, Simblegårdsvej 21",3790,"Hasle",null,"ole.ingvorsen40@gmail.com",null,null,54,{"$f":"IF(L58=0,\"\",INDEX(Bogføring!$B:$B,MATCH(Tabel2[[#This Row],[Medl.nr. :]],Bogføring!$E:$E,0),0))","v":""},{"$f":"SUMIFS(Bogføring!I:I,Bogføring!F:F,\"=\"&$L$5,Bogføring!E:E,\"=\"&A58)","v":0},{"$f":"IF(N58=0,\"\",SUMIFS(Bogføring!B:B,Bogføring!F:F,\"=\"&$N$5,Bogføring!E:E,\"=\"&A58))","v":""},{"$f":"SUMIFS(Bogføring!I:I,Bogføring!F:F,\"=\"&$N$5,Bogføring!E:E,\"=\"&A58)","v":0},{"$f":"IF(N58=0,\"\",SUMIFS(Bogføring!$B:$B,Bogføring!$F:$F,\"=\"&$P$5,Bogføring!$E:$E,\"=\"&A58))","v":""},{"$f":"SUMIFS(Bogføring!$I:$I,Bogføring!$F:$F,\"=\"&$P$5,Bogføring!$E:$E,\"=\"&A58)","v":0}]
[55,"Michael Berg Petersen","Lille Madsegade 123",3700,"Rønne",null,"mbpberg@image.dk",null,null,55,{"$f":"IF(L59=0,\"\",INDEX(Bogføring!$B:$B,MATCH(Tabel2[[#This Row],[Medl.nr. :]],Bogføring!$E:$E,0),0))","v":""},{"$f":"SUMIFS(Bogføring!I:I,Bogføring!F:F,\"=\"&$L$5,Bogføring!E:E,\"=\"&A59)","v":0},{"$f":"IF(N59=0,\"\",SUMIFS(Bogføring!B:B,Bogføring!F:F,\"=\"&$N$5,Bogføring!E:E,\"=\"&A59))","v":""},{"$f":"SUMIFS(Bogføring!I:I,Bogføring!F:F,\"=\"&$N$5,Bogføring!E:E,\"=\"&A59)","v":0},{"$f":"IF(N59=0,\"\",SUMIFS(Bogføring!$B:$B,Bogføring!$F:$F,\"=\"&$P$5,Bogføring!$E:$E,\"=\"&A59))","v":""},{"$f":"SUMIFS(Bogføring!$I:$I,Bogføring!$F:$F,\"=\"&$P$5,Bogføring!$E:$E,\"=\"&A59)","v":0}]
[56,"Hans Jørn Sonne","Tornegård, Hovedgårdsvejen 3",3720,"Åkirkeby",null,"Sellesborg@mail.tele.dk",null,null,56,{"$f":"IF(L60=0,\"\",INDEX(Bogføring!$B:$B,MATCH(Tabel2[[#This Row],[Medl.nr. :]],Bogføring!$E:$E,0),0))","v":""},{"$f":"SUMIFS(Bogføring!I:I,Bogføring!F:F,\"=\"&$L$5,Bogføring!E:E,\"=\"&A60)","v":0},{"$f":"IF(N60=0,\"\",SUMIFS(Bogføring!B:B,Bogføring!F:F,\"=\"&$N$5,Bogføring!E:E,\"=\"&A60))","v":""},{"$f":"SUMIFS(Bogføring!I:I,Bogføring!F:F,\"=\"&$N$5,Bogføring!E:E,\"=\"&A60)","v":0},{"$f":"IF(N60=0,\"\",SUMIFS(Bogføring!$B:$B,Bogføring!$F:$F,\"=\"&$P$5,Bogføring!$E:$E,\"=\"&A60))","v":""},{"$f":"SUMIFS(Bogføring!$I:$I,Bogføring!$F:$F,\"=\"&$P$5,Bogføring!$E:$E,\"=\"&A60)","v":0}]
[57,"Palle Roch Nielsen","Ugleengevejen 1",3720,"Åkirkeby",null,"palle@roch.dk",null,null,57,{"$f":"IF(L61=0,\"\",INDEX(Bogføring!$B:$B,MATCH(Tabel2[[#This Row],[Medl.nr. :]],Bogføring!$E:$E,0),0))","v":""},{"$f":"SUMIFS(Bogføring!I:I,Bogføring!F:F,\"=\"&$L$5,Bogføring!E:E,\"=\"&A61)","v":0},{"$f":"IF(N61=0,\"\",SUMIFS(Bogføring!B:B,Bogføring!F:F,\"=\"&$N$5,Bogføring!E:E,\"=\"&A61))","v":""},{"$f":"SUMIFS(Bogføring!I:I,Bogføring!F:F,\"=\"&$N$5,Bogføring!E:E,\"=\"&A61)","v":0},{"$f":"IF(N61=0,\"\",SUMIFS(Bogføring!$B:$B,Bogføring!$F:$F,\"=\"&$P$5,Bogføring!$E:$E,\"=\"&A61))","v":""},{"$f":"SUMIFS(Bogføring!$I:$I,Bogføring!$F:$F,\"=\"&$P$5,Bogføring!$E:$E,\"=\"&A61)","v":0}]
[58,"Per Erik Christiansen","Hellestien 3",8600,"Silkeborg",null,"hellestien3@yahoo.dk",null,null,58,{"$f":"IF(L62=0,\"\",INDEX(Bogføring!$B:$B,MATCH(Tabel2[[#This Row],[Medl.nr. :]],Bogføring!$E:$E,0),0))","v":""},{"$f":"SUMIFS(Bogføring!I:I,Bogføring!F:F,\"=\"&$L$5,Bogføring!E:E,\"=\"&A62)","v":0},{"$f":"IF(N62=0,\"\",SUMIFS(Bogføring!B:B,Bogføring!F:F,\"=\"&$N$5,Bogføring!E:E,\"=\"&A62))","v":""},{"$f":"SUMIFS(Bogføring!I:I,Bogføring!F:F,\"=\"&$N$5,Bogføring!E:E,\"=\"&A62)","v":0},{"$f":"IF(N62=0,\"\",SUMIFS(Bogføring!$B:$B,Bogføring!$F:$F,\"=\"&$P$5,Bogføring!$E:$E,\"=\"&A62))","v":""},{"$f":"SUMIFS(Bogføring!$I:$I,Bogføring!$F:$F,\"=\"&$P$5,Bogføring!$E:$E,\"=\"&A62)","v":0}]
[59,"Flemming Hansen","Bøllingsvej 15 D, st. th.,",4100,"Ringsted",22369745,"lifl@live.dk",null,null,59,{"$f":"IF(L63=0,\"\",INDEX(Bogføring!$B:$B,MATCH(Tabel2[[#This Row],[Medl.nr. :]],Bogføring!$E:$E,0),0))","v":""},{"$f":"SUMIFS(Bogføring!I:I,Bogføring!F:F,\"=\"&$L$5,Bogføring!E:E,\"=\"&A63)","v":0},{"$f":"IF(N63=0,\"\",SUMIFS(Bogføring!B:B,Bogføring!F:F,\"=\"&$N$5,Bogføring!E:E,\"=\"&A63))","v":""},{"$f":"SUMIFS(Bogføring!I:I,Bogføring!F:F,\"=\"&$N$5,Bogføring!E:E,\"=\"&A63)","v":0},{"$f":"IF(N63=0,\"\",SUMIFS(Bogføring!$B:$B,Bogføring!$F:$F,\"=\"&$P$5,Bogføring!$E:$E,\"=\"&A63))","v":""},{"$f":"SUMIFS(Bogføring!$I:$I,Bogføring!$F:$F,\"=\"&$P$5,Bogføring!$E:$E,\"=\"&A63)","v":0}]
[60,"Jørgen Ulrik Selmer","Østergade 2",3700,"Rønne",53656166,"joergenselmer@gmail.com",2018,null,60,{"$f":"IF(L64=0,\"\",INDEX(Bogføring!$B:$B,MATCH(Tabel2[[#This Row],[Medl.nr. :]],Bogføring!$E:$E,0),0))","v":""},{"$f":"SUMIFS(Bogføring!I:I,Bogføring!F:F,\"=\"&$L$5,Bogføring!E:E,\"=\"&A64)","v":0},{"$f":"IF(N64=0,\"\",SUMIFS(Bogføring!B:B,Bogføring!F:F,\"=\"&$N$5,Bogføring!E:E,\"=\"&A64))","v":""},{"$f":"SUMIFS(Bogføring!I:I,Bogføring!F:F,\"=\"&$N$5,Bogføring!E:E,\"=\"&A64)","v":0},{"$f":"IF(N64=0,\"\",SUMIFS(Bogføring!$B:$B,Bogføring!$F:$F,\"=\"&$P$5,Bogføring!$E:$E,\"=\"&A64))","v":""},{"$f":"SUMIFS(Bogføring!$I:$I,Bogføring!$F:$F,\"=\"&$P$5,Bogføring!$E:$E,\"=\"&A64)","v":0}]
[61,"Hans Hellisen","Slamrebjergvej 4, Bodilsker",3730,"Nexø",null,"hans.hellisen@get2net.dk",null,null,61,{"$f":"IF(L65=0,\"\",INDEX(Bogføring!$B:$B,MATCH(Tabel2[[#This Row],[Medl.nr. :]],Bogføring!$E:$E,0),0))","v":""},{"$f":"SUMIFS(Bogføring!I:I,Bogføring!F:F,\"=\"&$L$5,Bogføring!E:E,\"=\"&A65)","v":0},{"$f":"IF(N65=0,\"\",SUMIFS(Bogføring!B:B,Bogføring!F:F,\"=\"&$N$5,Bogføring!E:E,\"=\"&A65))","v":""},{"$f":"SUMIFS(Bogføring!I:I,Bogføring!F:F,\"=\"&$N$5,Bogføring!E:E,\"=\"&A65)","v":0},{"$f":"IF(N65=0,\"\",SUMIFS(Bogføring!$B:$B,Bogføring!$F:$F,\"=\"&$P$5,Bogføring!$E:$E,\"=\"&A65))","v":""},{"$f":"SUMIFS(Bogføring!$I:$I,Bogføring!$F:$F,\"=\"&$P$5,Bogføring!$E:$E,\"=\"&A65)","v":0}]
[62,"Tommy Niels Bendtsen","Bodernevej 6",3720,"Åkirkeby",23274895,"Tommy25dk@gmail.com",2018,null,62,{"$f":"IF(L66=0,\"\",INDEX(Bogføring!$B:$B,MATCH(Tabel2[[#This Row],[Medl.nr. :]],Bogføring!$E:$E,0),0))","v":""},{"$f":"SUMIFS(Bogføring!I:I,Bogføring!F:F,\"=\"&$L$5,Bogføring!E:E,\"=\"&A66)","v":0},{"$f":"IF(N66=0,\"\",SUMIFS(Bogføring!B:B,Bogføring!F:F,\"=\"&$N$5,Bogføring!E:E,\"=\"&A66))","v":""},{"$f":"SUMIFS(Bogføring!I:I,Bogføring!F:F,\"=\"&$N$5,Bogføring!E:E,\"=\"&A66)","v":0},{"$f":"IF(N66=0,\"\",SUMIFS(Bogføring!$B:$B,Bogføring!$F:$F,\"=\"&$P$5,Bogføring!$E:$E,\"=\"&A66))","v":""},{"$f":"SUMIFS(Bogføring!$I:$I,Bogføring!$F:$F,\"=\"&$P$5,Bogføring!$E:$E,\"=\"&A66)","v":0}]
[63,"Jens Christian Hansen","Snorrebakken 50",3700,"Rønne",null,"jchansen@nypost.dk",null,null,63,{"$f":"IF(L67=0,\"\",INDEX(Bogføring!$B:$B,MATCH(Tabel2[[#This Row],[Medl.nr. :]],Bogføring!$E:$E,0),0))","v":""},{"$f":"SUMIFS(Bogføring!I:I,Bogføring!F:F,\"=\"&$L$5,Bogføring!E:E,\"=\"&A67)","v":0},{"$f":"IF(N67=0,\"\",SUMIFS(Bogføring!B:B,Bogføring!F:F,\"=\"&$N$5,Bogføring!E:E,\"=\"&A67))","v":""},{"$f":"SUMIFS(Bogføring!I:I,Bogføring!F:F,\"=\"&$N$5,Bogføring!E:E,\"=\"&A67)","v":0},{"$f":"IF(N67=0,\"\",SUMIFS(Bogføring!$B:$B,Bogføring!$F:$F,\"=\"&$P$5,Bogføring!$E:$E,\"=\"&A67))","v":""},{"$f":"SUMIFS(Bogføring!$I:$I,Bogføring!$F:$F,\"=\"&$P$5,Bogføring!$E:$E,\"=\"&A67)","v":0}]
[64,"Erik Ipsen","Borgmester Nielsensvej 153",3700,"Rønne",null,"ipsen@post7.tele.dk",null,null,64,{"$f":"IF(L68=0,\"\",INDEX(Bogføring!$B:$B,MATCH(Tabel2[[#This Row],[Medl.nr. :]],Bogføring!$E:$E,0),0))","v":""},{"$f":"SUMIFS(Bogføring!I:I,Bogføring!F:F,\"=\"&$L$5,Bogføring!E:E,\"=\"&A68)","v":0},{"$f":"IF(N68=0,\"\",SUMIFS(Bogføring!B:B,Bogføring!F:F,\"=\"&$N$5,Bogføring!E:E,\"=\"&A68))","v":""},{"$f":"SUMIFS(Bogføring!I:I,Bogføring!F:F,\"=\"&$N$5,Bogføring!E:E,\"=\"&A68)","v":0},{"$f":"IF(N68=0,\"\",SUMIFS(Bogføring!$B:$B,Bogføring!$F:$F,\"=\"&$P$5,Bogføring!$E:$E,\"=\"&A68))","v":""},{"$f":"SUMIFS(Bogføring!$I:$I,Bogføring!$F:$F,\"=\"&$P$5,Bogføring!$E:$E,\"=\"&A68)","v":0}]
[65,"Jesper Lund Koefoed","Spageregård, Loftsgårdsvej 1",3720,"Åkirkeby",null,"spageregaard@get2net.dk",null,null,65,{"$f":"IF(L69=0,\"\",INDEX(Bogføring!$B:$B,MATCH(Tabel2[[#This Row],[Medl.nr. :]],Bogføring!$E:$E,0),0))","v":""},{"$f":"SUMIFS(Bogføring!I:I,Bogføring!F:F,\"=\"&$L$5,Bogføring!E:E,\"=\"&A69)","v":0},{"$f":"IF(N69=0,\"\",SUMIFS(Bogføring!B:B,Bogføring!F:F,\"=\"&$N$5,Bogføring!E:E,\"=\"&A69))","v":""},{"$f":"SUMIFS(Bogføring!I:I,Bogføring!F:F,\"=\"&$N$5,Bogføring!E:E,\"=\"&A69)","v":0},{"$f":"IF(N69=0,\"\",SUMIFS(Bogføring!$B:$B,Bogføring!$F:$F,\"=\"&$P$5,Bogføring!$E:$E,\"=\"&A69))","v":""},{"$f":"SUMIFS(Bogføring!$I:$I,Bogføring!$F:$F,\"=\"&$P$5,Bogføring!$E:$E,\"=\"&A69)","v":0}]
[66,"Jens & Lene Holm Andersen","Sandmarksvej 6, Sorthat-Muleby",3700,"Rønne",null,"jensandersen59@gmail.com",null,null,{"$f":"IF(A70=\"\",\"\",A70)","v":66},{"$f":"IF(L70=0,\"\",INDEX(Bogføring!$B:$B,MATCH(Tabel2[[#This Row],[Medl.nr. :]],Bogføring!$E:$E,0),0))","v":""},{"$f":"SUMIFS(Bogføring!I:I,Bogføring!F:F,\"=\"&$L$5,Bogføring!E:E,\"=\"&A70)","v":0},{"$f":"IF(N70=0,\"\",SUMIFS(Bogføring!B:B,Bogføring!F:F,\"=\"&$N$5,Bogføring!E:E,\"=\"&A70))","v":""},{"$f":"SUMIFS(Bogføring!I:I,Bogføring!F:F,\"=\"&$N$5,Bogføring!E:E,\"=\"&A70)","v":0},{"$f":"IF(N70=0,\"\",SUMIFS(Bogføring!$B:$B,Bogføring!$F:$F,\"=\"&$P$5,Bogføring!$E:$E,\"=\"&A70))","v":""},{"$f":"SUMIFS(Bogføring!$I:$I,Bogføring!$F:$F,\"=\"&$P$5,Bogføring!$E:$E,\"=\"&A70)","v":0}]
[67,"Poul Hviid","Tyttebærløkken 1",3700,"Rønne",null,"poul.hviid@gmail.com",null,null,67,{"$f":"IF(L71=0,\"\",INDEX(Bogføring!$B:$B,MATCH(Tabel2[[#This Row],[Medl.nr. :]],Bogføring!$E:$E,0),0))","v":""},{"$f":"SUMIFS(Bogføring!I:I,Bogføring!F:F,\"=\"&$L$5,Bogføring!E:E,\"=\"&A71)","v":0},{"$f":"IF(N71=0,\"\",SUMIFS(Bogføring!B:B,Bogføring!F:F,\"=\"&$N$5,Bogføring!E:E,\"=\"&A71))","v":""},{"$f":"SUMIFS(Bogføring!I:I,Bogføring!F:F,\"=\"&$N$5,Bogføring!E:E,\"=\"&A71)","v":0},{"$f":"IF(N71=0,\"\",SUMIFS(Bogføring!$B:$B,Bogføring!$F:$F,\"=\"&$P$5,Bogføring!$E:$E,\"=\"&A71))","v":""},{"$f":"SUMIFS(Bogføring!$I:$I,Bogføring!$F:$F,\"=\"&$P$5,Bogføring!$E:$E,\"=\"&A71)","v":0}]
[68,"Ketty Fuglsbjerg Hansen","Ingemannsvej 6, Listed",3740,"Svaneke",null,"fuglsbjerg@privat.dk",null,null,68,{"$f":"IF(L72=0,\"\",INDEX(Bogføring!$B:$B,MATCH(Tabel2[[#This Row],[Medl.nr. :]],Bogføring!$E:$E,0),0))","v":""},{"$f":"SUMIFS(Bogføring!I:I,Bogføring!F:F,\"=\"&$L$5,Bogføring!E:E,\"=\"&A72)","v":0},{"$f":"IF(N72=0,\"\",SUMIFS(Bogføring!B:B,Bogføring!F:F,\"=\"&$N$5,Bogføring!E:E,\"=\"&A72))","v":""},{"$f":"SUMIFS(Bogføring!I:I,Bogføring!F:F,\"=\"&$N$5,Bogføring!E:E,\"=\"&A72)","v":0},{"$f":"IF(N72=0,\"\",SUMIFS(Bogføring!$B:$B,Bogføring!$F:$F,\"=\"&$P$5,Bogføring!$E:$E,\"=\"&A72))","v":""},{"$f":"SUMIFS(Bogføring!$I:$I,Bogføring!$F:$F,\"=\"&$P$5,Bogføring!$E:$E,\"=\"&A72)","v":0}]
[69,"Annette S. Dreyer","Højvangsparken 43 st.",3700,"Rønne",50994923,"a.solveig.dreyer@gmail.com",2019,"Frivillig",69,{"$f":"IF(L73=0,\"\",INDEX(Bogføring!$B:$B,MATCH(Tabel2[[#This Row],[Medl.nr. :]],Bogføring!$E:$E,0),0))","v":""},{"$f":"SUMIFS(Bogføring!I:I,Bogføring!F:F,\"=\"&$L$5,Bogføring!E:E,\"=\"&A73)","v":0},{"$f":"IF(N73=0,\"\",SUMIFS(Bogføring!B:B,Bogføring!F:F,\"=\"&$N$5,Bogføring!E:E,\"=\"&A73))","v":""},{"$f":"SUMIFS(Bogføring!I:I,Bogføring!F:F,\"=\"&$N$5,Bogføring!E:E,\"=\"&A73)","v":0},{"$f":"IF(N73=0,\"\",SUMIFS(Bogføring!$B:$B,Bogføring!$F:$F,\"=\"&$P$5,Bogføring!$E:$E,\"=\"&A73))","v":""},{"$f":"SUMIFS(Bogføring!$I:$I,Bogføring!$F:$F,\"=\"&$P$5,Bogføring!$E:$E,\"=\"&A73)","v":0}]
[70,"Bjarne Rasmussen","Bygvænget 6, Lendemarke",4780,"Stege",28408914,"ulla.bjarne@dlgtele.dk",2019,null,70,{"$f":"IF(L74=0,\"\",INDEX(Bogføring!$B:$B,MATCH(Tabel2[[#This Row],[Medl.nr. :]],Bogføring!$E:$E,0),0))","v":""},{"$f":"SUMIFS(Bogføring!I:I,Bogføring!F:F,\"=\"&$L$5,Bogføring!E:E,\"=\"&A74)","v":0},{"$f":"IF(N74=0,\"\",SUMIFS(Bogføring!B:B,Bogføring!F:F,\"=\"&$N$5,Bogføring!E:E,\"=\"&A74))","v":""},{"$f":"SUMIFS(Bogføring!I:I,Bogføring!F:F,\"=\"&$N$5,Bogføring!E:E,\"=\"&A74)","v":0},{"$f":"IF(N74=0,\"\",SUMIFS(Bogføring!$B:$B,Bogføring!$F:$F,\"=\"&$P$5,Bogføring!$E:$E,\"=\"&A74))","v":""},{"$f":"SUMIFS(Bogføring!$I:$I,Bogføring!$F:$F,\"=\"&$P$5,Bogføring!$E:$E,\"=\"&A74)","v":0}]
[71,"Bitten Poss Jørgensen","Studebyvej 10",3760,"Gudhjem",51893547,"maj-ben@privat.dk",2019,null,71,{"$f":"IF(L75=0,\"\",INDEX(Bogføring!$B:$B,MATCH(Tabel2[[#This Row],[Medl.nr. :]],Bogføring!$E:$E,0),0))","v":""},{"$f":"SUMIFS(Bogføring!I:I,Bogføring!F:F,\"=\"&$L$5,Bogføring!E:E,\"=\"&A75)","v":0},{"$f":"IF(N75=0,\"\",SUMIFS(Bogføring!B:B,Bogføring!F:F,\"=\"&$N$5,Bogføring!E:E,\"=\"&A75))","v":""},{"$f":"SUMIFS(Bogføring!I:I,Bogføring!F:F,\"=\"&$N$5,Bogføring!E:E,\"=\"&A75)","v":0},{"$f":"IF(N75=0,\"\",SUMIFS(Bogføring!$B:$B,Bogføring!$F:$F,\"=\"&$P$5,Bogføring!$E:$E,\"=\"&A75))","v":""},{"$f":"SUMIFS(Bogføring!$I:$I,Bogføring!$F:$F,\"=\"&$P$5,Bogføring!$E:$E,\"=\"&A75)","v":0}]
[72,"Sven Holm Jensen","Smørengevejen 26, V-Marie",3720,"Åkirkeby",61334913,"lykkensproeve@gmail.com",2019,null,72,{"$f":"IF(L76=0,\"\",INDEX(Bogføring!$B:$B,MATCH(Tabel2[[#This Row],[Medl.nr. :]],Bogføring!$E:$E,0),0))","v":""},{"$f":"SUMIFS(Bogføring!I:I,Bogføring!F:F,\"=\"&$L$5,Bogføring!E:E,\"=\"&A76)","v":0},{"$f":"IF(N76=0,\"\",SUMIFS(Bogføring!B:B,Bogføring!F:F,\"=\"&$N$5,Bogføring!E:E,\"=\"&A76))","v":""},{"$f":"SUMIFS(Bogføring!I:I,Bogføring!F:F,\"=\"&$N$5,Bogføring!E:E,\"=\"&A76)","v":0},{"$f":"IF(N76=0,\"\",SUMIFS(Bogføring!$B:$B,Bogføring!$F:$F,\"=\"&$P$5,Bogføring!$E:$E,\"=\"&A76))","v":""},{"$f":"SUMIFS(Bogføring!$I:$I,Bogføring!$F:$F,\"=\"&$P$5,Bogføring!$E:$E,\"=\"&A76)","v":0}]
[73,"Kenneth Frithiof Kure","Meulenborg Park 31",3070,"Snekkersten",24630084,"kurs@mail.dk",2019,null,73,{"$f":"IF(L77=0,\"\",INDEX(Bogføring!$B:$B,MATCH(Tabel2[[#This Row],[Medl.nr. :]],Bogføring!$E:$E,0),0))","v":""},{"$f":"SUMIFS(Bogføring!I:I,Bogføring!F:F,\"=\"&$L$5,Bogføring!E:E,\"=\"&A77)","v":0},{"$f":"IF(N77=0,\"\",SUMIFS(Bogføring!B:B,Bogføring!F:F,\"=\"&$N$5,Bogføring!E:E,\"=\"&A77))","v":""},{"$f":"SUMIFS(Bogføring!I:I,Bogføring!F:F,\"=\"&$N$5,Bogføring!E:E,\"=\"&A77)","v":0},{"$f":"IF(N77=0,\"\",SUMIFS(Bogføring!$B:$B,Bogføring!$F:$F,\"=\"&$P$5,Bogføring!$E:$E,\"=\"&A77))","v":""},{"$f":"SUMIFS(Bogføring!$I:$I,Bogføring!$F:$F,\"=\"&$P$5,Bogføring!$E:$E,\"=\"&A77)","v":0}]
[74,"Lotte Roch","Strøbyvej 2",3720,"Åkirkeby",21912063,"lotte@roch.dk",null,null,74,{"$f":"IF(L78=0,\"\",INDEX(Bogføring!$B:$B,MATCH(Tabel2[[#This Row],[Medl.nr. :]],Bogføring!$E:$E,0),0))","v":""},{"$f":"SUMIFS(Bogføring!I:I,Bogføring!F:F,\"=\"&$L$5,Bogføring!E:E,\"=\"&A78)","v":0},{"$f":"IF(N78=0,\"\",SUMIFS(Bogføring!B:B,Bogføring!F:F,\"=\"&$N$5,Bogføring!E:E,\"=\"&A78))","v":""},{"$f":"SUMIFS(Bogføring!I:I,Bogføring!F:F,\"=\"&$N$5,Bogføring!E:E,\"=\"&A78)","v":0},{"$f":"IF(N78=0,\"\",SUMIFS(Bogføring!$B:$B,Bogføring!$F:$F,\"=\"&$P$5,Bogføring!$E:$E,\"=\"&A78))","v":""},{"$f":"SUMIFS(Bogføring!$I:$I,Bogføring!$F:$F,\"=\"&$P$5,Bogføring!$E:$E,\"=\"&A78)","v":0}]
[75,"Niels-Viggo Stage","Kapelvej 53",3700,"Rønne",56914825,"niels-viggostage@mail.dk",null,null,75,{"$f":"IF(L79=0,\"\",INDEX(Bogføring!$B:$B,MATCH(Tabel2[[#This Row],[Medl.nr. :]],Bogføring!$E:$E,0),0))","v":""},{"$f":"SUMIFS(Bogføring!I:I,Bogføring!F:F,\"=\"&$L$5,Bogføring!E:E,\"=\"&A79)","v":0},{"$f":"IF(N79=0,\"\",SUMIFS(Bogføring!B:B,Bogføring!F:F,\"=\"&$N$5,Bogføring!E:E,\"=\"&A79))","v":""},{"$f":"SUMIFS(Bogføring!I:I,Bogføring!F:F,\"=\"&$N$5,Bogføring!E:E,\"=\"&A79)","v":0},{"$f":"IF(N79=0,\"\",SUMIFS(Bogføring!$B:$B,Bogføring!$F:$F,\"=\"&$P$5,Bogføring!$E:$E,\"=\"&A79))","v":""},{"$f":"SUMIFS(Bogføring!$I:$I,Bogføring!$F:$F,\"=\"&$P$5,Bogføring!$E:$E,\"=\"&A79)","v":0}]
[76,"Søren Peter Elleby","Slappegade 12",3700,"Rønne",56951086,"s.p.elleby@hotmail.com",null,"Bet. af Hanne Merete Elleby, Solnavej 23,St tv,2860 Søborg",76,{"$f":"IF(L80=0,\"\",INDEX(Bogføring!$B:$B,MATCH(Tabel2[[#This Row],[Medl.nr. :]],Bogføring!$E:$E,0),0))","v":""},{"$f":"SUMIFS(Bogføring!I:I,Bogføring!F:F,\"=\"&$L$5,Bogføring!E:E,\"=\"&A80)","v":0},{"$f":"IF(N80=0,\"\",SUMIFS(Bogføring!B:B,Bogføring!F:F,\"=\"&$N$5,Bogføring!E:E,\"=\"&A80))","v":""},{"$f":"SUMIFS(Bogføring!I:I,Bogføring!F:F,\"=\"&$N$5,Bogføring!E:E,\"=\"&A80)","v":0},{"$f":"IF(N80=0,\"\",SUMIFS(Bogføring!$B:$B,Bogføring!$F:$F,\"=\"&$P$5,Bogføring!$E:$E,\"=\"&A80))","v":""},{"$f":"SUMIFS(Bogføring!$I:$I,Bogføring!$F:$F,\"=\"&$P$5,Bogføring!$E:$E,\"=\"&A80)","v":0}]
[77,"Jørgen Christian Espersen","Peter Ipsensvej 49",3700,"Rønne",24436630,"espersen@piv49.dk",null,null,77,{"$f":"IF(L81=0,\"\",INDEX(Bogføring!$B:$B,MATCH(Tabel2[[#This Row],[Medl.nr. :]],Bogføring!$E:$E,0),0))","v":""},{"$f":"SUMIFS(Bogføring!I:I,Bogføring!F:F,\"=\"&$L$5,Bogføring!E:E,\"=\"&A81)","v":0},{"$f":"IF(N81=0,\"\",SUMIFS(Bogføring!B:B,Bogføring!F:F,\"=\"&$N$5,Bogføring!E:E,\"=\"&A81))","v":""},{"$f":"SUMIFS(Bogføring!I:I,Bogføring!F:F,\"=\"&$N$5,Bogføring!E:E,\"=\"&A81)","v":0},{"$f":"IF(N81=0,\"\",SUMIFS(Bogføring!$B:$B,Bogføring!$F:$F,\"=\"&$P$5,Bogføring!$E:$E,\"=\"&A81))","v":""},{"$f":"SUMIFS(Bogføring!$I:$I,Bogføring!$F:$F,\"=\"&$P$5,Bogføring!$E:$E,\"=\"&A81)","v":0}]
[78,"Henning Nielsen","Gammelvældevej 1 A, Østerlars",3760,"Gudhjem",23245589,"hnielsen293@gmail.com",null,null,78,{"$f":"IF(L82=0,\"\",INDEX(Bogføring!$B:$B,MATCH(Tabel2[[#This Row],[Medl.nr. :]],Bogføring!$E:$E,0),0))","v":""},{"$f":"SUMIFS(Bogføring!I:I,Bogføring!F:F,\"=\"&$L$5,Bogføring!E:E,\"=\"&A82)","v":0},{"$f":"IF(N82=0,\"\",SUMIFS(Bogføring!B:B,Bogføring!F:F,\"=\"&$N$5,Bogføring!E:E,\"=\"&A82))","v":""},{"$f":"SUMIFS(Bogføring!I:I,Bogføring!F:F,\"=\"&$N$5,Bogføring!E:E,\"=\"&A82)","v":0},{"$f":"IF(N82=0,\"\",SUMIFS(Bogføring!$B:$B,Bogføring!$F:$F,\"=\"&$P$5,Bogføring!$E:$E,\"=\"&A82))","v":""},{"$f":"SUMIFS(Bogføring!$I:$I,Bogføring!$F:$F,\"=\"&$P$5,Bogføring!$E:$E,\"=\"&A82)","v":0}]
[79,"Jørn Uffe Hansen","Krakvej 7, Rutsker",3790,"Hasle",30119065,"j.u.hansen@mail.dk",null,null,79,{"$f":"IF(L83=0,\"\",INDEX(Bogføring!$B:$B,MATCH(Tabel2[[#This Row],[Medl.nr. :]],Bogføring!$E:$E,0),0))","v":""},{"$f":"SUMIFS(Bogføring!I:I,Bogføring!F:F,\"=\"&$L$5,Bogføring!E:E,\"=\"&A83)","v":0},{"$f":"IF(N83=0,\"\",SUMIFS(Bogføring!B:B,Bogføring!F:F,\"=\"&$N$5,Bogføring!E:E,\"=\"&A83))","v":""},{"$f":"SUMIFS(Bogføring!I:I,Bogføring!F:F,\"=\"&$N$5,Bogføring!E:E,\"=\"&A83)","v":0},{"$f":"IF(N83=0,\"\",SUMIFS(Bogføring!$B:$B,Bogføring!$F:$F,\"=\"&$P$5,Bogføring!$E:$E,\"=\"&A83))","v":""},{"$f":"SUMIFS(Bogføring!$I:$I,Bogføring!$F:$F,\"=\"&$P$5,Bogføring!$E:$E,\"=\"&A83)","v":0}]
[80,"Georg Wibe Nielsen","Rønnevej 109",3700,"Rønne",56972146,"geni2@outlook.dk ",null,null,80,{"$f":"IF(L84=0,\"\",INDEX(Bogføring!$B:$B,MATCH(Tabel2[[#This Row],[Medl.nr. :]],Bogføring!$E:$E,0),0))","v":""},{"$f":"SUMIFS(Bogføring!I:I,Bogføring!F:F,\"=\"&$L$5,Bogføring!E:E,\"=\"&A84)","v":0},{"$f":"IF(N84=0,\"\",SUMIFS(Bogføring!B:B,Bogføring!F:F,\"=\"&$N$5,Bogføring!E:E,\"=\"&A84))","v":""},{"$f":"SUMIFS(Bogføring!I:I,Bogføring!F:F,\"=\"&$N$5,Bogføring!E:E,\"=\"&A84)","v":0},{"$f":"IF(N84=0,\"\",SUMIFS(Bogføring!$B:$B,Bogføring!$F:$F,\"=\"&$P$5,Bogføring!$E:$E,\"=\"&A84))","v":""},{"$f":"SUMIFS(Bogføring!$I:$I,Bogføring!$F:$F,\"=\"&$P$5,Bogføring!$E:$E,\"=\"&A84)","v":0}]
[81,"Jørn Lund","St. Torvegade 62",3700,"Rønne",40282002,"jorn.lund.ronne@gmail.com",null,null,81,{"$f":"IF(L85=0,\"\",INDEX(Bogføring!$B:$B,MATCH(Tabel2[[#This Row],[Medl.nr. :]],Bogføring!$E:$E,0),0))","v":""},{"$f":"SUMIFS(Bogføring!I:I,Bogføring!F:F,\"=\"&$L$5,Bogføring!E:E,\"=\"&A85)","v":0},{"$f":"IF(N85=0,\"\",SUMIFS(Bogføring!B:B,Bogføring!F:F,\"=\"&$N$5,Bogføring!E:E,\"=\"&A85))","v":""},{"$f":"SUMIFS(Bogføring!I:I,Bogføring!F:F,\"=\"&$N$5,Bogføring!E:E,\"=\"&A85)","v":0},{"$f":"IF(N85=0,\"\",SUMIFS(Bogføring!$B:$B,Bogføring!$F:$F,\"=\"&$P$5,Bogføring!$E:$E,\"=\"&A85))","v":""},{"$f":"SUMIFS(Bogføring!$I:$I,Bogføring!$F:$F,\"=\"&$P$5,Bogføring!$E:$E,\"=\"&A85)","v":0}]
[82,"Jan og Inge Grete Gulstad","Sveasvej 28",3700,"Rønne",29435783,"janinge@youmail.dk",null,null,82,{"$f":"IF(L86=0,\"\",INDEX(Bogføring!$B:$B,MATCH(Tabel2[[#This Row],[Medl.nr. :]],Bogføring!$E:$E,0),0))","v":""},{"$f":"SUMIFS(Bogføring!I:I,Bogføring!F:F,\"=\"&$L$5,Bogføring!E:E,\"=\"&A86)","v":0},{"$f":"IF(N86=0,\"\",SUMIFS(Bogføring!B:B,Bogføring!F:F,\"=\"&$N$5,Bogføring!E:E,\"=\"&A86))","v":""},{"$f":"SUMIFS(Bogføring!I:I,Bogføring!F:F,\"=\"&$N$5,Bogføring!E:E,\"=\"&A86)","v":0},{"$f":"IF(N86=0,\"\",SUMIFS(Bogføring!$B:$B,Bogføring!$F:$F,\"=\"&$P$5,Bogføring!$E:$E,\"=\"&A86))","v":""},{"$f":"SUMIFS(Bogføring!$I:$I,Bogføring!$F:$F,\"=\"&$P$5,Bogføring!$E:$E,\"=\"&A86)","v":0}]
[83,"Pia Thykjær & Ole Gerhard Jørgensen","Blemmelyngvejen 12, Nylars",3700,"Rønne",24455947,"pjot@mail.dk",null,null,83,{"$f":"IF(L87=0,\"\",INDEX(Bogføring!$B:$B,MATCH(Tabel2[[#This Row],[Medl.nr. :]],Bogføring!$E:$E,0),0))","v":""},{"$f":"SUMIFS(Bogføring!I:I,Bogføring!F:F,\"=\"&$L$5,Bogføring!E:E,\"=\"&A87)","v":0},{"$f":"IF(N87=0,\"\",SUMIFS(Bogføring!B:B,Bogføring!F:F,\"=\"&$N$5,Bogføring!E:E,\"=\"&A87))","v":""},{"$f":"SUMIFS(Bogføring!I:I,Bogføring!F:F,\"=\"&$N$5,Bogføring!E:E,\"=\"&A87)","v":0},{"$f":"IF(N87=0,\"\",SUMIFS(Bogføring!$B:$B,Bogføring!$F:$F,\"=\"&$P$5,Bogføring!$E:$E,\"=\"&A87))","v":""},{"$f":"SUMIFS(Bogføring!$I:$I,Bogføring!$F:$F,\"=\"&$P$5,Bogføring!$E:$E,\"=\"&A87)","v":0}]
[84,"Per Loumand","Stationsvej 72, Pjedsted",7000,"Frederecia",27777890,"Per@spanensbjerg-loumand.dk",2019,null,84,{"$f":"IF(L88=0,\"\",INDEX(Bogføring!$B:$B,MATCH(Tabel2[[#This Row],[Medl.nr. :]],Bogføring!$E:$E,0),0))","v":""},{"$f":"SUMIFS(Bogføring!I:I,Bogføring!F:F,\"=\"&$L$5,Bogføring!E:E,\"=\"&A88)","v":0},{"$f":"IF(N88=0,\"\",SUMIFS(Bogføring!B:B,Bogføring!F:F,\"=\"&$N$5,Bogføring!E:E,\"=\"&A88))","v":""},{"$f":"SUMIFS(Bogføring!I:I,Bogføring!F:F,\"=\"&$N$5,Bogføring!E:E,\"=\"&A88)","v":0},{"$f":"IF(N88=0,\"\",SUMIFS(Bogføring!$B:$B,Bogføring!$F:$F,\"=\"&$P$5,Bogføring!$E:$E,\"=\"&A88))","v":""},{"$f":"SUMIFS(Bogføring!$I:$I,Bogføring!$F:$F,\"=\"&$P$5,Bogføring!$E:$E,\"=\"&A88)","v":0}]
[85,"Bente Hansen","Morrevej 14",7500,"Holstebro",30428102,"bh.fjt@fibermail.dk ",2019,null,85,{"$f":"IF(L89=0,\"\",INDEX(Bogføring!$B:$B,MATCH(Tabel2[[#This Row],[Medl.nr. :]],Bogføring!$E:$E,0),0))","v":""},{"$f":"SUMIFS(Bogføring!I:I,Bogføring!F:F,\"=\"&$L$5,Bogføring!E:E,\"=\"&A89)","v":0},{"$f":"IF(N89=0,\"\",SUMIFS(Bogføring!B:B,Bogføring!F:F,\"=\"&$N$5,Bogføring!E:E,\"=\"&A89))","v":""},{"$f":"SUMIFS(Bogføring!I:I,Bogføring!F:F,\"=\"&$N$5,Bogføring!E:E,\"=\"&A89)","v":0},{"$f":"IF(N89=0,\"\",SUMIFS(Bogføring!$B:$B,Bogføring!$F:$F,\"=\"&$P$5,Bogføring!$E:$E,\"=\"&A89))","v":""},{"$f":"SUMIFS(Bogføring!$I:$I,Bogføring!$F:$F,\"=\"&$P$5,Bogføring!$E:$E,\"=\"&A89)","v":0}]
[86,"Hans Jacob Rømer","Fabriksvej 30",3782,"Klemensker",56966024,"hansjacobroemer@gmail.com",null,null,86,{"$f":"IF(L90=0,\"\",INDEX(Bogføring!$B:$B,MATCH(Tabel2[[#This Row],[Medl.nr. :]],Bogføring!$E:$E,0),0))","v":""},{"$f":"SUMIFS(Bogføring!I:I,Bogføring!F:F,\"=\"&$L$5,Bogføring!E:E,\"=\"&A90)","v":0},{"$f":"IF(N90=0,\"\",SUMIFS(Bogføring!B:B,Bogføring!F:F,\"=\"&$N$5,Bogføring!E:E,\"=\"&A90))","v":""},{"$f":"SUMIFS(Bogføring!I:I,Bogføring!F:F,\"=\"&$N$5,Bogføring!E:E,\"=\"&A90)","v":0},{"$f":"IF(N90=0,\"\",SUMIFS(Bogføring!$B:$B,Bogføring!$F:$F,\"=\"&$P$5,Bogføring!$E:$E,\"=\"&A90))","v":""},{"$f":"SUMIFS(Bogføring!$I:$I,Bogføring!$F:$F,\"=\"&$P$5,Bogføring!$E:$E,\"=\"&A90)","v":0}]
[87,"Jens og Anne-Lise Aagesen","Egeløkken 11",3700,"Rønne",51895289,"jens.aagesen@gmail.com ",null,null,87,{"$f":"IF(L91=0,\"\",INDEX(Bogføring!$B:$B,MATCH(Tabel2[[#This Row],[Medl.nr. :]],Bogføring!$E:$E,0),0))","v":""},{"$f":"SUMIFS(Bogføring!I:I,Bogføring!F:F,\"=\"&$L$5,Bogføring!E:E,\"=\"&A91)","v":0},{"$f":"IF(N91=0,\"\",SUMIFS(Bogføring!B:B,Bogføring!F:F,\"=\"&$N$5,Bogføring!E:E,\"=\"&A91))","v":""},{"$f":"SUMIFS(Bogføring!I:I,Bogføring!F:F,\"=\"&$N$5,Bogføring!E:E,\"=\"&A91)","v":0},{"$f":"IF(N91=0,\"\",SUMIFS(Bogføring!$B:$B,Bogføring!$F:$F,\"=\"&$P$5,Bogføring!$E:$E,\"=\"&A91))","v":""},{"$f":"SUMIFS(Bogføring!$I:$I,Bogføring!$F:$F,\"=\"&$P$5,Bogføring!$E:$E,\"=\"&A91)","v":0}]
[88,"S. Aa. Olsen","Dampmøllegade 5B",3700,"Rønne",30265597,"svaaolsen@godmail.dk ",null,null,88,{"$f":"IF(L92=0,\"\",INDEX(Bogføring!$B:$B,MATCH(Tabel2[[#This Row],[Medl.nr. :]],Bogføring!$E:$E,0),0))","v":""},{"$f":"SUMIFS(Bogføring!I:I,Bogføring!F:F,\"=\"&$L$5,Bogføring!E:E,\"=\"&A92)","v":0},{"$f":"IF(N92=0,\"\",SUMIFS(Bogføring!B:B,Bogføring!F:F,\"=\"&$N$5,Bogføring!E:E,\"=\"&A92))","v":""},{"$f":"SUMIFS(Bogføring!I:I,Bogføring!F:F,\"=\"&$N$5,Bogføring!E:E,\"=\"&A92)","v":0},{"$f":"IF(N92=0,\"\",SUMIFS(Bogføring!$B:$B,Bogføring!$F:$F,\"=\"&$P$5,Bogføring!$E:$E,\"=\"&A92))","v":""},{"$f":"SUMIFS(Bogføring!$I:$I,Bogføring!$F:$F,\"=\"&$P$5,Bogføring!$E:$E,\"=\"&A92)","v":0}]
[89,"Claus Paulsen","Syrenvej 5",3700,"Rønne",30715477,"birgit_claus@paulsen.mail.dk",null,null,89,{"$f":"IF(L93=0,\"\",INDEX(Bogføring!$B:$B,MATCH(Tabel2[[#This Row],[Medl.nr. :]],Bogføring!$E:$E,0),0))","v":""},{"$f":"SUMIFS(Bogføring!I:I,Bogføring!F:F,\"=\"&$L$5,Bogføring!E:E,\"=\"&A93)","v":0},{"$f":"IF(N93=0,\"\",SUMIFS(Bogføring!B:B,Bogføring!F:F,\"=\"&$N$5,Bogføring!E:E,\"=\"&A93))","v":""},{"$f":"SUMIFS(Bogføring!I:I,Bogføring!F:F,\"=\"&$N$5,Bogføring!E:E,\"=\"&A93)","v":0},{"$f":"IF(N93=0,\"\",SUMIFS(Bogføring!$B:$B,Bogføring!$F:$F,\"=\"&$P$5,Bogføring!$E:$E,\"=\"&A93))","v":""},{"$f":"SUMIFS(Bogføring!$I:$I,Bogføring!$F:$F,\"=\"&$P$5,Bogføring!$E:$E,\"=\"&A93)","v":0}]
[90,"Dan Olsen","Ølenevejen 58",3720,"Åkirkeby",29421873,"d-olsen8268@gmail.com",null,null,90,{"$f":"IF(L94=0,\"\",INDEX(Bogføring!$B:$B,MATCH(Tabel2[[#This Row],[Medl.nr. :]],Bogføring!$E:$E,0),0))","v":""},{"$f":"SUMIFS(Bogføring!I:I,Bogføring!F:F,\"=\"&$L$5,Bogføring!E:E,\"=\"&A94)","v":0},{"$f":"IF(N94=0,\"\",SUMIFS(Bogføring!B:B,Bogføring!F:F,\"=\"&$N$5,Bogføring!E:E,\"=\"&A94))","v":""},{"$f":"SUMIFS(Bogføring!I:I,Bogføring!F:F,\"=\"&$N$5,Bogføring!E:E,\"=\"&A94)","v":0},{"$f":"IF(N94=0,\"\",SUMIFS(Bogføring!$B:$B,Bogføring!$F:$F,\"=\"&$P$5,Bogføring!$E:$E,\"=\"&A94))","v":""},{"$f":"SUMIFS(Bogføring!$I:$I,Bogføring!$F:$F,\"=\"&$P$5,Bogføring!$E:$E,\"=\"&A94)","v":0}]
[91,"Sven Haugaard Jørgensen","Timianløkken 10",3700,"Rønne",20185984,"jemsj@youmail.dk",null,null,91,{"$f":"IF(L95=0,\"\",INDEX(Bogføring!$B:$B,MATCH(Tabel2[[#This Row],[Medl.nr. :]],Bogføring!$E:$E,0),0))","v":""},{"$f":"SUMIFS(Bogføring!I:I,Bogføring!F:F,\"=\"&$L$5,Bogføring!E:E,\"=\"&A95)","v":0},{"$f":"IF(N95=0,\"\",SUMIFS(Bogføring!B:B,Bogføring!F:F,\"=\"&$N$5,Bogføring!E:E,\"=\"&A95))","v":""},{"$f":"SUMIFS(Bogføring!I:I,Bogføring!F:F,\"=\"&$N$5,Bogføring!E:E,\"=\"&A95)","v":0},{"$f":"IF(N95=0,\"\",SUMIFS(Bogføring!$B:$B,Bogføring!$F:$F,\"=\"&$P$5,Bogføring!$E:$E,\"=\"&A95))","v":""},{"$f":"SUMIFS(Bogføring!$I:$I,Bogføring!$F:$F,\"=\"&$P$5,Bogføring!$E:$E,\"=\"&A95)","v":0}]
[92,"Ole Kock-Jensen","Skovløkken 8",3720,"Åkirkeby",21458148,"ole.kock-jensen@mail.dk",null,null,92,{"$f":"IF(L96=0,\"\",INDEX(Bogføring!$B:$B,MATCH(Tabel2[[#This Row],[Medl.nr. :]],Bogføring!$E:$E,0),0))","v":""},{"$f":"SUMIFS(Bogføring!I:I,Bogføring!F:F,\"=\"&$L$5,Bogføring!E:E,\"=\"&A96)","v":0},{"$f":"IF(N96=0,\"\",SUMIFS(Bogføring!B:B,Bogføring!F:F,\"=\"&$N$5,Bogføring!E:E,\"=\"&A96))","v":""},{"$f":"SUMIFS(Bogføring!I:I,Bogføring!F:F,\"=\"&$N$5,Bogføring!E:E,\"=\"&A96)","v":0},{"$f":"IF(N96=0,\"\",SUMIFS(Bogføring!$B:$B,Bogføring!$F:$F,\"=\"&$P$5,Bogføring!$E:$E,\"=\"&A96))","v":""},{"$f":"SUMIFS(Bogføring!$I:$I,Bogføring!$F:$F,\"=\"&$P$5,Bogføring!$E:$E,\"=\"&A96)","v":0}]
[93,"Thomas Thors","Tyttebærløkken 4",3700,"Rønne",56951349,"thomas.thors@live.dk",null,null,93,{"$f":"IF(L97=0,\"\",INDEX(Bogføring!$B:$B,MATCH(Tabel2[[#This Row],[Medl.nr. :]],Bogføring!$E:$E,0),0))","v":""},{"$f":"SUMIFS(Bogføring!I:I,Bogføring!F:F,\"=\"&$L$5,Bogføring!E:E,\"=\"&A97)","v":0},{"$f":"IF(N97=0,\"\",SUMIFS(Bogføring!B:B,Bogføring!F:F,\"=\"&$N$5,Bogføring!E:E,\"=\"&A97))","v":""},{"$f":"SUMIFS(Bogføring!I:I,Bogføring!F:F,\"=\"&$N$5,Bogføring!E:E,\"=\"&A97)","v":0},{"$f":"IF(N97=0,\"\",SUMIFS(Bogføring!$B:$B,Bogføring!$F:$F,\"=\"&$P$5,Bogføring!$E:$E,\"=\"&A97))","v":""},{"$f":"SUMIFS(Bogføring!$I:$I,Bogføring!$F:$F,\"=\"&$P$5,Bogføring!$E:$E,\"=\"&A97)","v":0}]
[94,"Frank Kofoed","Engvej 1",3700,"Rønne",61339036,"engvej1@live.dk",null,null,94,{"$f":"IF(L98=0,\"\",INDEX(Bogføring!$B:$B,MATCH(Tabel2[[#This Row],[Medl.nr. :]],Bogføring!$E:$E,0),0))","v":""},{"$f":"SUMIFS(Bogføring!I:I,Bogføring!F:F,\"=\"&$L$5,Bogføring!E:E,\"=\"&A98)","v":0},{"$f":"IF(N98=0,\"\",SUMIFS(Bogføring!B:B,Bogføring!F:F,\"=\"&$N$5,Bogføring!E:E,\"=\"&A98))","v":""},{"$f":"SUMIFS(Bogføring!I:I,Bogføring!F:F,\"=\"&$N$5,Bogføring!E:E,\"=\"&A98)","v":0},{"$f":"IF(N98=0,\"\",SUMIFS(Bogføring!$B:$B,Bogføring!$F:$F,\"=\"&$P$5,Bogføring!$E:$E,\"=\"&A98))","v":""},{"$f":"SUMIFS(Bogføring!$I:$I,Bogføring!$F:$F,\"=\"&$P$5,Bogføring!$E:$E,\"=\"&A98)","v":0}]
[95,"Per Ole Westall","Rønnebær Allé 32",3000,"Helsingør",25411343,"westall@it.dk",null,null,95,{"$f":"IF(L99=0,\"\",INDEX(Bogføring!$B:$B,MATCH(Tabel2[[#This Row],[Medl.nr. :]],Bogføring!$E:$E,0),0))","v":""},{"$f":"SUMIFS(Bogføring!I:I,Bogføring!F:F,\"=\"&$L$5,Bogføring!E:E,\"=\"&A99)","v":0},{"$f":"IF(N99=0,\"\",SUMIFS(Bogføring!B:B,Bogføring!F:F,\"=\"&$N$5,Bogføring!E:E,\"=\"&A99))","v":""},{"$f":"SUMIFS(Bogføring!I:I,Bogføring!F:F,\"=\"&$N$5,Bogføring!E:E,\"=\"&A99)","v":0},{"$f":"IF(N99=0,\"\",SUMIFS(Bogføring!$B:$B,Bogføring!$F:$F,\"=\"&$P$5,Bogføring!$E:$E,\"=\"&A99))","v":""},{"$f":"SUMIFS(Bogføring!$I:$I,Bogføring!$F:$F,\"=\"&$P$5,Bogføring!$E:$E,\"=\"&A99)","v":0}]
[96,"Flemming Thorsen","Præstevej 65 c",4700,"Næstved",26821044,"thormark27@gmail.com",null,null,96,{"$f":"IF(L100=0,\"\",INDEX(Bogføring!$B:$B,MATCH(Tabel2[[#This Row],[Medl.nr. :]],Bogføring!$E:$E,0),0))","v":""},{"$f":"SUMIFS(Bogføring!I:I,Bogføring!F:F,\"=\"&$L$5,Bogføring!E:E,\"=\"&A100)","v":0},{"$f":"IF(N100=0,\"\",SUMIFS(Bogføring!B:B,Bogføring!F:F,\"=\"&$N$5,Bogføring!E:E,\"=\"&A100))","v":""},{"$f":"SUMIFS(Bogføring!I:I,Bogføring!F:F,\"=\"&$N$5,Bogføring!E:E,\"=\"&A100)","v":0},{"$f":"IF(N100=0,\"\",SUMIFS(Bogføring!$B:$B,Bogføring!$F:$F,\"=\"&$P$5,Bogføring!$E:$E,\"=\"&A100))","v":""},{"$f":"SUMIFS(Bogføring!$I:$I,Bogføring!$F:$F,\"=\"&$P$5,Bogføring!$E:$E,\"=\"&A100)","v":0}]
[97,"Bettina Pedersen","Sursænkevej 1",3700,"Rønne",23477109,"pedersen@outlook.dk",2019,null,97,{"$f":"IF(L101=0,\"\",INDEX(Bogføring!$B:$B,MATCH(Tabel2[[#This Row],[Medl.nr. :]],Bogføring!$E:$E,0),0))","v":""},{"$f":"SUMIFS(Bogføring!I:I,Bogføring!F:F,\"=\"&$L$5,Bogføring!E:E,\"=\"&A101)","v":0},{"$f":"IF(N101=0,\"\",SUMIFS(Bogføring!B:B,Bogføring!F:F,\"=\"&$N$5,Bogføring!E:E,\"=\"&A101))","v":""},{"$f":"SUMIFS(Bogføring!I:I,Bogføring!F:F,\"=\"&$N$5,Bogføring!E:E,\"=\"&A101)","v":0},{"$f":"IF(N101=0,\"\",SUMIFS(Bogføring!$B:$B,Bogføring!$F:$F,\"=\"&$P$5,Bogføring!$E:$E,\"=\"&A101))","v":""},{"$f":"SUMIFS(Bogføring!$I:$I,Bogføring!$F:$F,\"=\"&$P$5,Bogføring!$E:$E,\"=\"&A101)","v":0}]
[98,"Gitte Haahr","Jerndorffsvænget",7000,"Frederecia",30115670,"haahr.gitte@gmail.com",2019,null,{"$f":"IF(A102=\"\",\"\",A102)","v":98},{"$f":"IF(L102=0,\"\",INDEX(Bogføring!$B:$B,MATCH(Tabel2[[#This Row],[Medl.nr. :]],Bogføring!$E:$E,0),0))","v":""},{"$f":"SUMIFS(Bogføring!I:I,Bogføring!F:F,\"=\"&$L$5,Bogføring!E:E,\"=\"&A102)","v":0},{"$f":"IF(N102=0,\"\",SUMIFS(Bogføring!B:B,Bogføring!F:F,\"=\"&$N$5,Bogføring!E:E,\"=\"&A102))","v":""},{"$f":"SUMIFS(Bogføring!I:I,Bogføring!F:F,\"=\"&$N$5,Bogføring!E:E,\"=\"&A102)","v":0},{"$f":"IF(N102=0,\"\",SUMIFS(Bogføring!$B:$B,Bogføring!$F:$F,\"=\"&$P$5,Bogføring!$E:$E,\"=\"&A102))","v":""},{"$f":"SUMIFS(Bogføring!$I:$I,Bogføring!$F:$F,\"=\"&$P$5,Bogføring!$E:$E,\"=\"&A102)","v":0}]
[99,"Jørn Kofod","Gadekæret 9",3720,"Åkirkeby",21391507,"jekofod4501@gmail.com",null,null,99,{"$f":"IF(L103=0,\"\",INDEX(Bogføring!$B:$B,MATCH(Tabel2[[#This Row],[Medl.nr. :]],Bogføring!$E:$E,0),0))","v":""},{"$f":"SUMIFS(Bogføring!I:I,Bogføring!F:F,\"=\"&$L$5,Bogføring!E:E,\"=\"&A103)","v":0},{"$f":"IF(N103=0,\"\",SUMIFS(Bogføring!B:B,Bogføring!F:F,\"=\"&$N$5,Bogføring!E:E,\"=\"&A103))","v":""},{"$f":"SUMIFS(Bogføring!I:I,Bogføring!F:F,\"=\"&$N$5,Bogføring!E:E,\"=\"&A103)","v":0},{"$f":"IF(N103=0,\"\",SUMIFS(Bogføring!$B:$B,Bogføring!$F:$F,\"=\"&$P$5,Bogføring!$E:$E,\"=\"&A103))","v":""},{"$f":"SUMIFS(Bogføring!$I:$I,Bogføring!$F:$F,\"=\"&$P$5,Bogføring!$E:$E,\"=\"&A103)","v":0}]
[100,"Kurt Friedrich Peters","Søndre Allé 30",3700,"Rønne",56958686,"kurt.peters@dadelnet.dk",null,null,100,{"$f":"IF(L104=0,\"\",INDEX(Bogføring!$B:$B,MATCH(Tabel2[[#This Row],[Medl.nr. :]],Bogføring!$E:$E,0),0))","v":""},{"$f":"SUMIFS(Bogføring!I:I,Bogføring!F:F,\"=\"&$L$5,Bogføring!E:E,\"=\"&A104)","v":0},{"$f":"IF(N104=0,\"\",SUMIFS(Bogføring!B:B,Bogføring!F:F,\"=\"&$N$5,Bogføring!E:E,\"=\"&A104))","v":""},{"$f":"SUMIFS(Bogføring!I:I,Bogføring!F:F,\"=\"&$N$5,Bogføring!E:E,\"=\"&A104)","v":0},{"$f":"IF(N104=0,\"\",SUMIFS(Bogføring!$B:$B,Bogføring!$F:$F,\"=\"&$P$5,Bogføring!$E:$E,\"=\"&A104))","v":""},{"$f":"SUMIFS(Bogføring!$I:$I,Bogføring!$F:$F,\"=\"&$P$5,Bogføring!$E:$E,\"=\"&A104)","v":0}]
[101,"Gunnar Kofoed","Lillegade 20",3700,"Rønne",51329941,"gunnar-kofoed@gmail.com",null,null,101,{"$f":"IF(L105=0,\"\",INDEX(Bogføring!$B:$B,MATCH(Tabel2[[#This Row],[Medl.nr. :]],Bogføring!$E:$E,0),0))","v":""},{"$f":"SUMIFS(Bogføring!I:I,Bogføring!F:F,\"=\"&$L$5,Bogføring!E:E,\"=\"&A105)","v":0},{"$f":"IF(N105=0,\"\",SUMIFS(Bogføring!B:B,Bogføring!F:F,\"=\"&$N$5,Bogføring!E:E,\"=\"&A105))","v":""},{"$f":"SUMIFS(Bogføring!I:I,Bogføring!F:F,\"=\"&$N$5,Bogføring!E:E,\"=\"&A105)","v":0},{"$f":"IF(N105=0,\"\",SUMIFS(Bogføring!$B:$B,Bogføring!$F:$F,\"=\"&$P$5,Bogføring!$E:$E,\"=\"&A105))","v":""},{"$f":"SUMIFS(Bogføring!$I:$I,Bogføring!$F:$F,\"=\"&$P$5,Bogføring!$E:$E,\"=\"&A105)","v":0}]
[102,"Mogens Christoffersen","Pingels Allé 70",3700,"Rønne",56951013,"mac@teliamail.dk",null,null,102,{"$f":"IF(L106=0,\"\",INDEX(Bogføring!$B:$B,MATCH(Tabel2[[#This Row],[Medl.nr. :]],Bogføring!$E:$E,0),0))","v":""},{"$f":"SUMIFS(Bogføring!I:I,Bogføring!F:F,\"=\"&$L$5,Bogføring!E:E,\"=\"&A106)","v":0},{"$f":"IF(N106=0,\"\",SUMIFS(Bogføring!B:B,Bogføring!F:F,\"=\"&$N$5,Bogføring!E:E,\"=\"&A106))","v":""},{"$f":"SUMIFS(Bogføring!I:I,Bogføring!F:F,\"=\"&$N$5,Bogføring!E:E,\"=\"&A106)","v":0},{"$f":"IF(N106=0,\"\",SUMIFS(Bogføring!$B:$B,Bogføring!$F:$F,\"=\"&$P$5,Bogføring!$E:$E,\"=\"&A106))","v":""},{"$f":"SUMIFS(Bogføring!$I:$I,Bogføring!$F:$F,\"=\"&$P$5,Bogføring!$E:$E,\"=\"&A106)","v":0}]
[103,"Kjeld E. Hansen","Torneværksvej 36",3700,"Rønne",56955076,"torn@hansen.mail.dk",null,null,103,{"$f":"IF(L107=0,\"\",INDEX(Bogføring!$B:$B,MATCH(Tabel2[[#This Row],[Medl.nr. :]],Bogføring!$E:$E,0),0))","v":""},{"$f":"SUMIFS(Bogføring!I:I,Bogføring!F:F,\"=\"&$L$5,Bogføring!E:E,\"=\"&A107)","v":0},{"$f":"IF(N107=0,\"\",SUMIFS(Bogføring!B:B,Bogføring!F:F,\"=\"&$N$5,Bogføring!E:E,\"=\"&A107))","v":""},{"$f":"SUMIFS(Bogføring!I:I,Bogføring!F:F,\"=\"&$N$5,Bogføring!E:E,\"=\"&A107)","v":0},{"$f":"IF(N107=0,\"\",SUMIFS(Bogføring!$B:$B,Bogføring!$F:$F,\"=\"&$P$5,Bogføring!$E:$E,\"=\"&A107))","v":""},{"$f":"SUMIFS(Bogføring!$I:$I,Bogføring!$F:$F,\"=\"&$P$5,Bogføring!$E:$E,\"=\"&A107)","v":0}]
[104,"Christian J. Duch","Borreshovedvej 5",4654,"Fakse Ladeplads",21220340,"christianduch@fakse-ladeplads.dk",null,null,104,{"$f":"IF(L108=0,\"\",INDEX(Bogføring!$B:$B,MATCH(Tabel2[[#This Row],[Medl.nr. :]],Bogføring!$E:$E,0),0))","v":""},{"$f":"SUMIFS(Bogføring!I:I,Bogføring!F:F,\"=\"&$L$5,Bogføring!E:E,\"=\"&A108)","v":0},{"$f":"IF(N108=0,\"\",SUMIFS(Bogføring!B:B,Bogføring!F:F,\"=\"&$N$5,Bogføring!E:E,\"=\"&A108))","v":""},{"$f":"SUMIFS(Bogføring!I:I,Bogføring!F:F,\"=\"&$N$5,Bogføring!E:E,\"=\"&A108)","v":0},{"$f":"IF(N108=0,\"\",SUMIFS(Bogføring!$B:$B,Bogføring!$F:$F,\"=\"&$P$5,Bogføring!$E:$E,\"=\"&A108))","v":""},{"$f":"SUMIFS(Bogføring!$I:$I,Bogføring!$F:$F,\"=\"&$P$5,Bogføring!$E:$E,\"=\"&A108)","v":0}]
[105,"Lauge Madsen","Østergade 19",4171,"Glumsø",57646877,"inge-lise@madsen.adsl.tdc.dk",null,null,105,{"$f":"IF(L109=0,\"\",INDEX(Bogføring!$B:$B,MATCH(Tabel2[[#This Row],[Medl.nr. :]],Bogføring!$E:$E,0),0))","v":""},{"$f":"SUMIFS(Bogføring!I:I,Bogføring!F:F,\"=\"&$L$5,Bogføring!E:E,\"=\"&A109)","v":0},{"$f":"IF(N109=0,\"\",SUMIFS(Bogføring!B:B,Bogføring!F:F,\"=\"&$N$5,Bogføring!E:E,\"=\"&A109))","v":""},{"$f":"SUMIFS(Bogføring!I:I,Bogføring!F:F,\"=\"&$N$5,Bogføring!E:E,\"=\"&A109)","v":0},{"$f":"IF(N109=0,\"\",SUMIFS(Bogføring!$B:$B,Bogføring!$F:$F,\"=\"&$P$5,Bogføring!$E:$E,\"=\"&A109))","v":""},{"$f":"SUMIFS(Bogføring!$I:$I,Bogføring!$F:$F,\"=\"&$P$5,Bogføring!$E:$E,\"=\"&A109)","v":0}]
[106,"Bjarne Lind","Strandvejen 140",3700,"Rønne",21750454,"b.lind@privat.dk",null,"Har betalt 2 gange, 31/3/20 - næste år",106,{"$f":"IF(L110=0,\"\",INDEX(Bogføring!$B:$B,MATCH(Tabel2[[#This Row],[Medl.nr. :]],Bogføring!$E:$E,0),0))","v":""},{"$f":"SUMIFS(Bogføring!I:I,Bogføring!F:F,\"=\"&$L$5,Bogføring!E:E,\"=\"&A110)","v":0},{"$f":"IF(N110=0,\"\",SUMIFS(Bogføring!B:B,Bogføring!F:F,\"=\"&$N$5,Bogføring!E:E,\"=\"&A110))","v":""},{"$f":"SUMIFS(Bogføring!I:I,Bogføring!F:F,\"=\"&$N$5,Bogføring!E:E,\"=\"&A110)","v":0},{"$f":"IF(N110=0,\"\",SUMIFS(Bogføring!$B:$B,Bogføring!$F:$F,\"=\"&$P$5,Bogføring!$E:$E,\"=\"&A110))","v":""},{"$f":"SUMIFS(Bogføring!$I:$I,Bogføring!$F:$F,\"=\"&$P$5,Bogføring!$E:$E,\"=\"&A110)","v":0}]
[107,"Vagn Risager","Ndr. Strandvej 73, Tejn",3770,"Allinge",21275950,"vri@mail.dk",null,"Har betalt 2 gange, 13/3/20 - næste år",107,{"$f":"IF(L111=0,\"\",INDEX(Bogføring!$B:$B,MATCH(Tabel2[[#This Row],[Medl.nr. :]],Bogføring!$E:$E,0),0))","v":""},{"$f":"SUMIFS(Bogføring!I:I,Bogføring!F:F,\"=\"&$L$5,Bogføring!E:E,\"=\"&A111)","v":0},{"$f":"IF(N111=0,\"\",SUMIFS(Bogføring!B:B,Bogføring!F:F,\"=\"&$N$5,Bogføring!E:E,\"=\"&A111))","v":""},{"$f":"SUMIFS(Bogføring!I:I,Bogføring!F:F,\"=\"&$N$5,Bogføring!E:E,\"=\"&A111)","v":0},{"$f":"IF(N111=0,\"\",SUMIFS(Bogføring!$B:$B,Bogføring!$F:$F,\"=\"&$P$5,Bogføring!$E:$E,\"=\"&A111))","v":""},{"$f":"SUMIFS(Bogføring!$I:$I,Bogføring!$F:$F,\"=\"&$P$5,Bogføring!$E:$E,\"=\"&A111)","v":0}]
[108,"Kornel L. Christiansen","Blykobbevej 26",3700,"Rønne",56952610,"jytte-kornel@post.tele.dk",null,null,108,{"$f":"IF(L112=0,\"\",INDEX(Bogføring!$B:$B,MATCH(Tabel2[[#This Row],[Medl.nr. :]],Bogføring!$E:$E,0),0))","v":""},{"$f":"SUMIFS(Bogføring!I:I,Bogføring!F:F,\"=\"&$L$5,Bogføring!E:E,\"=\"&A112)","v":0},{"$f":"IF(N112=0,\"\",SUMIFS(Bogføring!B:B,Bogføring!F:F,\"=\"&$N$5,Bogføring!E:E,\"=\"&A112))","v":""},{"$f":"SUMIFS(Bogføring!I:I,Bogføring!F:F,\"=\"&$N$5,Bogføring!E:E,\"=\"&A112)","v":0},{"$f":"IF(N112=0,\"\",SUMIFS(Bogføring!$B:$B,Bogføring!$F:$F,\"=\"&$P$5,Bogføring!$E:$E,\"=\"&A112))","v":""},{"$f":"SUMIFS(Bogføring!$I:$I,Bogføring!$F:$F,\"=\"&$P$5,Bogføring!$E:$E,\"=\"&A112)","v":0}]
[109,"Svend Rasmussen","Kjeldgårdsvej 8, Gl. Mollerup",7900,"Nykøbing Mors",20153735,"svendrasmussen@hotmail.com",2018,null,109,{"$f":"IF(L113=0,\"\",INDEX(Bogføring!$B:$B,MATCH(Tabel2[[#This Row],[Medl.nr. :]],Bogføring!$E:$E,0),0))","v":""},{"$f":"SUMIFS(Bogføring!I:I,Bogføring!F:F,\"=\"&$L$5,Bogføring!E:E,\"=\"&A113)","v":0},{"$f":"IF(N113=0,\"\",SUMIFS(Bogføring!B:B,Bogføring!F:F,\"=\"&$N$5,Bogføring!E:E,\"=\"&A113))","v":""},{"$f":"SUMIFS(Bogføring!I:I,Bogføring!F:F,\"=\"&$N$5,Bogføring!E:E,\"=\"&A113)","v":0},{"$f":"IF(N113=0,\"\",SUMIFS(Bogføring!$B:$B,Bogføring!$F:$F,\"=\"&$P$5,Bogføring!$E:$E,\"=\"&A113))","v":""},{"$f":"SUMIFS(Bogføring!$I:$I,Bogføring!$F:$F,\"=\"&$P$5,Bogføring!$E:$E,\"=\"&A113)","v":0}]
[110,"Kaj Grøn","Egeløkken 14",3700,"Rønne",56952592,"kgron@mail.dk",null,null,110,{"$f":"IF(L114=0,\"\",INDEX(Bogføring!$B:$B,MATCH(Tabel2[[#This Row],[Medl.nr. :]],Bogføring!$E:$E,0),0))","v":""},{"$f":"SUMIFS(Bogføring!I:I,Bogføring!F:F,\"=\"&$L$5,Bogføring!E:E,\"=\"&A114)","v":0},{"$f":"IF(N114=0,\"\",SUMIFS(Bogføring!B:B,Bogføring!F:F,\"=\"&$N$5,Bogføring!E:E,\"=\"&A114))","v":""},{"$f":"SUMIFS(Bogføring!I:I,Bogføring!F:F,\"=\"&$N$5,Bogføring!E:E,\"=\"&A114)","v":0},{"$f":"IF(N114=0,\"\",SUMIFS(Bogføring!$B:$B,Bogføring!$F:$F,\"=\"&$P$5,Bogføring!$E:$E,\"=\"&A114))","v":""},{"$f":"SUMIFS(Bogføring!$I:$I,Bogføring!$F:$F,\"=\"&$P$5,Bogføring!$E:$E,\"=\"&A114)","v":0}]
[111,"Carl Ilsøe","Kapelvej 15",3700,"Rønne",30181939,"carlilsoe@gmail.com",null,null,111,{"$f":"IF(L115=0,\"\",INDEX(Bogføring!$B:$B,MATCH(Tabel2[[#This Row],[Medl.nr. :]],Bogføring!$E:$E,0),0))","v":""},{"$f":"SUMIFS(Bogføring!I:I,Bogføring!F:F,\"=\"&$L$5,Bogføring!E:E,\"=\"&A115)","v":0},{"$f":"IF(N115=0,\"\",SUMIFS(Bogføring!B:B,Bogføring!F:F,\"=\"&$N$5,Bogføring!E:E,\"=\"&A115))","v":""},{"$f":"SUMIFS(Bogføring!I:I,Bogføring!F:F,\"=\"&$N$5,Bogføring!E:E,\"=\"&A115)","v":0},{"$f":"IF(N115=0,\"\",SUMIFS(Bogføring!$B:$B,Bogføring!$F:$F,\"=\"&$P$5,Bogføring!$E:$E,\"=\"&A115))","v":""},{"$f":"SUMIFS(Bogføring!$I:$I,Bogføring!$F:$F,\"=\"&$P$5,Bogføring!$E:$E,\"=\"&A115)","v":0}]
[112,"Nicolai Ilsted Bech","Teglporten 16",3460,"Birkerød",60777958,"ilsted.nb@gmail.com",2018,null,112,{"$f":"IF(L116=0,\"\",INDEX(Bogføring!$B:$B,MATCH(Tabel2[[#This Row],[Medl.nr. :]],Bogføring!$E:$E,0),0))","v":""},{"$f":"SUMIFS(Bogføring!I:I,Bogføring!F:F,\"=\"&$L$5,Bogføring!E:E,\"=\"&A116)","v":0},{"$f":"IF(N116=0,\"\",SUMIFS(Bogføring!B:B,Bogføring!F:F,\"=\"&$N$5,Bogføring!E:E,\"=\"&A116))","v":""},{"$f":"SUMIFS(Bogføring!I:I,Bogføring!F:F,\"=\"&$N$5,Bogføring!E:E,\"=\"&A116)","v":0},{"$f":"IF(N116=0,\"\",SUMIFS(Bogføring!$B:$B,Bogføring!$F:$F,\"=\"&$P$5,Bogføring!$E:$E,\"=\"&A116))","v":""},{"$f":"SUMIFS(Bogføring!$I:$I,Bogføring!$F:$F,\"=\"&$P$5,Bogføring!$E:$E,\"=\"&A116)","v":0}]
[113,"Marianne Thomsen Kjæmpe","Røglevænget 5",3450,"Allerød",null,"Marianne@kjoeller.dk",null,null,113,{"$f":"IF(L117=0,\"\",INDEX(Bogføring!$B:$B,MATCH(Tabel2[[#This Row],[Medl.nr. :]],Bogføring!$E:$E,0),0))","v":""},{"$f":"SUMIFS(Bogføring!I:I,Bogføring!F:F,\"=\"&$L$5,Bogføring!E:E,\"=\"&A117)","v":0},{"$f":"IF(N117=0,\"\",SUMIFS(Bogføring!B:B,Bogføring!F:F,\"=\"&$N$5,Bogføring!E:E,\"=\"&A117))","v":""},{"$f":"SUMIFS(Bogføring!I:I,Bogføring!F:F,\"=\"&$N$5,Bogføring!E:E,\"=\"&A117)","v":0},{"$f":"IF(N117=0,\"\",SUMIFS(Bogføring!$B:$B,Bogføring!$F:$F,\"=\"&$P$5,Bogføring!$E:$E,\"=\"&A117))","v":""},{"$f":"SUMIFS(Bogføring!$I:$I,Bogføring!$F:$F,\"=\"&$P$5,Bogføring!$E:$E,\"=\"&A117)","v":0}]
[114,"Henning Søby Andersen","Hedebovej 31",3700,"Rønne",24851642,"hsoebyandersen1961@gmail.com",null,null,114,{"$f":"IF(L118=0,\"\",INDEX(Bogføring!$B:$B,MATCH(Tabel2[[#This Row],[Medl.nr. :]],Bogføring!$E:$E,0),0))","v":""},{"$f":"SUMIFS(Bogføring!I:I,Bogføring!F:F,\"=\"&$L$5,Bogføring!E:E,\"=\"&A118)","v":0},{"$f":"IF(N118=0,\"\",SUMIFS(Bogføring!B:B,Bogføring!F:F,\"=\"&$N$5,Bogføring!E:E,\"=\"&A118))","v":""},{"$f":"SUMIFS(Bogføring!I:I,Bogføring!F:F,\"=\"&$N$5,Bogføring!E:E,\"=\"&A118)","v":0},{"$f":"IF(N118=0,\"\",SUMIFS(Bogføring!$B:$B,Bogføring!$F:$F,\"=\"&$P$5,Bogføring!$E:$E,\"=\"&A118))","v":""},{"$f":"SUMIFS(Bogføring!$I:$I,Bogføring!$F:$F,\"=\"&$P$5,Bogføring!$E:$E,\"=\"&A118)","v":0}]
[115,"Anders Koefoed Larsen","Kampeløkken 9",3770,"Allinge",40322002,"akl@sport.dk",null,null,115,{"$f":"IF(L119=0,\"\",INDEX(Bogføring!$B:$B,MATCH(Tabel2[[#This Row],[Medl.nr. :]],Bogføring!$E:$E,0),0))","v":""},{"$f":"SUMIFS(Bogføring!I:I,Bogføring!F:F,\"=\"&$L$5,Bogføring!E:E,\"=\"&A119)","v":0},{"$f":"IF(N119=0,\"\",SUMIFS(Bogføring!B:B,Bogføring!F:F,\"=\"&$N$5,Bogføring!E:E,\"=\"&A119))","v":""},{"$f":"SUMIFS(Bogføring!I:I,Bogføring!F:F,\"=\"&$N$5,Bogføring!E:E,\"=\"&A119)","v":0},{"$f":"IF(N119=0,\"\",SUMIFS(Bogføring!$B:$B,Bogføring!$F:$F,\"=\"&$P$5,Bogføring!$E:$E,\"=\"&A119))","v":""},{"$f":"SUMIFS(Bogføring!$I:$I,Bogføring!$F:$F,\"=\"&$P$5,Bogføring!$E:$E,\"=\"&A119)","v":0}]
[116,"Holger Fuglsang-Damgård","Pæretræsdalen 12",3700,"Rønne",23305594,"fuglsang@info.dk",null,null,116,{"$f":"IF(L120=0,\"\",INDEX(Bogføring!$B:$B,MATCH(Tabel2[[#This Row],[Medl.nr. :]],Bogføring!$E:$E,0),0))","v":""},{"$f":"SUMIFS(Bogføring!I:I,Bogføring!F:F,\"=\"&$L$5,Bogføring!E:E,\"=\"&A120)","v":0},{"$f":"IF(N120=0,\"\",SUMIFS(Bogføring!B:B,Bogføring!F:F,\"=\"&$N$5,Bogføring!E:E,\"=\"&A120))","v":""},{"$f":"SUMIFS(Bogføring!I:I,Bogføring!F:F,\"=\"&$N$5,Bogføring!E:E,\"=\"&A120)","v":0},{"$f":"IF(N120=0,\"\",SUMIFS(Bogføring!$B:$B,Bogføring!$F:$F,\"=\"&$P$5,Bogføring!$E:$E,\"=\"&A120))","v":""},{"$f":"SUMIFS(Bogføring!$I:$I,Bogføring!$F:$F,\"=\"&$P$5,Bogføring!$E:$E,\"=\"&A120)","v":0}]
[117,"Martin Kaltoft","Lille Madsegade 19",3700,"Rønne",40412349,"seattle@mail.tele.dk",null,"OBS - 2019 - betalt til og med 2029",117,{"$f":"IF(L121=0,\"\",INDEX(Bogføring!$B:$B,MATCH(Tabel2[[#This Row],[Medl.nr. :]],Bogføring!$E:$E,0),0))","v":""},{"$f":"SUMIFS(Bogføring!I:I,Bogføring!F:F,\"=\"&$L$5,Bogføring!E:E,\"=\"&A121)","v":0},{"$f":"IF(N121=0,\"\",SUMIFS(Bogføring!B:B,Bogføring!F:F,\"=\"&$N$5,Bogføring!E:E,\"=\"&A121))","v":""},{"$f":"SUMIFS(Bogføring!I:I,Bogføring!F:F,\"=\"&$N$5,Bogføring!E:E,\"=\"&A121)","v":0},{"$f":"IF(N121=0,\"\",SUMIFS(Bogføring!$B:$B,Bogføring!$F:$F,\"=\"&$P$5,Bogføring!$E:$E,\"=\"&A121))","v":""},{"$f":"SUMIFS(Bogføring!$I:$I,Bogføring!$F:$F,\"=\"&$P$5,Bogføring!$E:$E,\"=\"&A121)","v":0}]
[118,"Poul Johnny Drachmann","Toftelunden 24",3790,"Hasle",61713848,"johnny.drachmann@gmail.com",2018,null,118,{"$f":"IF(L122=0,\"\",INDEX(Bogføring!$B:$B,MATCH(Tabel2[[#This Row],[Medl.nr. :]],Bogføring!$E:$E,0),0))","v":""},{"$f":"SUMIFS(Bogføring!I:I,Bogføring!F:F,\"=\"&$L$5,Bogføring!E:E,\"=\"&A122)","v":0},{"$f":"IF(N122=0,\"\",SUMIFS(Bogføring!B:B,Bogføring!F:F,\"=\"&$N$5,Bogføring!E:E,\"=\"&A122))","v":""},{"$f":"SUMIFS(Bogføring!I:I,Bogføring!F:F,\"=\"&$N$5,Bogføring!E:E,\"=\"&A122)","v":0},{"$f":"IF(N122=0,\"\",SUMIFS(Bogføring!$B:$B,Bogføring!$F:$F,\"=\"&$P$5,Bogføring!$E:$E,\"=\"&A122))","v":""},{"$f":"SUMIFS(Bogføring!$I:$I,Bogføring!$H:$H,\"=\"&$P$5,Bogføring!$E:$E,\"=\"&A122)","v":0}]
[119,"John V. Jakobsen","Kong Georgs Vej 88, 4 th.",2000,"Frederiksberg",28608077,"jvarmark@gmail.com",null,null,119,{"$f":"IF(L123=0,\"\",INDEX(Bogføring!$B:$B,MATCH(Tabel2[[#This Row],[Medl.nr. :]],Bogføring!$E:$E,0),0))","v":""},{"$f":"SUMIFS(Bogføring!I:I,Bogføring!F:F,\"=\"&$L$5,Bogføring!E:E,\"=\"&A123)","v":0},{"$f":"IF(N123=0,\"\",SUMIFS(Bogføring!B:B,Bogføring!F:F,\"=\"&$N$5,Bogføring!E:E,\"=\"&A123))","v":""},{"$f":"SUMIFS(Bogføring!I:I,Bogføring!F:F,\"=\"&$N$5,Bogføring!E:E,\"=\"&A123)","v":0},{"$f":"IF(N123=0,\"\",SUMIFS(Bogføring!$B:$B,Bogføring!$F:$F,\"=\"&$P$5,Bogføring!$E:$E,\"=\"&A123))","v":""},{"$f":"SUMIFS(Bogføring!$I:$I,Bogføring!$H:$H,\"=\"&$P$5,Bogføring!$E:$E,\"=\"&A123)","v":0}]
[120,"Aage Juul","Svanekevej 19",3700,"Rønne",56952410,"aagejuul@mail.dk",null,null,120,{"$f":"IF(L124=0,\"\",INDEX(Bogføring!$B:$B,MATCH(Tabel2[[#This Row],[Medl.nr. :]],Bogføring!$E:$E,0),0))","v":""},{"$f":"SUMIFS(Bogføring!I:I,Bogføring!F:F,\"=\"&$L$5,Bogføring!E:E,\"=\"&A124)","v":0},{"$f":"IF(N124=0,\"\",SUMIFS(Bogføring!B:B,Bogføring!F:F,\"=\"&$N$5,Bogføring!E:E,\"=\"&A124))","v":""},{"$f":"SUMIFS(Bogføring!I:I,Bogføring!F:F,\"=\"&$N$5,Bogføring!E:E,\"=\"&A124)","v":0},{"$f":"IF(N124=0,\"\",SUMIFS(Bogføring!$B:$B,Bogføring!$F:$F,\"=\"&$P$5,Bogføring!$E:$E,\"=\"&A124))","v":""},{"$f":"SUMIFS(Bogføring!$I:$I,Bogføring!$H:$H,\"=\"&$P$5,Bogføring!$E:$E,\"=\"&A124)","v":0}]
[121,"Ole og Gurli Hansen","Munkegårdsvejen 10, Poulsker",3730,"Nexø",42211180,"gurli@mailreal.dk",null,null,121,{"$f":"IF(L125=0,\"\",INDEX(Bogføring!$B:$B,MATCH(Tabel2[[#This Row],[Medl.nr. :]],Bogføring!$E:$E,0),0))","v":""},{"$f":"SUMIFS(Bogføring!I:I,Bogføring!F:F,\"=\"&$L$5,Bogføring!E:E,\"=\"&A125)","v":0},{"$f":"IF(N125=0,\"\",SUMIFS(Bogføring!B:B,Bogføring!F:F,\"=\"&$N$5,Bogføring!E:E,\"=\"&A125))","v":""},{"$f":"SUMIFS(Bogføring!I:I,Bogføring!F:F,\"=\"&$N$5,Bogføring!E:E,\"=\"&A125)","v":0},{"$f":"IF(N125=0,\"\",SUMIFS(Bogføring!$B:$B,Bogføring!$F:$F,\"=\"&$P$5,Bogføring!$E:$E,\"=\"&A125))","v":""},{"$f":"SUMIFS(Bogføring!$I:$I,Bogføring!$H:$H,\"=\"&$P$5,Bogføring!$E:$E,\"=\"&A125)","v":0}]
[122,"Noomi og Peter Aage Bak","Rønnevej 132, Nylars",3700,"Rønne",56972166,"peteraagebak@gmail.com",null,null,122,{"$f":"IF(L126=0,\"\",INDEX(Bogføring!$B:$B,MATCH(Tabel2[[#This Row],[Medl.nr. :]],Bogføring!$E:$E,0),0))","v":""},{"$f":"SUMIFS(Bogføring!I:I,Bogføring!F:F,\"=\"&$L$5,Bogføring!E:E,\"=\"&A126)","v":0},{"$f":"IF(N126=0,\"\",SUMIFS(Bogføring!B:B,Bogføring!F:F,\"=\"&$N$5,Bogføring!E:E,\"=\"&A126))","v":""},{"$f":"SUMIFS(Bogføring!I:I,Bogføring!F:F,\"=\"&$N$5,Bogføring!E:E,\"=\"&A126)","v":0},{"$f":"IF(N126=0,\"\",SUMIFS(Bogføring!$B:$B,Bogføring!$F:$F,\"=\"&$P$5,Bogføring!$E:$E,\"=\"&A126))","v":""},{"$f":"SUMIFS(Bogføring!$I:$I,Bogføring!$H:$H,\"=\"&$P$5,Bogføring!$E:$E,\"=\"&A126)","v":0}]
[123,"Carl Emil Kragh","Helgenæsvej 175",4900,"Nakskov",51158426,"cekragh@youmail.dk",null,null,123,{"$f":"IF(L127=0,\"\",INDEX(Bogføring!$B:$B,MATCH(Tabel2[[#This Row],[Medl.nr. :]],Bogføring!$E:$E,0),0))","v":""},{"$f":"SUMIFS(Bogføring!I:I,Bogføring!F:F,\"=\"&$L$5,Bogføring!E:E,\"=\"&A127)","v":0},{"$f":"IF(N127=0,\"\",SUMIFS(Bogføring!B:B,Bogføring!F:F,\"=\"&$N$5,Bogføring!E:E,\"=\"&A127))","v":""},{"$f":"SUMIFS(Bogføring!I:I,Bogføring!F:F,\"=\"&$N$5,Bogføring!E:E,\"=\"&A127)","v":0},{"$f":"IF(N127=0,\"\",SUMIFS(Bogføring!$B:$B,Bogføring!$F:$F,\"=\"&$P$5,Bogføring!$E:$E,\"=\"&A127))","v":""},{"$f":"SUMIFS(Bogføring!$I:$I,Bogføring!$H:$H,\"=\"&$P$5,Bogføring!$E:$E,\"=\"&A127)","v":0}]
[124,"Jørn Koefoed Larsen","Mågevej 34, Madsnedø",4760,"Vordingborg",23628188,"masnedbo34@gmail.com",null,null,124,{"$f":"IF(L128=0,\"\",INDEX(Bogføring!$B:$B,MATCH(Tabel2[[#This Row],[Medl.nr. :]],Bogføring!$E:$E,0),0))","v":""},{"$f":"SUMIFS(Bogføring!I:I,Bogføring!F:F,\"=\"&$L$5,Bogføring!E:E,\"=\"&A128)","v":0},{"$f":"IF(N128=0,\"\",SUMIFS(Bogføring!B:B,Bogføring!F:F,\"=\"&$N$5,Bogføring!E:E,\"=\"&A128))","v":""},{"$f":"SUMIFS(Bogføring!I:I,Bogføring!F:F,\"=\"&$N$5,Bogføring!E:E,\"=\"&A128)","v":0},{"$f":"IF(N128=0,\"\",SUMIFS(Bogføring!$B:$B,Bogføring!$F:$F,\"=\"&$P$5,Bogføring!$E:$E,\"=\"&A128))","v":""},{"$f":"SUMIFS(Bogføring!$I:$I,Bogføring!$H:$H,\"=\"&$P$5,Bogføring!$E:$E,\"=\"&A128)","v":0}]
[125,"Jørgen Jensen","Stenhusvej 2",4130,"Viby Sj.",23414178,"jfmj78@gmail.com",2020,null,125,{"$f":"IF(L129=0,\"\",INDEX(Bogføring!$B:$B,MATCH(Tabel2[[#This Row],[Medl.nr. :]],Bogføring!$E:$E,0),0))","v":""},{"$f":"SUMIFS(Bogføring!I:I,Bogføring!F:F,\"=\"&$L$5,Bogføring!E:E,\"=\"&A129)","v":0},{"$f":"IF(N129=0,\"\",SUMIFS(Bogføring!B:B,Bogføring!F:F,\"=\"&$N$5,Bogføring!E:E,\"=\"&A129))","v":""},{"$f":"SUMIFS(Bogføring!I:I,Bogføring!F:F,\"=\"&$N$5,Bogføring!E:E,\"=\"&A129)","v":0},{"$f":"IF(N129=0,\"\",SUMIFS(Bogføring!$B:$B,Bogføring!$F:$F,\"=\"&$P$5,Bogføring!$E:$E,\"=\"&A129))","v":""},{"$f":"SUMIFS(Bogføring!$I:$I,Bogføring!$H:$H,\"=\"&$P$5,Bogføring!$E:$E,\"=\"&A129)","v":0}]
[126,"Ole Hassager","Ved Grænsen 62",2000,"Frederiksberg",23652303,"ole.hassager@gmail.com",2020,null,126,{"$f":"IF(L130=0,\"\",INDEX(Bogføring!$B:$B,MATCH(Tabel2[[#This Row],[Medl.nr. :]],Bogføring!$E:$E,0),0))","v":""},{"$f":"SUMIFS(Bogføring!I:I,Bogføring!F:F,\"=\"&$L$5,Bogføring!E:E,\"=\"&A130)","v":0},{"$f":"IF(N130=0,\"\",SUMIFS(Bogføring!B:B,Bogføring!F:F,\"=\"&$N$5,Bogføring!E:E,\"=\"&A130))","v":""},{"$f":"SUMIFS(Bogføring!I:I,Bogføring!F:F,\"=\"&$N$5,Bogføring!E:E,\"=\"&A130)","v":0},{"$f":"IF(N130=0,\"\",SUMIFS(Bogføring!$B:$B,Bogføring!$F:$F,\"=\"&$P$5,Bogføring!$E:$E,\"=\"&A130))","v":""},{"$f":"SUMIFS(Bogføring!$I:$I,Bogføring!$H:$H,\"=\"&$P$5,Bogføring!$E:$E,\"=\"&A130)","v":0}]
[127,"Per K. Funch","Skarpegade 5",3700,"Rønne",null,"GIRO",null,null,127,{"$f":"IF(L131=0,\"\",INDEX(Bogføring!$B:$B,MATCH(Tabel2[[#This Row],[Medl.nr. :]],Bogføring!$E:$E,0),0))","v":""},{"$f":"SUMIFS(Bogføring!I:I,Bogføring!F:F,\"=\"&$L$5,Bogføring!E:E,\"=\"&A131)","v":0},{"$f":"IF(N131=0,\"\",SUMIFS(Bogføring!B:B,Bogføring!F:F,\"=\"&$N$5,Bogføring!E:E,\"=\"&A131))","v":""},{"$f":"SUMIFS(Bogføring!I:I,Bogføring!F:F,\"=\"&$N$5,Bogføring!E:E,\"=\"&A131)","v":0},{"$f":"IF(N131=0,\"\",SUMIFS(Bogføring!$B:$B,Bogføring!$F:$F,\"=\"&$P$5,Bogføring!$E:$E,\"=\"&A131))","v":""},{"$f":"SUMIFS(Bogføring!$I:$I,Bogføring!$H:$H,\"=\"&$P$5,Bogføring!$E:$E,\"=\"&A131)","v":0}]
[128,"Niels Bøje P. Karlsen","Torneværksvej 45,1 lejl. 5",3700,"Rønne",40203559,"GIRO",2019,null,128,{"$f":"IF(L132=0,\"\",INDEX(Bogføring!$B:$B,MATCH(Tabel2[[#This Row],[Medl.nr. :]],Bogføring!$E:$E,0),0))","v":""},{"$f":"SUMIFS(Bogføring!I:I,Bogføring!F:F,\"=\"&$L$5,Bogføring!E:E,\"=\"&A132)","v":0},{"$f":"IF(N132=0,\"\",SUMIFS(Bogføring!B:B,Bogføring!F:F,\"=\"&$N$5,Bogføring!E:E,\"=\"&A132))","v":""},{"$f":"SUMIFS(Bogføring!I:I,Bogføring!F:F,\"=\"&$N$5,Bogføring!E:E,\"=\"&A132)","v":0},{"$f":"IF(N132=0,\"\",SUMIFS(Bogføring!$B:$B,Bogføring!$F:$F,\"=\"&$P$5,Bogføring!$E:$E,\"=\"&A132))","v":""},{"$f":"SUMIFS(Bogføring!$I:$I,Bogføring!$H:$H,\"=\"&$P$5,Bogføring!$E:$E,\"=\"&A132)","v":0}]
[129,"Ebba L. Bang","Skarvigen 8, Aarsdale",3740,"Svaneke",56496566,"GIRO",null,null,129,{"$f":"IF(L133=0,\"\",INDEX(Bogføring!$B:$B,MATCH(Tabel2[[#This Row],[Medl.nr. :]],Bogføring!$E:$E,0),0))","v":""},{"$f":"SUMIFS(Bogføring!I:I,Bogføring!F:F,\"=\"&$L$5,Bogføring!E:E,\"=\"&A133)","v":0},{"$f":"IF(N133=0,\"\",SUMIFS(Bogføring!B:B,Bogføring!F:F,\"=\"&$N$5,Bogføring!E:E,\"=\"&A133))","v":""},{"$f":"SUMIFS(Bogføring!I:I,Bogføring!F:F,\"=\"&$N$5,Bogføring!E:E,\"=\"&A133)","v":0},{"$f":"IF(N133=0,\"\",SUMIFS(Bogføring!$B:$B,Bogføring!$F:$F,\"=\"&$P$5,Bogføring!$E:$E,\"=\"&A133))","v":""},{"$f":"SUMIFS(Bogføring!$I:$I,Bogføring!$H:$H,\"=\"&$P$5,Bogføring!$E:$E,\"=\"&A133)","v":0}]
[130,"Jørn Nilsson","Snellemark 4",3700,"Rønne",null,"GIRO",2018,"Bet. af Jesper Nilsson - Stormgade 5",{"$f":"IF(A134=\"\",\"\",A134)","v":130},{"$f":"IF(L134=0,\"\",INDEX(Bogføring!$B:$B,MATCH(Tabel2[[#This Row],[Medl.nr. :]],Bogføring!$E:$E,0),0))","v":""},{"$f":"SUMIFS(Bogføring!I:I,Bogføring!F:F,\"=\"&$L$5,Bogføring!E:E,\"=\"&A134)","v":0},{"$f":"IF(N134=0,\"\",SUMIFS(Bogføring!B:B,Bogføring!F:F,\"=\"&$N$5,Bogføring!E:E,\"=\"&A134))","v":""},{"$f":"SUMIFS(Bogføring!I:I,Bogføring!F:F,\"=\"&$N$5,Bogføring!E:E,\"=\"&A134)","v":0},{"$f":"IF(N134=0,\"\",SUMIFS(Bogføring!$B:$B,Bogføring!$F:$F,\"=\"&$P$5,Bogføring!$E:$E,\"=\"&A134))","v":""},{"$f":"SUMIFS(Bogføring!$I:$I,Bogføring!$H:$H,\"=\"&$P$5,Bogføring!$E:$E,\"=\"&A134)","v":0}]
[131,"Ole Brandt Andersen","Æblestien 13",3700,"Rønne",29889916,"GIRO",null,null,131,{"$f":"IF(L135=0,\"\",INDEX(Bogføring!$B:$B,MATCH(Tabel2[[#This Row],[Medl.nr. :]],Bogføring!$E:$E,0),0))","v":""},{"$f":"SUMIFS(Bogføring!I:I,Bogføring!F:F,\"=\"&$L$5,Bogføring!E:E,\"=\"&A135)","v":0},{"$f":"IF(N135=0,\"\",SUMIFS(Bogføring!B:B,Bogføring!F:F,\"=\"&$N$5,Bogføring!E:E,\"=\"&A135))","v":""},{"$f":"SUMIFS(Bogføring!I:I,Bogføring!F:F,\"=\"&$N$5,Bogføring!E:E,\"=\"&A135)","v":0},{"$f":"IF(N135=0,\"\",SUMIFS(Bogføring!$B:$B,Bogføring!$F:$F,\"=\"&$P$5,Bogføring!$E:$E,\"=\"&A135))","v":""},{"$f":"SUMIFS(Bogføring!$I:$I,Bogføring!$H:$H,\"=\"&$P$5,Bogføring!$E:$E,\"=\"&A135)","v":0}]
[132,"Bent Aune","Gammel Byvej 4A, 1.th.",2650,"Hvidovre",29629091,"GIRO",null,null,132,{"$f":"IF(L136=0,\"\",INDEX(Bogføring!$B:$B,MATCH(Tabel2[[#This Row],[Medl.nr. :]],Bogføring!$E:$E,0),0))","v":""},{"$f":"SUMIFS(Bogføring!I:I,Bogføring!F:F,\"=\"&$L$5,Bogføring!E:E,\"=\"&A136)","v":0},{"$f":"IF(N136=0,\"\",SUMIFS(Bogføring!B:B,Bogføring!F:F,\"=\"&$N$5,Bogføring!E:E,\"=\"&A136))","v":""},{"$f":"SUMIFS(Bogføring!I:I,Bogføring!F:F,\"=\"&$N$5,Bogføring!E:E,\"=\"&A136)","v":0},{"$f":"IF(N136=0,\"\",SUMIFS(Bogføring!$B:$B,Bogføring!$F:$F,\"=\"&$P$5,Bogføring!$E:$E,\"=\"&A136))","v":""},{"$f":"SUMIFS(Bogføring!$I:$I,Bogføring!$H:$H,\"=\"&$P$5,Bogføring!$E:$E,\"=\"&A136)","v":0}]
[134,"Poul Dyrekær Nielsen","Diget 16",4652,"Hårlev",23906231,"GIRO",null,null,134,{"$f":"IF(L137=0,\"\",INDEX(Bogføring!$B:$B,MATCH(Tabel2[[#This Row],[Medl.nr. :]],Bogføring!$E:$E,0),0))","v":""},{"$f":"SUMIFS(Bogføring!I:I,Bogføring!F:F,\"=\"&$L$5,Bogføring!E:E,\"=\"&A137)","v":0},{"$f":"IF(N137=0,\"\",SUMIFS(Bogføring!B:B,Bogføring!F:F,\"=\"&$N$5,Bogføring!E:E,\"=\"&A137))","v":""},{"$f":"SUMIFS(Bogføring!I:I,Bogføring!F:F,\"=\"&$N$5,Bogføring!E:E,\"=\"&A137)","v":0},{"$f":"IF(N137=0,\"\",SUMIFS(Bogføring!$B:$B,Bogføring!$F:$F,\"=\"&$P$5,Bogføring!$E:$E,\"=\"&A137))","v":""},{"$f":"SUMIFS(Bogføring!$I:$I,Bogføring!$H:$H,\"=\"&$P$5,Bogføring!$E:$E,\"=\"&A137)","v":0}]
[135,"Leif Herluf Nielsen","Smålandsvej 25",3700,"Rønne",56957971,"GIRO",null,null,135,{"$f":"IF(L138=0,\"\",INDEX(Bogføring!$B:$B,MATCH(Tabel2[[#This Row],[Medl.nr. :]],Bogføring!$E:$E,0),0))","v":""},{"$f":"SUMIFS(Bogføring!I:I,Bogføring!F:F,\"=\"&$L$5,Bogføring!E:E,\"=\"&A138)","v":0},{"$f":"IF(N138=0,\"\",SUMIFS(Bogføring!B:B,Bogføring!F:F,\"=\"&$N$5,Bogføring!E:E,\"=\"&A138))","v":""},{"$f":"SUMIFS(Bogføring!I:I,Bogføring!F:F,\"=\"&$N$5,Bogføring!E:E,\"=\"&A138)","v":0},{"$f":"IF(N138=0,\"\",SUMIFS(Bogføring!$B:$B,Bogføring!$F:$F,\"=\"&$P$5,Bogføring!$E:$E,\"=\"&A138))","v":""},{"$f":"SUMIFS(Bogføring!$I:$I,Bogføring!$H:$H,\"=\"&$P$5,Bogføring!$E:$E,\"=\"&A138)","v":0}]
[136,"Kurt Mogensen","Voldgade 28",3700,"Rønne",24803842,"GIRO",null,null,136,{"$f":"IF(L139=0,\"\",INDEX(Bogføring!$B:$B,MATCH(Tabel2[[#This Row],[Medl.nr. :]],Bogføring!$E:$E,0),0))","v":""},{"$f":"SUMIFS(Bogføring!I:I,Bogføring!F:F,\"=\"&$L$5,Bogføring!E:E,\"=\"&A139)","v":0},{"$f":"IF(N139=0,\"\",SUMIFS(Bogføring!B:B,Bogføring!F:F,\"=\"&$N$5,Bogføring!E:E,\"=\"&A139))","v":""},{"$f":"SUMIFS(Bogføring!I:I,Bogføring!F:F,\"=\"&$N$5,Bogføring!E:E,\"=\"&A139)","v":0},{"$f":"IF(N139=0,\"\",SUMIFS(Bogføring!$B:$B,Bogføring!$F:$F,\"=\"&$P$5,Bogføring!$E:$E,\"=\"&A139))","v":""},{"$f":"SUMIFS(Bogføring!$I:$I,Bogføring!$H:$H,\"=\"&$P$5,Bogføring!$E:$E,\"=\"&A139)","v":0}]
[137,"Hans Hardo Holmgaard Christensen","Skørpingevej 21 a",4673,"Rødvig",21192109,"GIRO",null,"Bet. af Tina Egholm Jensen",137,{"$f":"IF(L140=0,\"\",INDEX(Bogføring!$B:$B,MATCH(Tabel2[[#This Row],[Medl.nr. :]],Bogføring!$E:$E,0),0))","v":""},{"$f":"SUMIFS(Bogføring!I:I,Bogføring!F:F,\"=\"&$L$5,Bogføring!E:E,\"=\"&A140)","v":0},{"$f":"IF(N140=0,\"\",SUMIFS(Bogføring!B:B,Bogføring!F:F,\"=\"&$N$5,Bogføring!E:E,\"=\"&A140))","v":""},{"$f":"SUMIFS(Bogføring!I:I,Bogføring!F:F,\"=\"&$N$5,Bogføring!E:E,\"=\"&A140)","v":0},{"$f":"IF(N140=0,\"\",SUMIFS(Bogføring!$B:$B,Bogføring!$F:$F,\"=\"&$P$5,Bogføring!$E:$E,\"=\"&A140))","v":""},{"$f":"SUMIFS(Bogføring!$I:$I,Bogføring!$H:$H,\"=\"&$P$5,Bogføring!$E:$E,\"=\"&A140)","v":0}]
[138,"Bente Bojesen-Koefoed","Storegade 67",3700,"Rønne",56950941,"GIRO",null,null,138,{"$f":"IF(L141=0,\"\",INDEX(Bogføring!$B:$B,MATCH(Tabel2[[#This Row],[Medl.nr. :]],Bogføring!$E:$E,0),0))","v":""},{"$f":"SUMIFS(Bogføring!I:I,Bogføring!F:F,\"=\"&$L$5,Bogføring!E:E,\"=\"&A141)","v":0},{"$f":"IF(N141=0,\"\",SUMIFS(Bogføring!B:B,Bogføring!F:F,\"=\"&$N$5,Bogføring!E:E,\"=\"&A141))","v":""},{"$f":"SUMIFS(Bogføring!I:I,Bogføring!F:F,\"=\"&$N$5,Bogføring!E:E,\"=\"&A141)","v":0},{"$f":"IF(N141=0,\"\",SUMIFS(Bogføring!$B:$B,Bogføring!$F:$F,\"=\"&$P$5,Bogføring!$E:$E,\"=\"&A141))","v":""},{"$f":"SUMIFS(Bogføring!$I:$I,Bogføring!$H:$H,\"=\"&$P$5,Bogføring!$E:$E,\"=\"&A141)","v":0}]
[139,"Fritz Olsen","Teglgårdsvej 19",3700,"Rønne",56950217,"GIRO",null,null,139,{"$f":"IF(L142=0,\"\",INDEX(Bogføring!$B:$B,MATCH(Tabel2[[#This Row],[Medl.nr. :]],Bogføring!$E:$E,0),0))","v":""},{"$f":"SUMIFS(Bogføring!I:I,Bogføring!F:F,\"=\"&$L$5,Bogføring!E:E,\"=\"&A142)","v":0},{"$f":"IF(N142=0,\"\",SUMIFS(Bogføring!B:B,Bogføring!F:F,\"=\"&$N$5,Bogføring!E:E,\"=\"&A142))","v":""},{"$f":"SUMIFS(Bogføring!I:I,Bogføring!F:F,\"=\"&$N$5,Bogføring!E:E,\"=\"&A142)","v":0},{"$f":"IF(N142=0,\"\",SUMIFS(Bogføring!$B:$B,Bogføring!$F:$F,\"=\"&$P$5,Bogføring!$E:$E,\"=\"&A142))","v":""},{"$f":"SUMIFS(Bogføring!$I:$I,Bogføring!$H:$H,\"=\"&$P$5,Bogføring!$E:$E,\"=\"&A142)","v":0}]
[140,"Birthe Jepsen","Finsensvej 7C, st.th",2000,"Frederiksberg",29661836,"GIRO",null,null,140,{"$f":"IF(L143=0,\"\",INDEX(Bogføring!$B:$B,MATCH(Tabel2[[#This Row],[Medl.nr. :]],Bogføring!$E:$E,0),0))","v":""},{"$f":"SUMIFS(Bogføring!I:I,Bogføring!F:F,\"=\"&$L$5,Bogføring!E:E,\"=\"&A143)","v":0},{"$f":"IF(N143=0,\"\",SUMIFS(Bogføring!B:B,Bogføring!F:F,\"=\"&$N$5,Bogføring!E:E,\"=\"&A143))","v":""},{"$f":"SUMIFS(Bogføring!I:I,Bogføring!F:F,\"=\"&$N$5,Bogføring!E:E,\"=\"&A143)","v":0},{"$f":"IF(N143=0,\"\",SUMIFS(Bogføring!$B:$B,Bogføring!$F:$F,\"=\"&$P$5,Bogføring!$E:$E,\"=\"&A143))","v":""},{"$f":"SUMIFS(Bogføring!$I:$I,Bogføring!$H:$H,\"=\"&$P$5,Bogføring!$E:$E,\"=\"&A143)","v":0}]
[141,"Niels Holm","Havnebakken 1 A, Lejl. 1",3700,"Rønne",56951638,"GIRO",null,null,141,{"$f":"IF(L144=0,\"\",INDEX(Bogføring!$B:$B,MATCH(Tabel2[[#This Row],[Medl.nr. :]],Bogføring!$E:$E,0),0))","v":""},{"$f":"SUMIFS(Bogføring!I:I,Bogføring!F:F,\"=\"&$L$5,Bogføring!E:E,\"=\"&A144)","v":0},{"$f":"IF(N144=0,\"\",SUMIFS(Bogføring!B:B,Bogføring!F:F,\"=\"&$N$5,Bogføring!E:E,\"=\"&A144))","v":""},{"$f":"SUMIFS(Bogføring!I:I,Bogføring!F:F,\"=\"&$N$5,Bogføring!E:E,\"=\"&A144)","v":0},{"$f":"IF(N144=0,\"\",SUMIFS(Bogføring!$B:$B,Bogføring!$F:$F,\"=\"&$P$5,Bogføring!$E:$E,\"=\"&A144))","v":""},{"$f":"SUMIFS(Bogføring!$I:$I,Bogføring!$H:$H,\"=\"&$P$5,Bogføring!$E:$E,\"=\"&A144)","v":0}]
[142,"Ole Sonne","Sorteengevejen 2, Nylars",3700,"Rønne",30495111,"GIRO",null,null,142,{"$f":"IF(L145=0,\"\",INDEX(Bogføring!$B:$B,MATCH(Tabel2[[#This Row],[Medl.nr. :]],Bogføring!$E:$E,0),0))","v":""},{"$f":"SUMIFS(Bogføring!I:I,Bogføring!F:F,\"=\"&$L$5,Bogføring!E:E,\"=\"&A145)","v":0},{"$f":"IF(N145=0,\"\",SUMIFS(Bogføring!B:B,Bogføring!F:F,\"=\"&$N$5,Bogføring!E:E,\"=\"&A145))","v":""},{"$f":"SUMIFS(Bogføring!I:I,Bogføring!F:F,\"=\"&$N$5,Bogføring!E:E,\"=\"&A145)","v":0},{"$f":"IF(N145=0,\"\",SUMIFS(Bogføring!$B:$B,Bogføring!$F:$F,\"=\"&$P$5,Bogføring!$E:$E,\"=\"&A145))","v":""},{"$f":"SUMIFS(Bogføring!$I:$I,Bogføring!$H:$H,\"=\"&$P$5,Bogføring!$E:$E,\"=\"&A145)","v":0}]
[143,"Peter Aage Henriksen","Overgaden Neden Vandet 5B, st.tv.",1414,"København K",20305977,"Hx@webspeed.dk",null,null,143,{"$f":"IF(L146=0,\"\",INDEX(Bogføring!$B:$B,MATCH(Tabel2[[#This Row],[Medl.nr. :]],Bogføring!$E:$E,0),0))","v":""},{"$f":"SUMIFS(Bogføring!I:I,Bogføring!F:F,\"=\"&$L$5,Bogføring!E:E,\"=\"&A146)","v":0},{"$f":"IF(N146=0,\"\",SUMIFS(Bogføring!B:B,Bogføring!F:F,\"=\"&$N$5,Bogføring!E:E,\"=\"&A146))","v":""},{"$f":"SUMIFS(Bogføring!I:I,Bogføring!F:F,\"=\"&$N$5,Bogføring!E:E,\"=\"&A146)","v":0},{"$f":"IF(N146=0,\"\",SUMIFS(Bogføring!$B:$B,Bogføring!$F:$F,\"=\"&$P$5,Bogføring!$E:$E,\"=\"&A146))","v":""},{"$f":"SUMIFS(Bogføring!$I:$I,Bogføring!$H:$H,\"=\"&$P$5,Bogføring!$E:$E,\"=\"&A146)","v":0}]
[144,"Karsten Rasmussen","Løkkegade 3",3790,"Hasle",56955227,"GIRO-nummeret ikke i brug",null,null,144,{"$f":"IF(L147=0,\"\",INDEX(Bogføring!$B:$B,MATCH(Tabel2[[#This Row],[Medl.nr. :]],Bogføring!$E:$E,0),0))","v":""},{"$f":"SUMIFS(Bogføring!I:I,Bogføring!F:F,\"=\"&$L$5,Bogføring!E:E,\"=\"&A147)","v":0},{"$f":"IF(N147=0,\"\",SUMIFS(Bogføring!B:B,Bogføring!F:F,\"=\"&$N$5,Bogføring!E:E,\"=\"&A147))","v":""},{"$f":"SUMIFS(Bogføring!I:I,Bogføring!F:F,\"=\"&$N$5,Bogføring!E:E,\"=\"&A147)","v":0},{"$f":"IF(N147=0,\"\",SUMIFS(Bogføring!$B:$B,Bogføring!$F:$F,\"=\"&$P$5,Bogføring!$E:$E,\"=\"&A147))","v":""},{"$f":"SUMIFS(Bogføring!$I:$I,Bogføring!$H:$H,\"=\"&$P$5,Bogføring!$E:$E,\"=\"&A147)","v":0}]
[145,"John Pedersen","Rundløkkevejen 2",3720,"Åkirkeby",56974224,"GIRO-nummeret ikke i brug",null,null,145,{"$f":"IF(L148=0,\"\",INDEX(Bogføring!$B:$B,MATCH(Tabel2[[#This Row],[Medl.nr. :]],Bogføring!$E:$E,0),0))","v":""},{"$f":"SUMIFS(Bogføring!I:I,Bogføring!F:F,\"=\"&$L$5,Bogføring!E:E,\"=\"&A148)","v":0},{"$f":"IF(N148=0,\"\",SUMIFS(Bogføring!B:B,Bogføring!F:F,\"=\"&$N$5,Bogføring!E:E,\"=\"&A148))","v":""},{"$f":"SUMIFS(Bogføring!I:I,Bogføring!F:F,\"=\"&$N$5,Bogføring!E:E,\"=\"&A148)","v":0},{"$f":"IF(N148=0,\"\",SUMIFS(Bogføring!$B:$B,Bogføring!$F:$F,\"=\"&$P$5,Bogføring!$E:$E,\"=\"&A148))","v":""},{"$f":"SUMIFS(Bogføring!$I:$I,Bogføring!$H:$H,\"=\"&$P$5,Bogføring!$E:$E,\"=\"&A148)","v":0}]
[146,"Marianne Hansen","Ipsens Have 10",3700,"Rønne",61394505,"Giro",null,null,146,{"$f":"IF(L149=0,\"\",INDEX(Bogføring!$B:$B,MATCH(Tabel2[[#This Row],[Medl.nr. :]],Bogføring!$E:$E,0),0))","v":""},{"$f":"SUMIFS(Bogføring!I:I,Bogføring!F:F,\"=\"&$L$5,Bogføring!E:E,\"=\"&A149)","v":0},{"$f":"IF(N149=0,\"\",SUMIFS(Bogføring!B:B,Bogføring!F:F,\"=\"&$N$5,Bogføring!E:E,\"=\"&A149))","v":""},{"$f":"SUMIFS(Bogføring!I:I,Bogføring!F:F,\"=\"&$N$5,Bogføring!E:E,\"=\"&A149)","v":0},{"$f":"IF(N149=0,\"\",SUMIFS(Bogføring!$B:$B,Bogføring!$F:$F,\"=\"&$P$5,Bogføring!$E:$E,\"=\"&A149))","v":""},{"$f":"SUMIFS(Bogføring!$I:$I,Bogføring!$H:$H,\"=\"&$P$5,Bogføring!$E:$E,\"=\"&A149)","v":0}]
[147,"Michael Christian Kofoed","Langelinie 10",3700,"Rønne ",null,null,null,null,147,{"$f":"IF(L150=0,\"\",INDEX(Bogføring!$B:$B,MATCH(Tabel2[[#This Row],[Medl.nr. :]],Bogføring!$E:$E,0),0))","v":""},{"$f":"SUMIFS(Bogføring!I:I,Bogføring!F:F,\"=\"&$L$5,Bogføring!E:E,\"=\"&A150)","v":0},{"$f":"IF(N150=0,\"\",SUMIFS(Bogføring!B:B,Bogføring!F:F,\"=\"&$N$5,Bogføring!E:E,\"=\"&A150))","v":""},{"$f":"SUMIFS(Bogføring!I:I,Bogføring!F:F,\"=\"&$N$5,Bogføring!E:E,\"=\"&A150)","v":0},{"$f":"IF(N150=0,\"\",SUMIFS(Bogføring!$B:$B,Bogføring!$F:$F,\"=\"&$P$5,Bogføring!$E:$E,\"=\"&A150))","v":""},{"$f":"SUMIFS(Bogføring!$I:$I,Bogføring!$H:$H,\"=\"&$P$5,Bogføring!$E:$E,\"=\"&A150)","v":0}]
[148,"Poul-Erik Kofoed","Slåenvej 31",3700,"Rønne",29253020,"pekofoed@hotmail.dk",null,null,148,{"$f":"IF(L151=0,\"\",INDEX(Bogføring!$B:$B,MATCH(Tabel2[[#This Row],[Medl.nr. :]],Bogføring!$E:$E,0),0))","v":""},{"$f":"SUMIFS(Bogføring!I:I,Bogføring!F:F,\"=\"&$L$5,Bogføring!E:E,\"=\"&A151)","v":0},{"$f":"IF(N151=0,\"\",SUMIFS(Bogføring!B:B,Bogføring!F:F,\"=\"&$N$5,Bogføring!E:E,\"=\"&A151))","v":""},{"$f":"SUMIFS(Bogføring!I:I,Bogføring!F:F,\"=\"&$N$5,Bogføring!E:E,\"=\"&A151)","v":0},{"$f":"IF(N151=0,\"\",SUMIFS(Bogføring!$B:$B,Bogføring!$F:$F,\"=\"&$P$5,Bogføring!$E:$E,\"=\"&A151))","v":""},{"$f":"SUMIFS(Bogføring!$I:$I,Bogføring!$H:$H,\"=\"&$P$5,Bogføring!$E:$E,\"=\"&A151)","v":0}]
[1001,"Rønne Handelsstandsfor. c/o Meny","StoreTorv 11",3700,"Rønne",null,"037619@meny.dk",null,null,1001,{"$f":"IF(L152=0,\"\",INDEX(Bogføring!$B:$B,MATCH(Tabel2[[#This Row],[Medl.nr. :]],Bogføring!$E:$E,0),0))","v":""},{"$f":"SUMIFS(Bogføring!I:I,Bogføring!F:F,\"=\"&$L$5,Bogføring!E:E,\"=\"&A152)","v":0},{"$f":"IF(N152=0,\"\",SUMIFS(Bogføring!B:B,Bogføring!F:F,\"=\"&$N$5,Bogføring!E:E,\"=\"&A152))","v":""},{"$f":"SUMIFS(Bogføring!I:I,Bogføring!F:F,\"=\"&$N$5,Bogføring!E:E,\"=\"&A152)","v":0},{"$f":"IF(N152=0,\"\",SUMIFS(Bogføring!$B:$B,Bogføring!$F:$F,\"=\"&$P$5,Bogføring!$E:$E,\"=\"&A152))","v":""},{"$f":"SUMIFS(Bogføring!$I:$I,Bogføring!$H:$H,\"=\"&$P$5,Bogføring!$E:$E,\"=\"&A152)","v":0}]
[1002,"Kastellets Venner og Historisk Samling c/o Steen Kjær","Skoletoften 1",6430,"Nordborg",null,null,null,"Gl. Hovedvagt, Kastellet 1, 2100 København Ø",1002,{"$f":"IF(L153=0,\"\",INDEX(Bogføring!$B:$B,MATCH(Tabel2[[#This Row],[Medl.nr. :]],Bogføring!$E:$E,0),0))","v":""},{"$f":"SUMIFS(Bogføring!I:I,Bogføring!F:F,\"=\"&$L$5,Bogføring!E:E,\"=\"&A153)","v":0},{"$f":"IF(N153=0,\"\",SUMIFS(Bogføring!B:B,Bogføring!F:F,\"=\"&$N$5,Bogføring!E:E,\"=\"&A153))","v":""},{"$f":"SUMIFS(Bogføring!I:I,Bogføring!F:F,\"=\"&$N$5,Bogføring!E:E,\"=\"&A153)","v":0},{"$f":"IF(N153=0,\"\",SUMIFS(Bogføring!$B:$B,Bogføring!$F:$F,\"=\"&$P$5,Bogføring!$E:$E,\"=\"&A153))","v":""},{"$f":"SUMIFS(Bogføring!$I:$I,Bogføring!$H:$H,\"=\"&$P$5,Bogføring!$E:$E,\"=\"&A153)","v":0}]
[1003,"BH LT-Gilde v/Niels Lausten Brogård","Skolebakken 84",2830,"Virum",null,null,null,"Bidrag Betalt den 3/12/2019",1003,{"$f":"IF(L154=0,\"\",INDEX(Bogføring!$B:$B,MATCH(Tabel2[[#This Row],[Medl.nr. :]],Bogføring!$E:$E,0),0))","v":""},{"$f":"SUMIFS(Bogføring!I:I,Bogføring!F:F,\"=\"&$L$5,Bogføring!E:E,\"=\"&A154)","v":0},{"$f":"IF(N154=0,\"\",SUMIFS(Bogføring!B:B,Bogføring!F:F,\"=\"&$N$5,Bogføring!E:E,\"=\"&A154))","v":""},{"$f":"SUMIFS(Bogføring!I:I,Bogføring!F:F,\"=\"&$N$5,Bogføring!E:E,\"=\"&A154)","v":0},{"$f":"IF(N154=0,\"\",SUMIFS(Bogføring!$B:$B,Bogføring!$F:$F,\"=\"&$P$5,Bogføring!$E:$E,\"=\"&A154))","v":""},{"$f":"SUMIFS(Bogføring!$I:$I,Bogføring!$H:$H,\"=\"&$P$5,Bogføring!$E:$E,\"=\"&A154)","v":0}]
[1004,"EDC BornholmerBo-Kurt Mortensen","Tornegade 1-3",3700,"Rønne",56955683,"371@edc.dk ",2019,null,1004,{"$f":"IF(L155=0,\"\",INDEX(Bogføring!$B:$B,MATCH(Tabel2[[#This Row],[Medl.nr. :]],Bogføring!$E:$E,0),0))","v":""},{"$f":"SUMIFS(Bogføring!I:I,Bogføring!F:F,\"=\"&$L$5,Bogføring!E:E,\"=\"&A155)","v":0},{"$f":"IF(N155=0,\"\",SUMIFS(Bogføring!B:B,Bogføring!F:F,\"=\"&$N$5,Bogføring!E:E,\"=\"&A155))","v":""},{"$f":"SUMIFS(Bogføring!I:I,Bogføring!F:F,\"=\"&$N$5,Bogføring!E:E,\"=\"&A155)","v":0},{"$f":"IF(N155=0,\"\",SUMIFS(Bogføring!$B:$B,Bogføring!$F:$F,\"=\"&$P$5,Bogføring!$E:$E,\"=\"&A155))","v":""},{"$f":"SUMIFS(Bogføring!$I:$I,Bogføring!$H:$H,\"=\"&$P$5,Bogføring!$E:$E,\"=\"&A155)","v":0}]
[1005,"HKKF Hærens Konstabel- og Korporalfor.","Borgergade 101, Postboks 143",8600,"Silkeborg",null,"GIRO",null,null,1005,{"$f":"IF(L156=0,\"\",INDEX(Bogføring!$B:$B,MATCH(Tabel2[[#This Row],[Medl.nr. :]],Bogføring!$E:$E,0),0))","v":""},{"$f":"SUMIFS(Bogføring!I:I,Bogføring!F:F,\"=\"&$L$5,Bogføring!E:E,\"=\"&A156)","v":0},{"$f":"IF(N156=0,\"\",SUMIFS(Bogføring!B:B,Bogføring!F:F,\"=\"&$N$5,Bogføring!E:E,\"=\"&A156))","v":""},{"$f":"SUMIFS(Bogføring!I:I,Bogføring!F:F,\"=\"&$N$5,Bogføring!E:E,\"=\"&A156)","v":0},{"$f":"IF(N156=0,\"\",SUMIFS(Bogføring!$B:$B,Bogføring!$F:$F,\"=\"&$P$5,Bogføring!$E:$E,\"=\"&A156))","v":""},{"$f":"SUMIFS(Bogføring!$I:$I,Bogføring!$H:$H,\"=\"&$P$5,Bogføring!$E:$E,\"=\"&A156)","v":0}]
[1006,"BECK PACK SYSTEM a/s","Sandemandsvej 6",3700,"Rønne",null,"GIRO",null,null,1006,{"$f":"IF(L157=0,\"\",INDEX(Bogføring!$B:$B,MATCH(Tabel2[[#This Row],[Medl.nr. :]],Bogføring!$E:$E,0),0))","v":""},{"$f":"SUMIFS(Bogføring!I:I,Bogføring!F:F,\"=\"&$L$5,Bogføring!E:E,\"=\"&A157)","v":0},{"$f":"IF(N157=0,\"\",SUMIFS(Bogføring!B:B,Bogføring!F:F,\"=\"&$N$5,Bogføring!E:E,\"=\"&A157))","v":""},{"$f":"SUMIFS(Bogføring!I:I,Bogføring!F:F,\"=\"&$N$5,Bogføring!E:E,\"=\"&A157)","v":0},{"$f":"IF(N157=0,\"\",SUMIFS(Bogføring!$B:$B,Bogføring!$F:$F,\"=\"&$P$5,Bogføring!$E:$E,\"=\"&A157))","v":""},{"$f":"SUMIFS(Bogføring!$I:$I,Bogføring!$H:$H,\"=\"&$P$5,Bogføring!$E:$E,\"=\"&A157)","v":0}]
[1008,"Rønne Ejendomshandel","Søndergade 6",3700,"Rønne",56956886,"post@reh.dk",2020,null,1008,{"$f":"IF(L158=0,\"\",INDEX(Bogføring!$B:$B,MATCH(Tabel2[[#This Row],[Medl.nr. :]],Bogføring!$E:$E,0),0))","v":""},{"$f":"SUMIFS(Bogføring!I:I,Bogføring!F:F,\"=\"&$L$5,Bogføring!E:E,\"=\"&A158)","v":0},{"$f":"IF(N158=0,\"\",SUMIFS(Bogføring!B:B,Bogføring!F:F,\"=\"&$N$5,Bogføring!E:E,\"=\"&A158))","v":""},{"$f":"SUMIFS(Bogføring!I:I,Bogføring!F:F,\"=\"&$N$5,Bogføring!E:E,\"=\"&A158)","v":0},{"$f":"IF(N158=0,\"\",SUMIFS(Bogføring!$B:$B,Bogføring!$F:$F,\"=\"&$P$5,Bogføring!$E:$E,\"=\"&A158))","v":""},{"$f":"SUMIFS(Bogføring!$I:$I,Bogføring!$H:$H,\"=\"&$P$5,Bogføring!$E:$E,\"=\"&A158)","v":0}]
[1009,"Danbolig Bornholm","Nørregade 6",3700,"Rønne",56951995,"roenne@danbolig.dk",null,null,1009,{"$f":"IF(L159=0,\"\",INDEX(Bogføring!$B:$B,MATCH(Tabel2[[#This Row],[Medl.nr. :]],Bogføring!$E:$E,0),0))","v":""},{"$f":"SUMIFS(Bogføring!I:I,Bogføring!F:F,\"=\"&$L$5,Bogføring!E:E,\"=\"&A159)","v":0},{"$f":"IF(N159=0,\"\",SUMIFS(Bogføring!B:B,Bogføring!F:F,\"=\"&$N$5,Bogføring!E:E,\"=\"&A159))","v":""},{"$f":"SUMIFS(Bogføring!I:I,Bogføring!F:F,\"=\"&$N$5,Bogføring!E:E,\"=\"&A159)","v":0},{"$f":"IF(N159=0,\"\",SUMIFS(Bogføring!$B:$B,Bogføring!$F:$F,\"=\"&$P$5,Bogføring!$E:$E,\"=\"&A159))","v":""},{"$f":"SUMIFS(Bogføring!$I:$I,Bogføring!$H:$H,\"=\"&$P$5,Bogføring!$E:$E,\"=\"&A159)","v":0}]
[1010,"Danmarks Veteraner Afd. Bornholm v/KS Klaus RIIs Buchholdt","Glentevangen10",3700,"Rønne",20159791,"54atehena@gmail.com",2020,"betalt 2 gange 14/4/20",1010,{"$f":"IF(L160=0,\"\",INDEX(Bogføring!$B:$B,MATCH(Tabel2[[#This Row],[Medl.nr. :]],Bogføring!$E:$E,0),0))","v":""},{"$f":"SUMIFS(Bogføring!I:I,Bogføring!F:F,\"=\"&$L$5,Bogføring!E:E,\"=\"&A160)","v":0},{"$f":"IF(N160=0,\"\",SUMIFS(Bogføring!B:B,Bogføring!F:F,\"=\"&$N$5,Bogføring!E:E,\"=\"&A160))","v":""},{"$f":"SUMIFS(Bogføring!I:I,Bogføring!F:F,\"=\"&$N$5,Bogføring!E:E,\"=\"&A160)","v":0},{"$f":"IF(N160=0,\"\",SUMIFS(Bogføring!$B:$B,Bogføring!$F:$F,\"=\"&$P$5,Bogføring!$E:$E,\"=\"&A160))","v":""},{"$f":"SUMIFS(Bogføring!$I:$I,Bogføring!$H:$H,\"=\"&$P$5,Bogføring!$E:$E,\"=\"&A160)","v":0}]
[null,null,null,null,null,null,null,null,null,"",{"$f":"IF(L161=0,\"\",INDEX(Bogføring!$B:$B,MATCH(Tabel2[[#This Row],[Medl.nr. :]],Bogføring!$E:$E,0),0))","v":""},{"$f":"SUMIFS(Bogføring!I:I,Bogføring!F:F,\"=\"&$L$5,Bogføring!E:E,\"=\"&A161)","v":0},{"$f":"IF(N161=0,\"\",SUMIFS(Bogføring!B:B,Bogføring!F:F,\"=\"&$N$5,Bogføring!E:E,\"=\"&A161))","v":""},{"$f":"SUMIFS(Bogføring!I:I,Bogføring!F:F,\"=\"&$N$5,Bogføring!E:E,\"=\"&A161)","v":0},{"$f":"IF(N161=0,\"\",SUMIFS(Bogføring!$B:$B,Bogføring!$F:$F,\"=\"&$P$5,Bogføring!$E:$E,\"=\"&A161))","v":""},{"$f":"SUMIFS(Bogføring!$I:$I,Bogføring!$H:$H,\"=\"&$P$5,Bogføring!$E:$E,\"=\"&A161)","v":0}]
[null,null,null,null,null,null,null,null,null,"",{"$f":"IF(L162=0,\"\",INDEX(Bogføring!$B:$B,MATCH(Tabel2[[#This Row],[Medl.nr. :]],Bogføring!$E:$E,0),0))","v":""},{"$f":"SUMIFS(Bogføring!I:I,Bogføring!F:F,\"=\"&$L$5,Bogføring!E:E,\"=\"&A162)","v":0},{"$f":"IF(N162=0,\"\",SUMIFS(Bogføring!B:B,Bogføring!F:F,\"=\"&$N$5,Bogføring!E:E,\"=\"&A162))","v":""},{"$f":"SUMIFS(Bogføring!I:I,Bogføring!F:F,\"=\"&$N$5,Bogføring!E:E,\"=\"&A162)","v":0},{"$f":"IF(N162=0,\"\",SUMIFS(Bogføring!$B:$B,Bogføring!$F:$F,\"=\"&$P$5,Bogføring!$E:$E,\"=\"&A162))","v":""},{"$f":"SUMIFS(Bogføring!$I:$I,Bogføring!$H:$H,\"=\"&$P$5,Bogføring!$E:$E,\"=\"&A162)","v":0}]
[null,null,null,null,null,null,null,null,null,"",{"$f":"IF(L163=0,\"\",INDEX(Bogføring!$B:$B,MATCH(Tabel2[[#This Row],[Medl.nr. :]],Bogføring!$E:$E,0),0))","v":""},{"$f":"SUMIFS(Bogføring!I:I,Bogføring!F:F,\"=\"&$L$5,Bogføring!E:E,\"=\"&A163)","v":0},{"$f":"IF(N163=0,\"\",SUMIFS(Bogføring!B:B,Bogføring!F:F,\"=\"&$N$5,Bogføring!E:E,\"=\"&A163))","v":""},{"$f":"SUMIFS(Bogføring!I:I,Bogføring!F:F,\"=\"&$N$5,Bogføring!E:E,\"=\"&A163)","v":0},{"$f":"IF(N163=0,\"\",SUMIFS(Bogføring!$B:$B,Bogføring!$F:$F,\"=\"&$P$5,Bogføring!$E:$E,\"=\"&A163))","v":""},{"$f":"SUMIFS(Bogføring!$I:$I,Bogføring!$H:$H,\"=\"&$P$5,Bogføring!$E:$E,\"=\"&A163)","v":0}]
[null,null,null,null,null,null,null,null,null,"",{"$f":"IF(L164=0,\"\",INDEX(Bogføring!$B:$B,MATCH(Tabel2[[#This Row],[Medl.nr. :]],Bogføring!$E:$E,0),0))","v":""},{"$f":"SUMIFS(Bogføring!I:I,Bogføring!F:F,\"=\"&$L$5,Bogføring!E:E,\"=\"&A164)","v":0},{"$f":"IF(N164=0,\"\",SUMIFS(Bogføring!B:B,Bogføring!F:F,\"=\"&$N$5,Bogføring!E:E,\"=\"&A164))","v":""},{"$f":"SUMIFS(Bogføring!I:I,Bogføring!F:F,\"=\"&$N$5,Bogføring!E:E,\"=\"&A164)","v":0},{"$f":"IF(N164=0,\"\",SUMIFS(Bogføring!$B:$B,Bogføring!$F:$F,\"=\"&$P$5,Bogføring!$E:$E,\"=\"&A164))","v":""},{"$f":"SUMIFS(Bogføring!$I:$I,Bogføring!$H:$H,\"=\"&$P$5,Bogføring!$E:$E,\"=\"&A164)","v":0}]
[null,null,null,null,null,null,null,null,null,"",{"$f":"IF(L165=0,\"\",INDEX(Bogføring!$B:$B,MATCH(Tabel2[[#This Row],[Medl.nr. :]],Bogføring!$E:$E,0),0))","v":""},{"$f":"SUMIFS(Bogføring!I:I,Bogføring!F:F,\"=\"&$L$5,Bogføring!E:E,\"=\"&A165)","v":0},{"$f":"IF(N165=0,\"\",SUMIFS(Bogføring!B:B,Bogføring!F:F,\"=\"&$N$5,Bogføring!E:E,\"=\"&A165))","v":""},{"$f":"SUMIFS(Bogføring!I:I,Bogføring!F:F,\"=\"&$N$5,Bogføring!E:E,\"=\"&A165)","v":0},{"$f":"IF(N165=0,\"\",SUMIFS(Bogføring!$B:$B,Bogføring!$F:$F,\"=\"&$P$5,Bogføring!$E:$E,\"=\"&A165))","v":""},{"$f":"SUMIFS(Bogføring!$I:$I,Bogføring!$H:$H,\"=\"&$P$5,Bogføring!$E:$E,\"=\"&A165)","v":0}]
[null,null,null,null,null,null,null,null,null,{"$f":"IF(A166=\"\",\"\",A166)","v":""},{"$f":"IF(L166=0,\"\",INDEX(Bogføring!$B:$B,MATCH(Tabel2[[#This Row],[Medl.nr. :]],Bogføring!$E:$E,0),0))","v":""},{"$f":"SUMIFS(Bogføring!I:I,Bogføring!F:F,\"=\"&$L$5,Bogføring!E:E,\"=\"&A166)","v":0},{"$f":"IF(N166=0,\"\",SUMIFS(Bogføring!B:B,Bogføring!F:F,\"=\"&$N$5,Bogføring!E:E,\"=\"&A166))","v":""},{"$f":"SUMIFS(Bogføring!I:I,Bogføring!F:F,\"=\"&$N$5,Bogføring!E:E,\"=\"&A166)","v":0},{"$f":"IF(N166=0,\"\",SUMIFS(Bogføring!$B:$B,Bogføring!$F:$F,\"=\"&$P$5,Bogføring!$E:$E,\"=\"&A166))","v":""},{"$f":"SUMIFS(Bogføring!$I:$I,Bogføring!$H:$H,\"=\"&$P$5,Bogføring!$E:$E,\"=\"&A166)","v":0}]
[null,null,null,null,null,null,null,null,null,""]
[null,null,null,null,null,null,null,null,null,""]
[null,null,null,null,null,null,null,null,null,""]
[null,null,null,null,null,null,null,null,null,""]
[null,null,null,null,null,null,null,null,null,""]
[null,null,null,null,null,null,null,null,null,""]
[null,null,null,null,null,null,null,null,null,""]
[null,null,null,null,null,null,null,null,null,""]
[null,null,null,null,null,null,null,null,null,""]
[null,null,null,null,null,null,null,null,null,""]
[null,null,null,null,null,null,null,null,null,""]
[null,null,null,null,null,null,null,null,null,""]
[null,null,null,null,null,null,null,null,null,""]
[null,null,null,null,null,null,null,null,null,""]

{"sheet":"Afv %","index":4,"n_rows":61,"n_cols":10,"rows_kept":61,"cut":false,"hidden":true,"merged":[[0,1,0,9],[6,1,6,10],[7,3,7,4],[7,5,7,6],[7,7,7,8],[4,1,5,9]]}
[null,{"$f":"T!B9","v":"xxxxxxxxxxxxx"}]
[]
[]
[]
[null,{"$f":"\"Afvigelser \"&T!C2","v":"Afvigelser 2022"}]
[]
[null,{"$f":"T!A7","v":"Periode : 01-01-2022 - 15-05-2022"}]
[null,null,null,null,null,"Aktuelt år",null,"Sidste år",null,"Forrige år"]
[null,null,null,null,null,{"$f":"T!C2","v":2022},"afv i %",{"$f":"F9-1","v":2021},"afv i %",{"$f":"F9-2","v":2020}]
[null,"Indtægter"]
[]
[1000,{"$f":"IFERROR(VLOOKUP(A12,Kontoplan!$A$2:$D$31,2,0),\"\")","v":"Entre"},null,null,{"$f":"IFERROR(IF(D12=0,\"\",(D12-H12)/H12),\"\")","v":""},{"$f":"SUMIFS(Bogføring!$I:$I,Bogføring!$B:$B,\">=\"&T!$C$4,Bogføring!$B:$B,\"<=\"&T!$C$5,Bogføring!$G:$G,A12)-SUMIFS(Bogføring!$H:$H,Bogføring!$B:$B,\">=\"&T!$C$4,Bogføring!$B:$B,\"<=\"&T!$C$5,Bogføring!$G:$G,A12)","v":8740},{"$f":"IFERROR((F12-H12)/H12,\"\")","v":-0.95372110878716476},{"$f":"SUMIFS(Bogføring!$I:$I,Bogføring!$B:$B,\">=\"&T!$D$4,Bogføring!$B:$B,\"<=\"&T!$D$5,Bogføring!$G:$G,A12)","v":188855.00000000003},{"$f":"IFERROR((H12-J12)/J12,\"\")","v":""},{"$f":"SUMIFS(Bogføring!$I:$I,Bogføring!$B:$B,\">=\"&T!$E$4,Bogføring!$B:$B,\"<=\"&T!$E$5,Bogføring!$G:$G,A12)","v":0}]
[1010,{"$f":"IFERROR(VLOOKUP(A13,Kontoplan!$A$2:$D$31,2,0),\"\")","v":"Kiosk salg"},null,null,{"$f":"IFERROR(IF(D13=0,\"\",(D13-H13)/H13),\"\")","v":""},{"$f":"SUMIFS(Bogføring!$I:$I,Bogføring!$B:$B,\">=\"&T!$C$4,Bogføring!$B:$B,\"<=\"&T!$C$5,Bogføring!$G:$G,A13)-SUMIFS(Bogføring!$H:$H,Bogføring!$B:$B,\">=\"&T!$C$4,Bogføring!$B:$B,\"<=\"&T!$C$5,Bogføring!$G:$G,A13)","v":75},{"$f":"IFERROR((F13-H13)/H13,\"\")","v":-0.99532470835530718},{"$f":"SUMIFS(Bogføring!$I:$I,Bogføring!$B:$B,\">=\"&T!$D$4,Bogføring!$B:$B,\"<=\"&T!$D$5,Bogføring!$G:$G,A13)-SUMIFS(Bogføring!$H:$H,Bogføring!$B:$B,\">=\"&T!$D$4,Bogføring!$B:$B,\"<=\"&T!$D$5,Bogføring!$G:$G,A13)","v":16041.779999999999},{"$f":"IFERROR((H13-J13)/J13,\"\")","v":""},{"$f":"SUMIFS(Bogføring!$I:$I,Bogføring!$B:$B,\">=\"&T!$E$4,Bogføring!$B:$B,\"<=\"&T!$E$5,Bogføring!$G:$G,A13)","v":0}]
[1020,{"$f":"IFERROR(VLOOKUP(A14,Kontoplan!$A$2:$D$31,2,0),\"\")","v":"Tilskud fra BRK/ drifttilskud"},null,null,{"$f":"IFERROR(IF(D14=0,\"\",(D14-H14)/H14),\"\")","v":""},{"$f":"SUMIFS(Bogføring!$I:$I,Bogføring!$B:$B,\">=\"&T!$C$4,Bogføring!$B:$B,\"<=\"&T!$C$5,Bogføring!$G:$G,A14)-SUMIFS(Bogføring!$H:$H,Bogføring!$B:$B,\">=\"&T!$C$4,Bogføring!$B:$B,\"<=\"&T!$C$5,Bogføring!$G:$G,A14)","v":74021},{"$f":"IFERROR((F14-H14)/H14,\"\")","v":2.1007476068305334E-2},{"$f":"SUMIFS(Bogføring!$I:$I,Bogføring!$B:$B,\">=\"&T!$D$4,Bogføring!$B:$B,\"<=\"&T!$D$5,Bogføring!$G:$G,A14)-SUMIFS(Bogføring!$H:$H,Bogføring!$B:$B,\">=\"&T!$D$4,Bogføring!$B:$B,\"<=\"&T!$D$5,Bogføring!$G:$G,A14)","v":72498},{"$f":"IFERROR((H14-J14)/J14,\"\")","v":""},{"$f":"SUMIFS(Bogføring!$I:$I,Bogføring!$B:$B,\">=\"&T!$E$4,Bogføring!$B:$B,\"<=\"&T!$E$5,Bogføring!$G:$G,A14)","v":0}]
[1030,{"$f":"IFERROR(VLOOKUP(A15,Kontoplan!$A$2:$D$31,2,0),\"\")","v":"Tilskud fra KVB"},null,null,"",{"$f":"SUMIFS(Bogføring!$I:$I,Bogføring!$B:$B,\">=\"&T!$C$4,Bogføring!$B:$B,\"<=\"&T!$C$5,Bogføring!$G:$G,A15)-SUMIFS(Bogføring!$H:$H,Bogføring!$B:$B,\">=\"&T!$C$4,Bogføring!$B:$B,\"<=\"&T!$C$5,Bogføring!$G:$G,A15)","v":20000},{"$f":"IFERROR((F15-H15)/H15,\"\")","v":-0.33333333333333331},{"$f":"SUMIFS(Bogføring!$I:$I,Bogføring!$B:$B,\">=\"&T!$D$4,Bogføring!$B:$B,\"<=\"&T!$D$5,Bogføring!$G:$G,A15)-SUMIFS(Bogføring!$H:$H,Bogføring!$B:$B,\">=\"&T!$D$4,Bogføring!$B:$B,\"<=\"&T!$D$5,Bogføring!$G:$G,A15)","v":30000},{"$f":"IFERROR((H15-J15)/J15,\"\")","v":""},{"$f":"SUMIFS(Bogføring!$I:$I,Bogføring!$B:$B,\">=\"&T!$E$4,Bogføring!$B:$B,\"<=\"&T!$E$5,Bogføring!$G:$G,A15)","v":0}]
[1040,{"$f":"IFERROR(VLOOKUP(A16,Kontoplan!$A$2:$D$31,2,0),\"\")","v":"Fonde/Gaver"},null,null,"",{"$f":"SUMIFS(Bogføring!$I:$I,Bogføring!$B:$B,\">=\"&T!$C$4,Bogføring!$B:$B,\"<=\"&T!$C$5,Bogføring!$G:$G,A16)-SUMIFS(Bogføring!$H:$H,Bogføring!$B:$B,\">=\"&T!$C$4,Bogføring!$B:$B,\"<=\"&T!$C$5,Bogføring!$G:$G,A16)","v":0},-1,{"$f":"SUMIFS(Bogføring!$I:$I,Bogføring!$B:$B,\">=\"&T!$D$4,Bogføring!$B:$B,\"<=\"&T!$D$5,Bogføring!$G:$G,A16)-SUMIFS(Bogføring!$H:$H,Bogføring!$B:$B,\">=\"&T!$D$4,Bogføring!$B:$B,\"<=\"&T!$D$5,Bogføring!$G:$G,A16)","v":30000},{"$f":"IFERROR((H16-J16)/J16,\"\")","v":""},{"$f":"SUMIFS(Bogføring!$I:$I,Bogføring!$B:$B,\">=\"&T!$E$4,Bogføring!$B:$B,\"<=\"&T!$E$5,Bogføring!$G:$G,A16)","v":0}]
[1050,{"$f":"IFERROR(VLOOKUP(A17,Kontoplan!$A$2:$D$31,2,0),\"\")","v":"Aktiviteter"},null,null,"",{"$f":"SUMIFS(Bogføring!$I:$I,Bogføring!$B:$B,\">=\"&T!$C$4,Bogføring!$B:$B,\"<=\"&T!$C$5,Bogføring!$G:$G,A17)-SUMIFS(Bogføring!$H:$H,Bogføring!$B:$B,\">=\"&T!$C$4,Bogføring!$B:$B,\"<=\"&T!$C$5,Bogføring!$G:$G,A17)","v":0},"",{"$f":"SUMIFS(Bogføring!$I:$I,Bogføring!$B:$B,\">=\"&T!$D$4,Bogføring!$B:$B,\"<=\"&T!$D$5,Bogføring!$G:$G,A17)-SUMIFS(Bogføring!$H:$H,Bogføring!$B:$B,\">=\"&T!$D$4,Bogføring!$B:$B,\"<=\"&T!$D$5,Bogføring!$G:$G,A17)","v":0},{"$f":"IFERROR((H17-J17)/J17,\"\")","v":""},{"$f":"SUMIFS(Bogføring!$I:$I,Bogføring!$B:$B,\">=\"&T!$E$4,Bogføring!$B:$B,\"<=\"&T!$E$5,Bogføring!$G:$G,A17)","v":0}]
[1070,{"$f":"IFERROR(VLOOKUP(A18,Kontoplan!$A$2:$D$31,2,0),\"\")","v":"Pengegaver"},null,null,"",{"$f":"SUMIFS(Bogføring!$I:$I,Bogføring!$B:$B,\">=\"&T!$C$4,Bogføring!$B:$B,\"<=\"&T!$C$5,Bogføring!$G:$G,A18)-SUMIFS(Bogføring!$H:$H,Bogføring!$B:$B,\">=\"&T!$C$4,Bogføring!$B:$B,\"<=\"&T!$C$5,Bogføring!$G:$G,A18)","v":0},"",{"$f":"SUMIFS(Bogføring!$I:$I,Bogføring!$B:$B,\">=\"&T!$D$4,Bogføring!$B:$B,\"<=\"&T!$D$5,Bogføring!$G:$G,A18)","v":0},"",{"$f":"SUMIFS(Bogføring!$I:$I,Bogføring!$B:$B,\">=\"&T!$E$4,Bogføring!$B:$B,\"<=\"&T!$E$5,Bogføring!$G:$G,A18)","v":0}]
[1080,{"$f":"IFERROR(VLOOKUP(A19,Kontoplan!$A$2:$D$31,2,0),\"\")","v":"Flaskepant retur"},null,null,"",{"$f":"SUMIFS(Bogføring!$I:$I,Bogføring!$B:$B,\">=\"&T!$C$4,Bogføring!$B:$B,\"<=\"&T!$C$5,Bogføring!$G:$G,A19)-SUMIFS(Bogføring!$H:$H,Bogføring!$B:$B,\">=\"&T!$C$4,Bogføring!$B:$B,\"<=\"&T!$C$5,Bogføring!$G:$G,A19)","v":0},"",{"$f":"SUMIFS(Bogføring!$I:$I,Bogføring!$B:$B,\">=\"&T!$D$4,Bogføring!$B:$B,\"<=\"&T!$D$5,Bogføring!$G:$G,A20)","v":0},"",{"$f":"SUMIFS(Bogføring!$I:$I,Bogføring!$B:$B,\">=\"&T!$E$4,Bogføring!$B:$B,\"<=\"&T!$E$5,Bogføring!$G:$G,A20)","v":0}]
[1090,{"$f":"IFERROR(VLOOKUP(A20,Kontoplan!$A$2:$D$31,2,0),\"\")","v":"Kassedifferance"},null,null,"",{"$f":"SUMIFS(Bogføring!$I:$I,Bogføring!$B:$B,\">=\"&T!$C$4,Bogføring!$B:$B,\"<=\"&T!$C$5,Bogføring!$G:$G,A20)-SUMIFS(Bogføring!$H:$H,Bogføring!$B:$B,\">=\"&T!$C$4,Bogføring!$B:$B,\"<=\"&T!$C$5,Bogføring!$G:$G,A20)","v":0},"",{"$f":"SUMIFS(Bogføring!$I:$I,Bogføring!$B:$B,\">=\"&T!$D$4,Bogføring!$B:$B,\"<=\"&T!$D$5,Bogføring!$G:$G,A21)","v":0},"",{"$f":"SUMIFS(Bogføring!$I:$I,Bogføring!$B:$B,\">=\"&T!$E$4,Bogføring!$B:$B,\"<=\"&T!$E$5,Bogføring!$G:$G,A21)","v":0}]
[null,{"$f":"IFERROR(VLOOKUP(A21,Kontoplan!$A$2:$D$31,2,0),\"\")","v":""},null,null,"",{"$f":"SUMIFS(Bogføring!$I:$I,Bogføring!$B:$B,\">=\"&T!$C$4,Bogføring!$B:$B,\"<=\"&T!$C$5,Bogføring!$G:$G,A21)-SUMIFS(Bogføring!$H:$H,Bogføring!$B:$B,\">=\"&T!$C$4,Bogføring!$B:$B,\"<=\"&T!$C$5,Bogføring!$G:$G,A21)","v":0},"",{"$f":"SUMIFS(Bogføring!$I:$I,Bogføring!$B:$B,\">=\"&T!$D$4,Bogføring!$B:$B,\"<=\"&T!$D$5,Bogføring!$G:$G,A22)","v":0},"",{"$f":"SUMIFS(Bogføring!$I:$I,Bogføring!$B:$B,\">=\"&T!$E$4,Bogføring!$B:$B,\"<=\"&T!$E$5,Bogføring!$G:$G,A22)","v":0}]
[null,{"$f":"IFERROR(VLOOKUP(A22,Kontoplan!$A$2:$D$31,2,0),\"\")","v":""},null,null,"",{"$f":"SUMIFS(Bogføring!$I:$I,Bogføring!$B:$B,\">=\"&T!$C$4,Bogføring!$B:$B,\"<=\"&T!$C$5,Bogføring!$G:$G,A22)-SUMIFS(Bogføring!$H:$H,Bogføring!$B:$B,\">=\"&T!$C$4,Bogføring!$B:$B,\"<=\"&T!$C$5,Bogføring!$G:$G,A22)","v":0},-1,{"$f":"SUMIFS(Bogføring!$I:$I,Bogføring!$B:$B,\">=\"&T!$D$4,Bogføring!$B:$B,\"<=\"&T!$D$5,Bogføring!$G:$G,A23)","v":6538.1900000000005},"",{"$f":"SUMIFS(Bogføring!$I:$I,Bogføring!$B:$B,\">=\"&T!$E$4,Bogføring!$B:$B,\"<=\"&T!$E$5,Bogføring!$G:$G,A23)","v":0}]
[1130,{"$f":"IFERROR(VLOOKUP(A23,Kontoplan!$A$2:$D$31,2,0),\"\")","v":"Diverse Indtægter"},null,null,"",{"$f":"SUMIFS(Bogføring!$I:$I,Bogføring!$B:$B,\">=\"&T!$C$4,Bogføring!$B:$B,\"<=\"&T!$C$5,Bogføring!$G:$G,A23)-SUMIFS(Bogføring!$H:$H,Bogføring!$B:$B,\">=\"&T!$C$4,Bogføring!$B:$B,\"<=\"&T!$C$5,Bogføring!$G:$G,A23)","v":532.1},"",{"$f":"SUMIFS(Bogføring!$I:$I,Bogføring!$B:$B,\">=\"&T!$D$4,Bogføring!$B:$B,\"<=\"&T!$D$5,Bogføring!$G:$G,A24)","v":0},"",{"$f":"SUMIFS(Bogføring!$I:$I,Bogføring!$B:$B,\">=\"&T!$E$4,Bogføring!$B:$B,\"<=\"&T!$E$5,Bogføring!$G:$G,A24)","v":0}]
[null,{"$f":"IFERROR(VLOOKUP(A24,Kontoplan!$A$2:$D$31,2,0),\"\")","v":""},null,null,"",{"$f":"SUMIFS(Bogføring!$I:$I,Bogføring!$B:$B,\">=\"&T!$C$4,Bogføring!$B:$B,\"<=\"&T!$C$5,Bogføring!$G:$G,A24)-SUMIFS(Bogføring!$H:$H,Bogføring!$B:$B,\">=\"&T!$C$4,Bogføring!$B:$B,\"<=\"&T!$C$5,Bogføring!$G:$G,A24)","v":0},"",{"$f":"SUMIFS(Bogføring!$I:$I,Bogføring!$B:$B,\">=\"&T!$D$4,Bogføring!$B:$B,\"<=\"&T!$D$5,Bogføring!$G:$G,#REF!)","v":0},"",{"$f":"SUMIFS(Bogføring!$I:$I,Bogføring!$B:$B,\">=\"&T!$E$4,Bogføring!$B:$B,\"<=\"&T!$E$5,Bogføring!$G:$G,#REF!)","v":0}]
[null,{"$f":"IFERROR(VLOOKUP(A25,Kontoplan!$A$2:$D$31,2,0),\"\")","v":""},null,null,"",{"$f":"SUMIFS(Bogføring!$I:$I,Bogføring!$B:$B,\">=\"&T!$C$4,Bogføring!$B:$B,\"<=\"&T!$C$5,Bogføring!$G:$G,A25)-SUMIFS(Bogføring!$H:$H,Bogføring!$B:$B,\">=\"&T!$C$4,Bogføring!$B:$B,\"<=\"&T!$C$5,Bogføring!$G:$G,A25)","v":0},"",{"$f":"SUMIFS(Bogføring!$I:$I,Bogføring!$B:$B,\">=\"&T!$D$4,Bogføring!$B:$B,\"<=\"&T!$D$5,Bogføring!$G:$G,A25)","v":0},"",{"$f":"SUMIFS(Bogføring!$I:$I,Bogføring!$B:$B,\">=\"&T!$E$4,Bogføring!$B:$B,\"<=\"&T!$E$5,Bogføring!$G:$G,A25)","v":0}]
[null,null,null,null,null,null,""]
[null,"Indtægter i alt",null,null,"",{"$f":"SUM(F12:F25)","v":103368.1},-0.69945277418445806,{"$f":"SUM(H12:H25)","v":343932.97000000003},{"$f":"IFERROR((H27-J27)/H27,\"\")","v":1},{"$f":"SUM(J12:J25)","v":0}]
[null,null,null,null,{"$f":"IFERROR((D28-F28)/D28,\"\")","v":""},null,{"$f":"IFERROR((F28-H28)/F28,\"\")","v":""},null,{"$f":"IFERROR((H28-J28)/H28,\"\")","v":""}]
[null,"Udgifter",null,null,{"$f":"IFERROR((D29-F29)/D29,\"\")","v":""},null,{"$f":"IFERROR((F29-H29)/F29,\"\")","v":""},null,{"$f":"IFERROR((H29-J29)/H29,\"\")","v":""}]
[null,null,null,null,{"$f":"IFERROR((D30-F30)/D30,\"\")","v":""},null,{"$f":"IFERROR((F30-H30)/F30,\"\")","v":""},null,{"$f":"IFERROR((H30-J30)/H30,\"\")","v":""}]
[2000,{"$f":"IFERROR(VLOOKUP(A31,Kontoplan!$A$2:$D$31,2,0),\"\")","v":""},null,null,{"$f":"IFERROR(IF(D31=0,\"\",(D31-H31)/H31),\"\")","v":""},{"$f":"SUMIFS(Bogføring!$H:$H,Bogføring!$B:$B,\">=\"&T!$C$4,Bogføring!$B:$B,\"<=\"&T!$C$5,Bogføring!$G:$G,A31)-SUMIFS(Bogføring!$I:$I,Bogføring!$B:$B,\">=\"&T!$C$4,Bogføring!$B:$B,\"<=\"&T!$C$5,Bogføring!$G:$G,A31)","v":109.5},{"$f":"IFERROR((F31-H31)/H31,\"\")","v":-0.81756993152624824},{"$f":"SUMIFS(Bogføring!$H:$H,Bogføring!$B:$B,\">=\"&T!$D$4,Bogføring!$B:$B,\"<=\"&T!$D$5,Bogføring!$G:$G,A31)","v":600.23},{"$f":"IFERROR((H31-J31)/J31,\"\")","v":""},{"$f":"SUMIFS(Bogføring!$H:$H,Bogføring!$B:$B,\">=\"&T!$E$4,Bogføring!$B:$B,\"<=\"&T!$E$5,Bogføring!$G:$G,A31)","v":0}]
[2010,{"$f":"IFERROR(VLOOKUP(A32,Kontoplan!$A$2:$D$31,2,0),\"\")","v":""},null,null,{"$f":"IFERROR(IF(D32=0,\"\",(D32-H32)/H32),\"\")","v":""},{"$f":"SUMIFS(Bogføring!$H:$H,Bogføring!$B:$B,\">=\"&T!$C$4,Bogføring!$B:$B,\"<=\"&T!$C$5,Bogføring!$G:$G,A32)-SUMIFS(Bogføring!$I:$I,Bogføring!$B:$B,\">=\"&T!$C$4,Bogføring!$B:$B,\"<=\"&T!$C$5,Bogføring!$G:$G,A32)","v":27.5},{"$f":"IFERROR((F32-H32)/H32,\"\")","v":-0.98761729795933073},{"$f":"SUMIFS(Bogføring!$H:$H,Bogføring!$B:$B,\">=\"&T!$D$4,Bogføring!$B:$B,\"<=\"&T!$D$5,Bogføring!$G:$G,A32)","v":2220.84},{"$f":"IFERROR((H32-J32)/J32,\"\")","v":""},{"$f":"SUMIFS(Bogføring!$H:$H,Bogføring!$B:$B,\">=\"&T!$E$4,Bogføring!$B:$B,\"<=\"&T!$E$5,Bogføring!$G:$G,A32)","v":0}]
[2020,{"$f":"IFERROR(VLOOKUP(A33,Kontoplan!$A$2:$D$31,2,0),\"\")","v":""},null,null,"",{"$f":"SUMIFS(Bogføring!$H:$H,Bogføring!$B:$B,\">=\"&T!$C$4,Bogføring!$B:$B,\"<=\"&T!$C$5,Bogføring!$G:$G,A33)-SUMIFS(Bogføring!$I:$I,Bogføring!$B:$B,\">=\"&T!$C$4,Bogføring!$B:$B,\"<=\"&T!$C$5,Bogføring!$G:$G,A33)","v":0},-1,{"$f":"SUMIFS(Bogføring!$H:$H,Bogføring!$B:$B,\">=\"&T!$D$4,Bogføring!$B:$B,\"<=\"&T!$D$5,Bogføring!$G:$G,A33)","v":25000},"",{"$f":"SUMIFS(Bogføring!$H:$H,Bogføring!$B:$B,\">=\"&T!$E$4,Bogføring!$B:$B,\"<=\"&T!$E$5,Bogføring!$G:$G,A33)","v":0}]
[2025,{"$f":"IFERROR(VLOOKUP(A34,Kontoplan!$A$2:$D$31,2,0),\"\")","v":""},null,null,"",{"$f":"SUMIFS(Bogføring!$H:$H,Bogføring!$B:$B,\">=\"&T!$C$4,Bogføring!$B:$B,\"<=\"&T!$C$5,Bogføring!$G:$G,A34)-SUMIFS(Bogføring!$I:$I,Bogføring!$B:$B,\">=\"&T!$C$4,Bogføring!$B:$B,\"<=\"&T!$C$5,Bogføring!$G:$G,A34)","v":490.63},-0.54688769855929065,{"$f":"SUMIFS(Bogføring!$H:$H,Bogføring!$B:$B,\">=\"&T!$D$4,Bogføring!$B:$B,\"<=\"&T!$D$5,Bogføring!$G:$G,A34)","v":1082.7999999999997},"",{"$f":"SUMIFS(Bogføring!$H:$H,Bogføring!$B:$B,\">=\"&T!$E$4,Bogføring!$B:$B,\"<=\"&T!$E$5,Bogføring!$G:$G,A34)","v":0}]
[2030,{"$f":"IFERROR(VLOOKUP(A35,Kontoplan!$A$2:$D$31,2,0),\"\")","v":""},null,null,"",{"$f":"SUMIFS(Bogføring!$H:$H,Bogføring!$B:$B,\">=\"&T!$C$4,Bogføring!$B:$B,\"<=\"&T!$C$5,Bogføring!$G:$G,A35)-SUMIFS(Bogføring!$I:$I,Bogføring!$B:$B,\">=\"&T!$C$4,Bogføring!$B:$B,\"<=\"&T!$C$5,Bogføring!$G:$G,A35)","v":329.7},-0.99414253103419248,{"$f":"SUMIFS(Bogføring!$H:$H,Bogføring!$B:$B,\">=\"&T!$D$4,Bogføring!$B:$B,\"<=\"&T!$D$5,Bogføring!$G:$G,A35)","v":56287.11},"",{"$f":"SUMIFS(Bogføring!$H:$H,Bogføring!$B:$B,\">=\"&T!$E$4,Bogføring!$B:$B,\"<=\"&T!$E$5,Bogføring!$G:$G,A35)","v":0}]
[2040,{"$f":"IFERROR(VLOOKUP(A36,Kontoplan!$A$2:$D$31,2,0),\"\")","v":""},null,null,"",{"$f":"SUMIFS(Bogføring!$H:$H,Bogføring!$B:$B,\">=\"&T!$C$4,Bogføring!$B:$B,\"<=\"&T!$C$5,Bogføring!$G:$G,A36)-SUMIFS(Bogføring!$I:$I,Bogføring!$B:$B,\">=\"&T!$C$4,Bogføring!$B:$B,\"<=\"&T!$C$5,Bogføring!$G:$G,A36)","v":27955.019999999997},-0.23317393347339474,{"$f":"SUMIFS(Bogføring!$H:$H,Bogføring!$B:$B,\">=\"&T!$D$4,Bogføring!$B:$B,\"<=\"&T!$D$5,Bogføring!$G:$G,A36)","v":36455.490000000005},"",{"$f":"SUMIFS(Bogføring!$H:$H,Bogføring!$B:$B,\">=\"&T!$E$4,Bogføring!$B:$B,\"<=\"&T!$E$5,Bogføring!$G:$G,A36)","v":0}]
[2055,{"$f":"IFERROR(VLOOKUP(A37,Kontoplan!$A$2:$D$31,2,0),\"\")","v":""},null,null,"",{"$f":"SUMIFS(Bogføring!$H:$H,Bogføring!$B:$B,\">=\"&T!$C$4,Bogføring!$B:$B,\"<=\"&T!$C$5,Bogføring!$G:$G,A37)-SUMIFS(Bogføring!$I:$I,Bogføring!$B:$B,\">=\"&T!$C$4,Bogføring!$B:$B,\"<=\"&T!$C$5,Bogføring!$G:$G,A37)","v":0},-1,{"$f":"SUMIFS(Bogføring!$H:$H,Bogføring!$B:$B,\">=\"&T!$D$4,Bogføring!$B:$B,\"<=\"&T!$D$5,Bogføring!$G:$G,A37)","v":693.65},"",{"$f":"SUMIFS(Bogføring!$H:$H,Bogføring!$B:$B,\">=\"&T!$E$4,Bogføring!$B:$B,\"<=\"&T!$E$5,Bogføring!$G:$G,A37)","v":0}]
[2060,{"$f":"IFERROR(VLOOKUP(A38,Kontoplan!$A$2:$D$31,2,0),\"\")","v":""},null,null,"",{"$f":"SUMIFS(Bogføring!$H:$H,Bogføring!$B:$B,\">=\"&T!$C$4,Bogføring!$B:$B,\"<=\"&T!$C$5,Bogføring!$G:$G,A38)-SUMIFS(Bogføring!$I:$I,Bogføring!$B:$B,\">=\"&T!$C$4,Bogføring!$B:$B,\"<=\"&T!$C$5,Bogføring!$G:$G,A38)","v":2230.96},-0.86695125653104521,{"$f":"SUMIFS(Bogføring!$H:$H,Bogføring!$B:$B,\">=\"&T!$D$4,Bogføring!$B:$B,\"<=\"&T!$D$5,Bogføring!$G:$G,A38)","v":16767.989999999998},"",{"$f":"SUMIFS(Bogføring!$H:$H,Bogføring!$B:$B,\">=\"&T!$E$4,Bogføring!$B:$B,\"<=\"&T!$E$5,Bogføring!$G:$G,A38)","v":0}]
[2065,{"$f":"IFERROR(VLOOKUP(A39,Kontoplan!$A$2:$D$31,2,0),\"\")","v":""},null,null,"",{"$f":"SUMIFS(Bogføring!$H:$H,Bogføring!$B:$B,\">=\"&T!$C$4,Bogføring!$B:$B,\"<=\"&T!$C$5,Bogføring!$G:$G,A39)-SUMIFS(Bogføring!$I:$I,Bogføring!$B:$B,\">=\"&T!$C$4,Bogføring!$B:$B,\"<=\"&T!$C$5,Bogføring!$G:$G,A39)","v":11386.63},-0.68006591637386904,{"$f":"SUMIFS(Bogføring!$H:$H,Bogføring!$B:$B,\">=\"&T!$D$4,Bogføring!$B:$B,\"<=\"&T!$D$5,Bogføring!$G:$G,A39)","v":35590.550000000003},"",{"$f":"SUMIFS(Bogføring!$H:$H,Bogføring!$B:$B,\">=\"&T!$E$4,Bogføring!$B:$B,\"<=\"&T!$E$5,Bogføring!$G:$G,A39)","v":0}]
[2070,{"$f":"IFERROR(VLOOKUP(A40,Kontoplan!$A$2:$D$31,2,0),\"\")","v":""},null,null,"",{"$f":"SUMIFS(Bogføring!$H:$H,Bogføring!$B:$B,\">=\"&T!$C$4,Bogføring!$B:$B,\"<=\"&T!$C$5,Bogføring!$G:$G,A40)-SUMIFS(Bogføring!$I:$I,Bogføring!$B:$B,\">=\"&T!$C$4,Bogføring!$B:$B,\"<=\"&T!$C$5,Bogføring!$G:$G,A40)","v":0},{"$f":"IFERROR((F40-H40)/H40,\"\")","v":-1},{"$f":"SUMIFS(Bogføring!$H:$H,Bogføring!$B:$B,\">=\"&T!$D$4,Bogføring!$B:$B,\"<=\"&T!$D$5,Bogføring!$G:$G,A40)","v":1462.5},"",{"$f":"SUMIFS(Bogføring!$H:$H,Bogføring!$B:$B,\">=\"&T!$E$4,Bogføring!$B:$B,\"<=\"&T!$E$5,Bogføring!$G:$G,A40)","v":0}]
[2090,{"$f":"IFERROR(VLOOKUP(A41,Kontoplan!$A$2:$D$31,2,0),\"\")","v":""},null,null,"",{"$f":"SUMIFS(Bogføring!$H:$H,Bogføring!$B:$B,\">=\"&T!$C$4,Bogføring!$B:$B,\"<=\"&T!$C$5,Bogføring!$G:$G,A41)-SUMIFS(Bogføring!$I:$I,Bogføring!$B:$B,\">=\"&T!$C$4,Bogføring!$B:$B,\"<=\"&T!$C$5,Bogføring!$G:$G,A41)","v":100},-0.96153846153846156,{"$f":"SUMIFS(Bogføring!$H:$H,Bogføring!$B:$B,\">=\"&T!$D$4,Bogføring!$B:$B,\"<=\"&T!$D$5,Bogføring!$G:$G,A41)","v":2600},"",{"$f":"SUMIFS(Bogføring!$H:$H,Bogføring!$B:$B,\">=\"&T!$E$4,Bogføring!$B:$B,\"<=\"&T!$E$5,Bogføring!$G:$G,A41)","v":0}]
[2100,{"$f":"IFERROR(VLOOKUP(A42,Kontoplan!$A$2:$D$31,2,0),\"\")","v":""},null,null,"",{"$f":"SUMIFS(Bogføring!$H:$H,Bogføring!$B:$B,\">=\"&T!$C$4,Bogføring!$B:$B,\"<=\"&T!$C$5,Bogføring!$G:$G,A42)-SUMIFS(Bogføring!$I:$I,Bogføring!$B:$B,\">=\"&T!$C$4,Bogføring!$B:$B,\"<=\"&T!$C$5,Bogføring!$G:$G,A42)","v":1405.25},-0.17832689170462454,{"$f":"SUMIFS(Bogføring!$H:$H,Bogføring!$B:$B,\">=\"&T!$D$4,Bogføring!$B:$B,\"<=\"&T!$D$5,Bogføring!$G:$G,A42)","v":1710.23},"",{"$f":"SUMIFS(Bogføring!$H:$H,Bogføring!$B:$B,\">=\"&T!$E$4,Bogføring!$B:$B,\"<=\"&T!$E$5,Bogføring!$G:$G,A42)","v":0}]
[2140,{"$f":"IFERROR(VLOOKUP(A43,Kontoplan!$A$2:$D$31,2,0),\"\")","v":""},null,null,"",{"$f":"SUMIFS(Bogføring!$H:$H,Bogføring!$B:$B,\">=\"&T!$C$4,Bogføring!$B:$B,\"<=\"&T!$C$5,Bogføring!$G:$G,A43)-SUMIFS(Bogføring!$I:$I,Bogføring!$B:$B,\">=\"&T!$C$4,Bogføring!$B:$B,\"<=\"&T!$C$5,Bogføring!$G:$G,A43)","v":0},-1,{"$f":"SUMIFS(Bogføring!$H:$H,Bogføring!$B:$B,\">=\"&T!$D$4,Bogføring!$B:$B,\"<=\"&T!$D$5,Bogføring!$G:$G,A43)","v":545},"",{"$f":"SUMIFS(Bogføring!$H:$H,Bogføring!$B:$B,\">=\"&T!$E$4,Bogføring!$B:$B,\"<=\"&T!$E$5,Bogføring!$G:$G,A43)","v":0}]
[2110,{"$f":"IFERROR(VLOOKUP(A44,Kontoplan!$A$2:$D$31,2,0),\"\")","v":""},null,null,"",{"$f":"SUMIFS(Bogføring!$H:$H,Bogføring!$B:$B,\">=\"&T!$C$4,Bogføring!$B:$B,\"<=\"&T!$C$5,Bogføring!$G:$G,A44)-SUMIFS(Bogføring!$I:$I,Bogføring!$B:$B,\">=\"&T!$C$4,Bogføring!$B:$B,\"<=\"&T!$C$5,Bogføring!$G:$G,A44)","v":1483.4},-0.75643155979692223,{"$f":"SUMIFS(Bogføring!$H:$H,Bogføring!$B:$B,\">=\"&T!$D$4,Bogføring!$B:$B,\"<=\"&T!$D$5,Bogføring!$G:$G,A44)","v":6090.28},"",{"$f":"SUMIFS(Bogføring!$H:$H,Bogføring!$B:$B,\">=\"&T!$E$4,Bogføring!$B:$B,\"<=\"&T!$E$5,Bogføring!$G:$G,A44)","v":0}]
[2120,{"$f":"IFERROR(VLOOKUP(A45,Kontoplan!$A$2:$D$31,2,0),\"\")","v":""},null,null,"",{"$f":"SUMIFS(Bogføring!$H:$H,Bogføring!$B:$B,\">=\"&T!$C$4,Bogføring!$B:$B,\"<=\"&T!$C$5,Bogføring!$G:$G,A45)-SUMIFS(Bogføring!$I:$I,Bogføring!$B:$B,\">=\"&T!$C$4,Bogføring!$B:$B,\"<=\"&T!$C$5,Bogføring!$G:$G,A45)","v":0},-1,{"$f":"SUMIFS(Bogføring!$H:$H,Bogføring!$B:$B,\">=\"&T!$D$4,Bogføring!$B:$B,\"<=\"&T!$D$5,Bogføring!$G:$G,A45)","v":947.14},"",{"$f":"SUMIFS(Bogføring!$H:$H,Bogføring!$B:$B,\">=\"&T!$E$4,Bogføring!$B:$B,\"<=\"&T!$E$5,Bogføring!$G:$G,A45)","v":0}]
[2165,{"$f":"IFERROR(VLOOKUP(A46,Kontoplan!$A$2:$D$31,2,0),\"\")","v":""},null,null,"",{"$f":"SUMIFS(Bogføring!$H:$H,Bogføring!$B:$B,\">=\"&T!$C$4,Bogføring!$B:$B,\"<=\"&T!$C$5,Bogføring!$G:$G,A46)-SUMIFS(Bogføring!$I:$I,Bogføring!$B:$B,\">=\"&T!$C$4,Bogføring!$B:$B,\"<=\"&T!$C$5,Bogføring!$G:$G,A46)","v":3785.94},-0.73935528998044098,{"$f":"SUMIFS(Bogføring!$H:$H,Bogføring!$B:$B,\">=\"&T!$D$4,Bogføring!$B:$B,\"<=\"&T!$D$5,Bogføring!$G:$G,A46)","v":14525.29},"",{"$f":"SUMIFS(Bogføring!$H:$H,Bogføring!$B:$B,\">=\"&T!$E$4,Bogføring!$B:$B,\"<=\"&T!$E$5,Bogføring!$G:$G,A46)","v":0}]
[2170,{"$f":"IFERROR(VLOOKUP(A47,Kontoplan!$A$2:$D$31,2,0),\"\")","v":""},null,null,"",{"$f":"SUMIFS(Bogføring!$H:$H,Bogføring!$B:$B,\">=\"&T!$C$4,Bogføring!$B:$B,\"<=\"&T!$C$5,Bogføring!$G:$G,A47)-SUMIFS(Bogføring!$I:$I,Bogføring!$B:$B,\">=\"&T!$C$4,Bogføring!$B:$B,\"<=\"&T!$C$5,Bogføring!$G:$G,A47)","v":306.10000000000002},"",{"$f":"SUMIFS(Bogføring!$H:$H,Bogføring!$B:$B,\">=\"&T!$D$4,Bogføring!$B:$B,\"<=\"&T!$D$5,Bogføring!$G:$G,A47)","v":0},"",{"$f":"SUMIFS(Bogføring!$H:$H,Bogføring!$B:$B,\">=\"&T!$E$4,Bogføring!$B:$B,\"<=\"&T!$E$5,Bogføring!$G:$G,A47)","v":0}]
[2180,{"$f":"IFERROR(VLOOKUP(A48,Kontoplan!$A$2:$D$31,2,0),\"\")","v":""},null,null,null,{"$f":"SUMIFS(Bogføring!$H:$H,Bogføring!$B:$B,\">=\"&T!$C$4,Bogføring!$B:$B,\"<=\"&T!$C$5,Bogføring!$G:$G,A48)-SUMIFS(Bogføring!$I:$I,Bogføring!$B:$B,\">=\"&T!$C$4,Bogføring!$B:$B,\"<=\"&T!$C$5,Bogføring!$G:$G,A48)","v":0},"",{"$f":"SUMIFS(Bogføring!$H:$H,Bogføring!$B:$B,\">=\"&T!$D$4,Bogføring!$B:$B,\"<=\"&T!$D$5,Bogføring!$G:$G,A48)","v":0},{"$f":"IFERROR((H48-J48)/J48,\"\")","v":""},{"$f":"SUMIFS(Bogføring!$H:$H,Bogføring!$B:$B,\">=\"&T!$E$4,Bogføring!$B:$B,\"<=\"&T!$E$5,Bogføring!$G:$G,A48)","v":0}]
[2190,{"$f":"IFERROR(VLOOKUP(A49,Kontoplan!$A$2:$D$31,2,0),\"\")","v":""},null,null,"",{"$f":"SUMIFS(Bogføring!$H:$H,Bogføring!$B:$B,\">=\"&T!$C$4,Bogføring!$B:$B,\"<=\"&T!$C$5,Bogføring!$G:$G,A49)-SUMIFS(Bogføring!$I:$I,Bogføring!$B:$B,\">=\"&T!$C$4,Bogføring!$B:$B,\"<=\"&T!$C$5,Bogføring!$G:$G,A49)","v":0},{"$f":"IFERROR((F49-H49)/H49,\"\")","v":-1},{"$f":"SUMIFS(Bogføring!$H:$H,Bogføring!$B:$B,\">=\"&T!$D$4,Bogføring!$B:$B,\"<=\"&T!$D$5,Bogføring!$G:$G,A49)","v":9777.3999999999978},"",{"$f":"SUMIFS(Bogføring!$H:$H,Bogføring!$B:$B,\">=\"&T!$E$4,Bogføring!$B:$B,\"<=\"&T!$E$5,Bogføring!$G:$G,A49)","v":0}]
[2200,{"$f":"IFERROR(VLOOKUP(A50,Kontoplan!$A$2:$D$31,2,0),\"\")","v":""},null,null,"",{"$f":"SUMIFS(Bogføring!$H:$H,Bogføring!$B:$B,\">=\"&T!$C$4,Bogføring!$B:$B,\"<=\"&T!$C$5,Bogføring!$G:$G,A50)-SUMIFS(Bogføring!$I:$I,Bogføring!$B:$B,\">=\"&T!$C$4,Bogføring!$B:$B,\"<=\"&T!$C$5,Bogføring!$G:$G,A50)","v":0},-1,{"$f":"SUMIFS(Bogføring!$H:$H,Bogføring!$B:$B,\">=\"&T!$D$4,Bogføring!$B:$B,\"<=\"&T!$D$5,Bogføring!$G:$G,A50)","v":2250},"",{"$f":"SUMIFS(Bogføring!$H:$H,Bogføring!$B:$B,\">=\"&T!$E$4,Bogføring!$B:$B,\"<=\"&T!$E$5,Bogføring!$G:$G,A50)","v":0}]
[3100,{"$f":"IFERROR(VLOOKUP(A51,Kontoplan!$A$2:$D$31,2,0),\"\")","v":""},null,null,"",{"$f":"SUMIFS(Bogføring!$H:$H,Bogføring!$B:$B,\">=\"&T!$C$4,Bogføring!$B:$B,\"<=\"&T!$C$5,Bogføring!$G:$G,A51)-SUMIFS(Bogføring!$I:$I,Bogføring!$B:$B,\">=\"&T!$C$4,Bogføring!$B:$B,\"<=\"&T!$C$5,Bogføring!$G:$G,A51)","v":0},-1,{"$f":"SUMIFS(Bogføring!$H:$H,Bogføring!$B:$B,\">=\"&T!$D$4,Bogføring!$B:$B,\"<=\"&T!$D$5,Bogføring!$G:$G,A51)","v":37480.11},"",{"$f":"SUMIFS(Bogføring!$H:$H,Bogføring!$B:$B,\">=\"&T!$E$4,Bogføring!$B:$B,\"<=\"&T!$E$5,Bogføring!$G:$G,A51)","v":0}]
[3110,{"$f":"IFERROR(VLOOKUP(A52,Kontoplan!$A$2:$D$31,2,0),\"\")","v":""},null,null,"",{"$f":"SUMIFS(Bogføring!$H:$H,Bogføring!$B:$B,\">=\"&T!$C$4,Bogføring!$B:$B,\"<=\"&T!$C$5,Bogføring!$G:$G,A52)-SUMIFS(Bogføring!$I:$I,Bogføring!$B:$B,\">=\"&T!$C$4,Bogføring!$B:$B,\"<=\"&T!$C$5,Bogføring!$G:$G,A52)","v":40800},-0.57290094159640204,{"$f":"SUMIFS(Bogføring!$H:$H,Bogføring!$B:$B,\">=\"&T!$D$4,Bogføring!$B:$B,\"<=\"&T!$D$5,Bogføring!$G:$G,A52)","v":95528.189999999988},"",{"$f":"SUMIFS(Bogføring!$H:$H,Bogføring!$B:$B,\">=\"&T!$E$4,Bogføring!$B:$B,\"<=\"&T!$E$5,Bogføring!$G:$G,A52)","v":0}]
[3120,{"$f":"IFERROR(VLOOKUP(A53,Kontoplan!$A$2:$D$31,2,0),\"\")","v":""},null,null,"",{"$f":"SUMIFS(Bogføring!$H:$H,Bogføring!$B:$B,\">=\"&T!$C$4,Bogføring!$B:$B,\"<=\"&T!$C$5,Bogføring!$G:$G,A53)-SUMIFS(Bogføring!$I:$I,Bogføring!$B:$B,\">=\"&T!$C$4,Bogføring!$B:$B,\"<=\"&T!$C$5,Bogføring!$G:$G,A53)","v":820.3},-0.65830087684585425,{"$f":"SUMIFS(Bogføring!$H:$H,Bogføring!$B:$B,\">=\"&T!$D$4,Bogføring!$B:$B,\"<=\"&T!$D$5,Bogføring!$G:$G,A53)","v":2400.6499999999996},"",{"$f":"SUMIFS(Bogføring!$H:$H,Bogføring!$B:$B,\">=\"&T!$E$4,Bogføring!$B:$B,\"<=\"&T!$E$5,Bogføring!$G:$G,A53)","v":0}]
[null,{"$f":"IFERROR(VLOOKUP(A54,Kontoplan!$A$2:$D$31,2,0),\"\")","v":""},null,null,"",{"$f":"SUMIFS(Bogføring!$H:$H,Bogføring!$B:$B,\">=\"&T!$C$4,Bogføring!$B:$B,\"<=\"&T!$C$5,Bogføring!$G:$G,A54)-SUMIFS(Bogføring!$I:$I,Bogføring!$B:$B,\">=\"&T!$C$4,Bogføring!$B:$B,\"<=\"&T!$C$5,Bogføring!$G:$G,A54)","v":0},"",{"$f":"SUMIFS(Bogføring!$H:$H,Bogføring!$B:$B,\">=\"&T!$D$4,Bogføring!$B:$B,\"<=\"&T!$D$5,Bogføring!$G:$G,A54)","v":0},"",{"$f":"SUMIFS(Bogføring!$H:$H,Bogføring!$B:$B,\">=\"&T!$E$4,Bogføring!$B:$B,\"<=\"&T!$E$5,Bogføring!$G:$G,A54)","v":0}]
[null,{"$f":"IFERROR(VLOOKUP(A55,Kontoplan!$A$2:$D$31,2,0),\"\")","v":""},null,null,"",{"$f":"SUMIFS(Bogføring!$H:$H,Bogføring!$B:$B,\">=\"&T!$C$4,Bogføring!$B:$B,\"<=\"&T!$C$5,Bogføring!$G:$G,A55)-SUMIFS(Bogføring!$I:$I,Bogføring!$B:$B,\">=\"&T!$C$4,Bogføring!$B:$B,\"<=\"&T!$C$5,Bogføring!$G:$G,A55)","v":0},"",{"$f":"SUMIFS(Bogføring!$H:$H,Bogføring!$B:$B,\">=\"&T!$D$4,Bogføring!$B:$B,\"<=\"&T!$D$5,Bogføring!$G:$G,A55)","v":0},"",{"$f":"SUMIFS(Bogføring!$H:$H,Bogføring!$B:$B,\">=\"&T!$E$4,Bogføring!$B:$B,\"<=\"&T!$E$5,Bogføring!$G:$G,A55)","v":0}]
[null,{"$f":"IFERROR(VLOOKUP(A56,Kontoplan!$A$2:$D$31,2,0),\"\")","v":""},null,null,"",{"$f":"SUMIFS(Bogføring!$H:$H,Bogføring!$B:$B,\">=\"&T!$C$4,Bogføring!$B:$B,\"<=\"&T!$C$5,Bogføring!$G:$G,A56)-SUMIFS(Bogføring!$I:$I,Bogføring!$B:$B,\">=\"&T!$C$4,Bogføring!$B:$B,\"<=\"&T!$C$5,Bogføring!$G:$G,A56)","v":0},"",{"$f":"SUMIFS(Bogføring!$H:$H,Bogføring!$B:$B,\">=\"&T!$D$4,Bogføring!$B:$B,\"<=\"&T!$D$5,Bogføring!$G:$G,A56)","v":0},"",{"$f":"SUMIFS(Bogføring!$H:$H,Bogføring!$B:$B,\">=\"&T!$E$4,Bogføring!$B:$B,\"<=\"&T!$E$5,Bogføring!$G:$G,A56)","v":0}]
[null,null,null,null,null,null,"",null,""]
[null,"Udgifter i alt",null,null,"",{"$f":"SUM(F31:F57)","v":91230.930000000008},-0.7393517057604172,{"$f":"SUM(H31:H57)","v":350015.45},"",{"$f":"SUM(J31:J57)","v":0}]
[null,null,null,null,null,null,null,null,""]
[null,{"$f":"IF(F60<0,\"Årets resultat, Underskud\",\"Årets resultat, Overskud\")","v":"Årets resultat, Overskud"},null,null,"",{"$f":"F27-F58","v":12137.169999999998},{"$f":"IFERROR((F60-H60)/H60,\"\")","v":-2.9954311399297713},{"$f":"H27-H58","v":-6082.4799999999814},"",{"$f":"J27-J58","v":0}]
[null,null,null,null,{"$f":"IFERROR((D61-F61)/D61,\"\")","v":""},null,{"$f":"IFERROR((F61-H61)/F61,\"\")","v":""},null,{"$f":"IFERROR((H61-J61)/H61,\"\")","v":""}]

{"sheet":"Kontoplan (2)","index":5,"n_rows":78,"n_cols":9,"rows_kept":78,"cut":false,"hidden":true,"merged":[]}
["Konto","Kontobeskrivelse","Saldo","Kommentarer","Fra","Til"]
[1000,"Entre",{"$f":"SUMIFS(Bogføring!$I:$I,Bogføring!$B:$B,\">=\"&T!$C$4,Bogføring!$B:$B,\"<=\"&T!$C$5,Bogføring!$G:$G,A2)-SUMIFS(Bogføring!$H:$H,Bogføring!$B:$B,\">=\"&T!$C$4,Bogføring!$B:$B,\"<=\"&T!$C$5,Bogføring!$G:$G,A2)","v":8740},{"$f":"SUM(C3:C10)","v":0}]
[1001,"Voksne",{"$f":"SUMIFS(Bogføring!$I:$I,Bogføring!$B:$B,\">=\"&T!$C$4,Bogføring!$B:$B,\"<=\"&T!$C$5,Bogføring!$G:$G,A3)-SUMIFS(Bogføring!$H:$H,Bogføring!$B:$B,\">=\"&T!$C$4,Bogføring!$B:$B,\"<=\"&T!$C$5,Bogføring!$G:$G,A3)","v":0},null,null,null,null,null,14603.17]
[1002,"Pensionister",{"$f":"SUMIFS(Bogføring!$I:$I,Bogføring!$B:$B,\">=\"&T!$C$4,Bogføring!$B:$B,\"<=\"&T!$C$5,Bogføring!$G:$G,A4)-SUMIFS(Bogføring!$H:$H,Bogføring!$B:$B,\">=\"&T!$C$4,Bogføring!$B:$B,\"<=\"&T!$C$5,Bogføring!$G:$G,A4)","v":0}]
[1003,"Børn 6/16",{"$f":"SUMIFS(Bogføring!$I:$I,Bogføring!$B:$B,\">=\"&T!$C$4,Bogføring!$B:$B,\"<=\"&T!$C$5,Bogføring!$G:$G,A5)-SUMIFS(Bogføring!$H:$H,Bogføring!$B:$B,\">=\"&T!$C$4,Bogføring!$B:$B,\"<=\"&T!$C$5,Bogføring!$G:$G,A5)","v":0}]
[1004,"Børn u/6",{"$f":"SUMIFS(Bogføring!$I:$I,Bogføring!$B:$B,\">=\"&T!$C$4,Bogføring!$B:$B,\"<=\"&T!$C$5,Bogføring!$G:$G,A6)-SUMIFS(Bogføring!$H:$H,Bogføring!$B:$B,\">=\"&T!$C$4,Bogføring!$B:$B,\"<=\"&T!$C$5,Bogføring!$G:$G,A6)","v":0}]
[1005,"skoler",{"$f":"SUMIFS(Bogføring!$I:$I,Bogføring!$B:$B,\">=\"&T!$C$4,Bogføring!$B:$B,\"<=\"&T!$C$5,Bogføring!$G:$G,A7)-SUMIFS(Bogføring!$H:$H,Bogføring!$B:$B,\">=\"&T!$C$4,Bogføring!$B:$B,\"<=\"&T!$C$5,Bogføring!$G:$G,A7)","v":0}]
[1006,"BH skoler",{"$f":"SUMIFS(Bogføring!$I:$I,Bogføring!$B:$B,\">=\"&T!$C$4,Bogføring!$B:$B,\"<=\"&T!$C$5,Bogføring!$G:$G,A8)-SUMIFS(Bogføring!$H:$H,Bogføring!$B:$B,\">=\"&T!$C$4,Bogføring!$B:$B,\"<=\"&T!$C$5,Bogføring!$G:$G,A8)","v":0}]
[1007,"Grupper",{"$f":"SUMIFS(Bogføring!$I:$I,Bogføring!$B:$B,\">=\"&T!$C$4,Bogføring!$B:$B,\"<=\"&T!$C$5,Bogføring!$G:$G,A9)-SUMIFS(Bogføring!$H:$H,Bogføring!$B:$B,\">=\"&T!$C$4,Bogføring!$B:$B,\"<=\"&T!$C$5,Bogføring!$G:$G,A9)","v":0}]
[1008,"Militær ID",{"$f":"SUMIFS(Bogføring!$I:$I,Bogføring!$B:$B,\">=\"&T!$C$4,Bogføring!$B:$B,\"<=\"&T!$C$5,Bogføring!$G:$G,A10)-SUMIFS(Bogføring!$H:$H,Bogføring!$B:$B,\">=\"&T!$C$4,Bogføring!$B:$B,\"<=\"&T!$C$5,Bogføring!$G:$G,A10)","v":0}]
[1010,"Kiosk salg",{"$f":"SUMIFS(Bogføring!$I:$I,Bogføring!$B:$B,\">=\"&T!$C$4,Bogføring!$B:$B,\"<=\"&T!$C$5,Bogføring!$G:$G,A11)-SUMIFS(Bogføring!$H:$H,Bogføring!$B:$B,\">=\"&T!$C$4,Bogføring!$B:$B,\"<=\"&T!$C$5,Bogføring!$G:$G,A11)","v":75}]
[1011,"Sodavand",{"$f":"SUMIFS(Bogføring!$I:$I,Bogføring!$B:$B,\">=\"&T!$C$4,Bogføring!$B:$B,\"<=\"&T!$C$5,Bogføring!$G:$G,A12)-SUMIFS(Bogføring!$H:$H,Bogføring!$B:$B,\">=\"&T!$C$4,Bogføring!$B:$B,\"<=\"&T!$C$5,Bogføring!$G:$G,A12)","v":0}]
[1012,"kort",{"$f":"SUMIFS(Bogføring!$I:$I,Bogføring!$B:$B,\">=\"&T!$C$4,Bogføring!$B:$B,\"<=\"&T!$C$5,Bogføring!$G:$G,A13)-SUMIFS(Bogføring!$H:$H,Bogføring!$B:$B,\">=\"&T!$C$4,Bogføring!$B:$B,\"<=\"&T!$C$5,Bogføring!$G:$G,A13)","v":0}]
[1013,"Bælter",{"$f":"SUMIFS(Bogføring!$I:$I,Bogføring!$B:$B,\">=\"&T!$C$4,Bogføring!$B:$B,\"<=\"&T!$C$5,Bogføring!$G:$G,A14)-SUMIFS(Bogføring!$H:$H,Bogføring!$B:$B,\">=\"&T!$C$4,Bogføring!$B:$B,\"<=\"&T!$C$5,Bogføring!$G:$G,A14)","v":0}]
[1014,"Færdige Tinsoldater",{"$f":"SUMIFS(Bogføring!$I:$I,Bogføring!$B:$B,\">=\"&T!$C$4,Bogføring!$B:$B,\"<=\"&T!$C$5,Bogføring!$G:$G,A15)-SUMIFS(Bogføring!$H:$H,Bogføring!$B:$B,\">=\"&T!$C$4,Bogføring!$B:$B,\"<=\"&T!$C$5,Bogføring!$G:$G,A15)","v":0}]
[1015]
[1020,"Tilskud BRK",{"$f":"SUMIFS(Bogføring!$I:$I,Bogføring!$B:$B,\">=\"&T!$C$4,Bogføring!$B:$B,\"<=\"&T!$C$5,Bogføring!$G:$G,A17)-SUMIFS(Bogføring!$H:$H,Bogføring!$B:$B,\">=\"&T!$C$4,Bogføring!$B:$B,\"<=\"&T!$C$5,Bogføring!$G:$G,A17)","v":74021}]
[1030,"Tilskud KVB",{"$f":"SUMIFS(Bogføring!$I:$I,Bogføring!$B:$B,\">=\"&T!$C$4,Bogføring!$B:$B,\"<=\"&T!$C$5,Bogføring!$G:$G,A18)-SUMIFS(Bogføring!$H:$H,Bogføring!$B:$B,\">=\"&T!$C$4,Bogføring!$B:$B,\"<=\"&T!$C$5,Bogføring!$G:$G,A18)","v":20000}]
[1040,"Fonde/Gaver",{"$f":"SUMIFS(Bogføring!$I:$I,Bogføring!$B:$B,\">=\"&T!$C$4,Bogføring!$B:$B,\"<=\"&T!$C$5,Bogføring!$G:$G,A19)-SUMIFS(Bogføring!$H:$H,Bogføring!$B:$B,\">=\"&T!$C$4,Bogføring!$B:$B,\"<=\"&T!$C$5,Bogføring!$G:$G,A19)","v":0}]
[1050,"Aktiviteter",{"$f":"SUMIFS(Bogføring!$I:$I,Bogføring!$B:$B,\">=\"&T!$C$4,Bogføring!$B:$B,\"<=\"&T!$C$5,Bogføring!$G:$G,A20)-SUMIFS(Bogføring!$H:$H,Bogføring!$B:$B,\">=\"&T!$C$4,Bogføring!$B:$B,\"<=\"&T!$C$5,Bogføring!$G:$G,A20)","v":0}]
[1060,null,{"$f":"SUMIFS(Bogføring!$I:$I,Bogføring!$B:$B,\">=\"&T!$C$4,Bogføring!$B:$B,\"<=\"&T!$C$5,Bogføring!$G:$G,A21)-SUMIFS(Bogføring!$H:$H,Bogføring!$B:$B,\">=\"&T!$C$4,Bogføring!$B:$B,\"<=\"&T!$C$5,Bogføring!$G:$G,A21)","v":0}]
[1070,"Pengegaver",{"$f":"SUMIFS(Bogføring!$I:$I,Bogføring!$B:$B,\">=\"&T!$C$4,Bogføring!$B:$B,\"<=\"&T!$C$5,Bogføring!$G:$G,A22)-SUMIFS(Bogføring!$H:$H,Bogføring!$B:$B,\">=\"&T!$C$4,Bogføring!$B:$B,\"<=\"&T!$C$5,Bogføring!$G:$G,A22)","v":0}]
[1080,"Flaskepant retur",{"$f":"SUMIFS(Bogføring!$I:$I,Bogføring!$B:$B,\">=\"&T!$C$4,Bogføring!$B:$B,\"<=\"&T!$C$5,Bogføring!$G:$G,A23)-SUMIFS(Bogføring!$H:$H,Bogføring!$B:$B,\">=\"&T!$C$4,Bogføring!$B:$B,\"<=\"&T!$C$5,Bogføring!$G:$G,A23)","v":0}]
[1090,"Kassedifferance",{"$f":"SUMIFS(Bogføring!$I:$I,Bogføring!$B:$B,\">=\"&T!$C$4,Bogføring!$B:$B,\"<=\"&T!$C$5,Bogføring!$G:$G,A24)-SUMIFS(Bogføring!$H:$H,Bogføring!$B:$B,\">=\"&T!$C$4,Bogføring!$B:$B,\"<=\"&T!$C$5,Bogføring!$G:$G,A24)","v":0}]
[1100,null,{"$f":"SUMIFS(Bogføring!$I:$I,Bogføring!$B:$B,\">=\"&T!$C$4,Bogføring!$B:$B,\"<=\"&T!$C$5,Bogføring!$G:$G,A25)-SUMIFS(Bogføring!$H:$H,Bogføring!$B:$B,\">=\"&T!$C$4,Bogføring!$B:$B,\"<=\"&T!$C$5,Bogføring!$G:$G,A25)","v":0}]
[1110,null,{"$f":"SUMIFS(Bogføring!$I:$I,Bogføring!$B:$B,\">=\"&T!$C$4,Bogføring!$B:$B,\"<=\"&T!$C$5,Bogføring!$G:$G,A26)-SUMIFS(Bogføring!$H:$H,Bogføring!$B:$B,\">=\"&T!$C$4,Bogføring!$B:$B,\"<=\"&T!$C$5,Bogføring!$G:$G,A26)","v":2.9}]
[1120,null,{"$f":"SUMIFS(Bogføring!$I:$I,Bogføring!$B:$B,\">=\"&T!$C$4,Bogføring!$B:$B,\"<=\"&T!$C$5,Bogføring!$G:$G,A27)-SUMIFS(Bogføring!$H:$H,Bogføring!$B:$B,\">=\"&T!$C$4,Bogføring!$B:$B,\"<=\"&T!$C$5,Bogføring!$G:$G,A27)","v":11493.46}]
[1130,"Diverse Indtægter",{"$f":"SUMIFS(Bogføring!$I:$I,Bogføring!$B:$B,\">=\"&T!$C$4,Bogføring!$B:$B,\"<=\"&T!$C$5,Bogføring!$G:$G,A28)-SUMIFS(Bogføring!$H:$H,Bogføring!$B:$B,\">=\"&T!$C$4,Bogføring!$B:$B,\"<=\"&T!$C$5,Bogføring!$G:$G,A28)","v":532.1},null,null,null,{"$f":"SUM(C2:C28)","v":114864.45999999999}]
[2000,"Bankgebyr+iZ",{"$f":"SUMIFS(Bogføring!$H:$H,Bogføring!$B:$B,\">=\"&T!$C$4,Bogføring!$B:$B,\"<=\"&T!$C$5,Bogføring!$G:$G,A29)-SUMIFS(Bogføring!$I:$I,Bogføring!$B:$B,\">=\"&T!$C$4,Bogføring!$B:$B,\"<=\"&T!$C$5,Bogføring!$G:$G,A29)","v":109.5}]
[2010,"Visma ",{"$f":"SUMIFS(Bogføring!$H:$H,Bogføring!$B:$B,\">=\"&T!$C$4,Bogføring!$B:$B,\"<=\"&T!$C$5,Bogføring!$G:$G,A30)-SUMIFS(Bogføring!$I:$I,Bogføring!$B:$B,\">=\"&T!$C$4,Bogføring!$B:$B,\"<=\"&T!$C$5,Bogføring!$G:$G,A30)","v":27.5}]
[2020,"Revision",{"$f":"SUMIFS(Bogføring!$H:$H,Bogføring!$B:$B,\">=\"&T!$C$4,Bogføring!$B:$B,\"<=\"&T!$C$5,Bogføring!$G:$G,A31)-SUMIFS(Bogføring!$I:$I,Bogføring!$B:$B,\">=\"&T!$C$4,Bogføring!$B:$B,\"<=\"&T!$C$5,Bogføring!$G:$G,A31)","v":0}]
[2030,"Bygnings vedligehold",{"$f":"SUMIFS(Bogføring!$H:$H,Bogføring!$B:$B,\">=\"&T!$C$4,Bogføring!$B:$B,\"<=\"&T!$C$5,Bogføring!$G:$G,A32)-SUMIFS(Bogføring!$I:$I,Bogføring!$B:$B,\">=\"&T!$C$4,Bogføring!$B:$B,\"<=\"&T!$C$5,Bogføring!$G:$G,A32)","v":329.7}]
[2040,"El, Vand og Varme",{"$f":"SUMIFS(Bogføring!$H:$H,Bogføring!$B:$B,\">=\"&T!$C$4,Bogføring!$B:$B,\"<=\"&T!$C$5,Bogføring!$G:$G,A33)-SUMIFS(Bogføring!$I:$I,Bogføring!$B:$B,\">=\"&T!$C$4,Bogføring!$B:$B,\"<=\"&T!$C$5,Bogføring!$G:$G,A33)","v":27955.019999999997}]
[2050,"Deltagelse i GF i Andre Foren.",{"$f":"SUMIFS(Bogføring!$H:$H,Bogføring!$B:$B,\">=\"&T!$C$4,Bogføring!$B:$B,\"<=\"&T!$C$5,Bogføring!$G:$G,A34)-SUMIFS(Bogføring!$I:$I,Bogføring!$B:$B,\">=\"&T!$C$4,Bogføring!$B:$B,\"<=\"&T!$C$5,Bogføring!$G:$G,A34)","v":0}]
[2055,"Indkøb af øl + vand",{"$f":"SUMIFS(Bogføring!$H:$H,Bogføring!$B:$B,\">=\"&T!$C$4,Bogføring!$B:$B,\"<=\"&T!$C$5,Bogføring!$G:$G,A35)-SUMIFS(Bogføring!$I:$I,Bogføring!$B:$B,\">=\"&T!$C$4,Bogføring!$B:$B,\"<=\"&T!$C$5,Bogføring!$G:$G,A35)","v":0}]
[2060,"Internet, mobiltelefon, Forsik.",{"$f":"SUMIFS(Bogføring!$H:$H,Bogføring!$B:$B,\">=\"&T!$C$4,Bogføring!$B:$B,\"<=\"&T!$C$5,Bogføring!$G:$G,A36)-SUMIFS(Bogføring!$I:$I,Bogføring!$B:$B,\">=\"&T!$C$4,Bogføring!$B:$B,\"<=\"&T!$C$5,Bogføring!$G:$G,A36)","v":2230.96}]
[2065,"Udstilling",{"$f":"SUMIFS(Bogføring!$H:$H,Bogføring!$B:$B,\">=\"&T!$C$4,Bogføring!$B:$B,\"<=\"&T!$C$5,Bogføring!$G:$G,A37)-SUMIFS(Bogføring!$I:$I,Bogføring!$B:$B,\">=\"&T!$C$4,Bogføring!$B:$B,\"<=\"&T!$C$5,Bogføring!$G:$G,A37)","v":11386.63}]
[2070,"Tin og sortkrudt",{"$f":"SUMIFS(Bogføring!$H:$H,Bogføring!$B:$B,\">=\"&T!$C$4,Bogføring!$B:$B,\"<=\"&T!$C$5,Bogføring!$G:$G,A38)-SUMIFS(Bogføring!$I:$I,Bogføring!$B:$B,\">=\"&T!$C$4,Bogføring!$B:$B,\"<=\"&T!$C$5,Bogføring!$G:$G,A38)","v":0}]
[2075,"Gaver",{"$f":"SUMIFS(Bogføring!$H:$H,Bogføring!$B:$B,\">=\"&T!$C$4,Bogføring!$B:$B,\"<=\"&T!$C$5,Bogføring!$G:$G,A39)-SUMIFS(Bogføring!$I:$I,Bogføring!$B:$B,\">=\"&T!$C$4,Bogføring!$B:$B,\"<=\"&T!$C$5,Bogføring!$G:$G,A39)","v":170}]
[2090,"Kontigent til andre Foreninger",{"$f":"SUMIFS(Bogføring!$H:$H,Bogføring!$B:$B,\">=\"&T!$C$4,Bogføring!$B:$B,\"<=\"&T!$C$5,Bogføring!$G:$G,A40)-SUMIFS(Bogføring!$I:$I,Bogføring!$B:$B,\">=\"&T!$C$4,Bogføring!$B:$B,\"<=\"&T!$C$5,Bogføring!$G:$G,A40)","v":100}]
[2100,"Forplejning til møder/Rejser",{"$f":"SUMIFS(Bogføring!$H:$H,Bogføring!$B:$B,\">=\"&T!$C$4,Bogføring!$B:$B,\"<=\"&T!$C$5,Bogføring!$G:$G,A41)-SUMIFS(Bogføring!$I:$I,Bogføring!$B:$B,\">=\"&T!$C$4,Bogføring!$B:$B,\"<=\"&T!$C$5,Bogføring!$G:$G,A41)","v":1405.25}]
[2110,"Kontorhold - Porto - IT",{"$f":"SUMIFS(Bogføring!$H:$H,Bogføring!$B:$B,\">=\"&T!$C$4,Bogføring!$B:$B,\"<=\"&T!$C$5,Bogføring!$G:$G,A42)-SUMIFS(Bogføring!$I:$I,Bogføring!$B:$B,\">=\"&T!$C$4,Bogføring!$B:$B,\"<=\"&T!$C$5,Bogføring!$G:$G,A42)","v":1483.4}]
[2120,"Hjemmeside",{"$f":"SUMIFS(Bogføring!$H:$H,Bogføring!$B:$B,\">=\"&T!$C$4,Bogføring!$B:$B,\"<=\"&T!$C$5,Bogføring!$G:$G,A43)-SUMIFS(Bogføring!$I:$I,Bogføring!$B:$B,\">=\"&T!$C$4,Bogføring!$B:$B,\"<=\"&T!$C$5,Bogføring!$G:$G,A43)","v":0}]
[2130,"Annoncer",{"$f":"SUMIFS(Bogføring!$H:$H,Bogføring!$B:$B,\">=\"&T!$C$4,Bogføring!$B:$B,\"<=\"&T!$C$5,Bogføring!$G:$G,A44)-SUMIFS(Bogføring!$I:$I,Bogføring!$B:$B,\">=\"&T!$C$4,Bogføring!$B:$B,\"<=\"&T!$C$5,Bogføring!$G:$G,A44)","v":2318.75}]
[2140,"Kassedifferance",{"$f":"SUMIFS(Bogføring!$H:$H,Bogføring!$B:$B,\">=\"&T!$C$4,Bogføring!$B:$B,\"<=\"&T!$C$5,Bogføring!$G:$G,A45)-SUMIFS(Bogføring!$I:$I,Bogføring!$B:$B,\">=\"&T!$C$4,Bogføring!$B:$B,\"<=\"&T!$C$5,Bogføring!$G:$G,A45)","v":0}]
[2150,"Øreafrundning",{"$f":"SUMIFS(Bogføring!$H:$H,Bogføring!$B:$B,\">=\"&T!$C$4,Bogføring!$B:$B,\"<=\"&T!$C$5,Bogføring!$G:$G,A46)-SUMIFS(Bogføring!$I:$I,Bogføring!$B:$B,\">=\"&T!$C$4,Bogføring!$B:$B,\"<=\"&T!$C$5,Bogføring!$G:$G,A46)","v":0}]
[2160,"Rejser",{"$f":"SUMIFS(Bogføring!$H:$H,Bogføring!$B:$B,\">=\"&T!$C$4,Bogføring!$B:$B,\"<=\"&T!$C$5,Bogføring!$G:$G,A47)-SUMIFS(Bogføring!$I:$I,Bogføring!$B:$B,\">=\"&T!$C$4,Bogføring!$B:$B,\"<=\"&T!$C$5,Bogføring!$G:$G,A47)","v":0}]
[2165,"G4S tyverialarm",{"$f":"SUMIFS(Bogføring!$H:$H,Bogføring!$B:$B,\">=\"&T!$C$4,Bogføring!$B:$B,\"<=\"&T!$C$5,Bogføring!$G:$G,A48)-SUMIFS(Bogføring!$I:$I,Bogføring!$B:$B,\">=\"&T!$C$4,Bogføring!$B:$B,\"<=\"&T!$C$5,Bogføring!$G:$G,A48)","v":3785.94}]
[2170,"Afholdelse af GF",{"$f":"SUMIFS(Bogføring!$H:$H,Bogføring!$B:$B,\">=\"&T!$C$4,Bogføring!$B:$B,\"<=\"&T!$C$5,Bogføring!$G:$G,A49)-SUMIFS(Bogføring!$I:$I,Bogføring!$B:$B,\">=\"&T!$C$4,Bogføring!$B:$B,\"<=\"&T!$C$5,Bogføring!$G:$G,A49)","v":306.10000000000002}]
[2180,"Bestyrelses møder",{"$f":"SUMIFS(Bogføring!$H:$H,Bogføring!$B:$B,\">=\"&T!$C$4,Bogføring!$B:$B,\"<=\"&T!$C$5,Bogføring!$G:$G,A50)-SUMIFS(Bogføring!$I:$I,Bogføring!$B:$B,\">=\"&T!$C$4,Bogføring!$B:$B,\"<=\"&T!$C$5,Bogføring!$G:$G,A50)","v":0}]
[2190,"Diverse Udgifter",{"$f":"SUMIFS(Bogføring!$H:$H,Bogføring!$B:$B,\">=\"&T!$C$4,Bogføring!$B:$B,\"<=\"&T!$C$5,Bogføring!$G:$G,A51)-SUMIFS(Bogføring!$I:$I,Bogføring!$B:$B,\">=\"&T!$C$4,Bogføring!$B:$B,\"<=\"&T!$C$5,Bogføring!$G:$G,A51)","v":0}]
[2200,"Kontingenter overført til KVB",{"$f":"SUMIFS(Bogføring!$H:$H,Bogføring!$B:$B,\">=\"&T!$C$4,Bogføring!$B:$B,\"<=\"&T!$C$5,Bogføring!$G:$G,A52)-SUMIFS(Bogføring!$I:$I,Bogføring!$B:$B,\">=\"&T!$C$4,Bogføring!$B:$B,\"<=\"&T!$C$5,Bogføring!$G:$G,A52)","v":0}]
[3100,"Lønomkostninger",{"$f":"SUMIFS(Bogføring!$H:$H,Bogføring!$B:$B,\">=\"&T!$C$4,Bogføring!$B:$B,\"<=\"&T!$C$5,Bogføring!$G:$G,A53)-SUMIFS(Bogføring!$I:$I,Bogføring!$B:$B,\">=\"&T!$C$4,Bogføring!$B:$B,\"<=\"&T!$C$5,Bogføring!$G:$G,A53)","v":0}]
[3110,"Løn inkl. feriepenge",{"$f":"SUMIFS(Bogføring!$H:$H,Bogføring!$B:$B,\">=\"&T!$C$4,Bogføring!$B:$B,\"<=\"&T!$C$5,Bogføring!$G:$G,A54)-SUMIFS(Bogføring!$I:$I,Bogføring!$B:$B,\">=\"&T!$C$4,Bogføring!$B:$B,\"<=\"&T!$C$5,Bogføring!$G:$G,A54)","v":40800}]
[3120,"ATP",{"$f":"SUMIFS(Bogføring!$H:$H,Bogføring!$B:$B,\">=\"&T!$C$4,Bogføring!$B:$B,\"<=\"&T!$C$5,Bogføring!$G:$G,A55)-SUMIFS(Bogføring!$I:$I,Bogføring!$B:$B,\">=\"&T!$C$4,Bogføring!$B:$B,\"<=\"&T!$C$5,Bogføring!$G:$G,A55)","v":820.3}]
[3130,"Am",{"$f":"SUMIFS(Bogføring!$H:$H,Bogføring!$B:$B,\">=\"&T!$C$4,Bogføring!$B:$B,\"<=\"&T!$C$5,Bogføring!$G:$G,A56)-SUMIFS(Bogføring!$I:$I,Bogføring!$B:$B,\">=\"&T!$C$4,Bogføring!$B:$B,\"<=\"&T!$C$5,Bogføring!$G:$G,A56)","v":3664}]
[3140,"Lønsum",{"$f":"SUMIFS(Bogføring!$H:$H,Bogføring!$B:$B,\">=\"&T!$C$4,Bogføring!$B:$B,\"<=\"&T!$C$5,Bogføring!$G:$G,A57)-SUMIFS(Bogføring!$I:$I,Bogføring!$B:$B,\">=\"&T!$C$4,Bogføring!$B:$B,\"<=\"&T!$C$5,Bogføring!$G:$G,A57)","v":0}]
[null,null,{"$f":"SUMIFS(Bogføring!$H:$H,Bogføring!$B:$B,\">=\"&T!$C$4,Bogføring!$B:$B,\"<=\"&T!$C$5,Bogføring!$G:$G,A58)-SUMIFS(Bogføring!$I:$I,Bogføring!$B:$B,\">=\"&T!$C$4,Bogføring!$B:$B,\"<=\"&T!$C$5,Bogføring!$G:$G,A58)","v":0}]
[null,null,{"$f":"SUMIFS(Bogføring!$H:$H,Bogføring!$B:$B,\">=\"&T!$C$4,Bogføring!$B:$B,\"<=\"&T!$C$5,Bogføring!$G:$G,A59)-SUMIFS(Bogføring!$I:$I,Bogføring!$B:$B,\">=\"&T!$C$4,Bogføring!$B:$B,\"<=\"&T!$C$5,Bogføring!$G:$G,A59)","v":0},null,null,null,{"$f":"SUM(C29:C57)","v":96893.05}]
[null,null,null,null,null,null,{"$f":"G28-G59","v":17971.409999999989}]
[12310,"Bank konto",{"$f":"SUMIFS(Bogføring!$H:$H,Bogføring!$B:$B,\">=\"&T!$C$4,Bogføring!$B:$B,\"<=\"&T!$C$5,Bogføring!$G:$G,A61)-SUMIFS(Bogføring!$I:$I,Bogføring!$B:$B,\">=\"&T!$C$4,Bogføring!$B:$B,\"<=\"&T!$C$5,Bogføring!$G:$G,A61)","v":21291.5}]
[12320,"Kasse",{"$f":"SUMIFS(Bogføring!$H:$H,Bogføring!$B:$B,\">=\"&T!$C$4,Bogføring!$B:$B,\"<=\"&T!$C$5,Bogføring!$G:$G,A62)-SUMIFS(Bogføring!$I:$I,Bogføring!$B:$B,\">=\"&T!$C$4,Bogføring!$B:$B,\"<=\"&T!$C$5,Bogføring!$G:$G,A62)","v":4736}]
[12330,"Egenkapital",{"$f":"SUMIFS(Bogføring!$I:$I,Bogføring!$B:$B,\">=\"&T!$C$4,Bogføring!$B:$B,\"<=\"&T!$C$5,Bogføring!$G:$G,A63)-SUMIFS(Bogføring!$H:$H,Bogføring!$B:$B,\">=\"&T!$C$4,Bogføring!$B:$B,\"<=\"&T!$C$5,Bogføring!$G:$G,A63)+G60","v":19981.249999999989}]
[null,null,{"$f":"SUMIFS(Bogføring!$I:$I,Bogføring!$B:$B,\">=\"&T!$C$4,Bogføring!$B:$B,\"<=\"&T!$C$5,Bogføring!$G:$G,A64)-SUMIFS(Bogføring!$H:$H,Bogføring!$B:$B,\">=\"&T!$C$4,Bogføring!$B:$B,\"<=\"&T!$C$5,Bogføring!$G:$G,A64)+F57","v":0}]
[12360,"Skyldig A-skat",{"$f":"SUMIFS(Bogføring!$I:$I,Bogføring!$B:$B,\">=\"&T!$C$4,Bogføring!$B:$B,\"<=\"&T!$C$5,Bogføring!$G:$G,A65)-SUMIFS(Bogføring!$H:$H,Bogføring!$B:$B,\">=\"&T!$C$4,Bogføring!$B:$B,\"<=\"&T!$C$5,Bogføring!$G:$G,A65)+F58","v":4219}]
[12361,"Skyldig AM ",{"$f":"SUMIFS(Bogføring!$I:$I,Bogføring!$B:$B,\">=\"&T!$C$4,Bogføring!$B:$B,\"<=\"&T!$C$5,Bogføring!$G:$G,A66)-SUMIFS(Bogføring!$H:$H,Bogføring!$B:$B,\">=\"&T!$C$4,Bogføring!$B:$B,\"<=\"&T!$C$5,Bogføring!$G:$G,A66)+F59","v":797}]
[12362,"Skyldig ATP",{"$f":"SUMIFS(Bogføring!$I:$I,Bogføring!$B:$B,\">=\"&T!$C$4,Bogføring!$B:$B,\"<=\"&T!$C$5,Bogføring!$G:$G,A67)-SUMIFS(Bogføring!$H:$H,Bogføring!$B:$B,\">=\"&T!$C$4,Bogføring!$B:$B,\"<=\"&T!$C$5,Bogføring!$G:$G,A67)+F60","v":378.60000000000008}]
[12364,"Skyldige Feriepenge",{"$f":"SUMIFS(Bogføring!$I:$I,Bogføring!$B:$B,\">=\"&T!$C$4,Bogføring!$B:$B,\"<=\"&T!$C$5,Bogføring!$G:$G,A68)-SUMIFS(Bogføring!$H:$H,Bogføring!$B:$B,\">=\"&T!$C$4,Bogføring!$B:$B,\"<=\"&T!$C$5,Bogføring!$G:$G,A68)+F61","v":800}]
[]
[]
[12370,"Forudbetalt kontingent",{"$f":"SUMIFS(Bogføring!$I:$I,Bogføring!$B:$B,\">=\"&T!$C$4,Bogføring!$B:$B,\"<=\"&T!$C$5,Bogføring!$G:$G,A71)-SUMIFS(Bogføring!$H:$H,Bogføring!$B:$B,\">=\"&T!$C$4,Bogføring!$B:$B,\"<=\"&T!$C$5,Bogføring!$G:$G,A71)+F62","v":0}]
[12380,"Banklån",{"$f":"SUMIFS(Bogføring!$I:$I,Bogføring!$B:$B,\">=\"&T!$C$4,Bogføring!$B:$B,\"<=\"&T!$C$5,Bogføring!$G:$G,A72)-SUMIFS(Bogføring!$H:$H,Bogføring!$B:$B,\">=\"&T!$C$4,Bogføring!$B:$B,\"<=\"&T!$C$5,Bogføring!$G:$G,A72)+F62","v":0}]
[12390,"Andre Lån",{"$f":"SUMIFS(Bogføring!$I:$I,Bogføring!$B:$B,\">=\"&T!$C$4,Bogføring!$B:$B,\"<=\"&T!$C$5,Bogføring!$G:$G,A73)-SUMIFS(Bogføring!$H:$H,Bogføring!$B:$B,\">=\"&T!$C$4,Bogføring!$B:$B,\"<=\"&T!$C$5,Bogføring!$G:$G,A73)+F63","v":0}]
[12400,"Kreditorer samler konto",{"$f":"SUM(C71:C73)","v":0},null,12370,12390]
[null,null,{"$f":"SUM(C66:C74)","v":1975.6000000000001}]
[12410,"Tilgodehavende Kontingenter",{"$f":"SUMIFS(Bogføring!$I:$I,Bogføring!$B:$B,\">=\"&T!$C$4,Bogføring!$B:$B,\"<=\"&T!$C$5,Bogføring!$G:$G,A76)-SUMIFS(Bogføring!$H:$H,Bogføring!$B:$B,\">=\"&T!$C$4,Bogføring!$B:$B,\"<=\"&T!$C$5,Bogføring!$G:$G,A76)+F72","v":0}]
[12420,"Lån til Forsvarsmuseumet",{"$f":"SUMIFS(Bogføring!$H:$H,Bogføring!$B:$B,\">=\"&T!$C$4,Bogføring!$B:$B,\"<=\"&T!$C$5,Bogføring!$G:$G,A77)-SUMIFS(Bogføring!$I:$I,Bogføring!$B:$B,\">=\"&T!$C$4,Bogføring!$B:$B,\"<=\"&T!$C$5,Bogføring!$G:$G,A77)+F73","v":0}]
[12500,"Debitorer samler konto",{"$f":"SUM(C76:C77)","v":0},null,12410,12420]

{"sheet":"Udgiftsbilag","index":6,"n_rows":24,"n_cols":9,"rows_kept":24,"cut":false,"hidden":true,"merged":[[8,6,9,9],[1,2,1,4],[2,2,2,4],[6,1,6,2],[6,8,6,9],[10,6,11,7],[10,8,11,9],[12,2,12,3],[12,6,14,7],[12,8,14,9],[14,2,14,3]]}
[]
[]
[null,null,"Bornholms Forsvarsmuseum"]
[]
[]
[]
[null,"Udgifts bilag.",null,null,null,null,"Bilags nr.:"]
[]
[null,null,null,null,null,null,"Kontering"]
[]
[null,null,null,null,null,null,"D",null,"K"]
[]
[null,"Dato:"]
[]
[null,"Beløb:"]
[]
[null,"Formål:"]
[]
[]
[]
[]
[null,"Betalt til : "]
[]
[null,"Underskrift:"]

{"sheet":"T","index":7,"n_rows":34,"n_cols":20,"rows_kept":34,"cut":false,"hidden":false,"merged":[[5,14,5,15],[10,7,10,9],[5,18,5,19],[8,1,8,4],[8,7,8,9],[5,16,5,17],[6,7,6,9],[10,1,10,4],[5,10,5,11],[12,1,12,4],[6,2,6,4],[19,0,19,6],[3,7,3,9],[5,12,5,13],[12,8,12,9],[28,0,28,4],[29,0,29,5],[25,0,25,4],[14,1,14,4],[22,0,22,6],[16,1,16,4]]}
[]
["Regnskabs år ",{"$f":"C2+1","v":2023},2022,{"$f":"C2-1","v":2021},{"$f":"C2-2","v":2020},{"$f":"D2-2","v":2019},null,"cellen C2","her indtastes det indeværende regnskabs år"]
[null,{"$f":"IF(YEAR(B4)<>YEAR(B5),YEAR(B4)&\"-\"&YEAR(B5),YEAR(B4))","v":2023},{"$f":"IF(YEAR(C4)<>YEAR(C5),YEAR(C4)&\"-\"&YEAR(C5),YEAR(C4))","v":2022},{"$f":"IF(YEAR(D4)<>YEAR(D5),YEAR(D4)&\"-\"&YEAR(D5),YEAR(D4))","v":2021},{"$f":"IF(YEAR(E4)<>YEAR(E5),YEAR(E4)&\"-\"&YEAR(E5),YEAR(E4))","v":2020},{"$f":"IF(YEAR(F4)<>YEAR(F5),YEAR(F4)&\"-\"&YEAR(F5),YEAR(F4))","v":2019}]
["Regnskabsårets start ",{"$f":"DATE(B2-I5,$L$5,$K$5)","v":"2023-01-01"},{"$f":"DATE(C2-I5,$L$5,$K$5)","v":"2022-01-01"},{"$f":"DATE(D2-I5,$L$5,$K$5)","v":"2021-01-01"},{"$f":"DATE(E2-I5,$L$5,$K$5)","v":"2020-01-01"},{"$f":"DATE(F2-I5,$L$5,$K$5)","v":"2019-01-01"},null,"Regnskabs året starter :",null,null,"dag","måned"]
["Regnskabs årets slut",{"$f":"N7","v":"2023-12-31"},{"$f":"L7","v":"2022-12-31"},{"$f":"P7","v":"2021-12-31"},{"$f":"R7","v":"2020-12-31"},{"$f":"T7","v":"2019-12-31"},null,null,0,null,1,1]
[null,null,null,null,null,null,null,null,null,null,"Aktuelt år",null,"Budget år",null,"realiseret år",null,"realiseret år",null,"realiseret år"]
[{"$f":"\"Periode : \"&TEXT(C4,\"dd-mm-åååå\")&\" - \"&TEXT(IF(TODAY()>C5,C5,TODAY()),\"dd-mm-åååå\")","v":"Periode : 01-01-2022 - 15-05-2022"},null,"version 1.00.009.047",null,null,null,null,"Regnskabs året slutter :",null,null,{"$f":"C4-1","v":"2021-12-31"},{"$f":"DATE(YEAR(K7)+1,MONTH(K7),DAY(K7))","v":"2022-12-31"},{"$f":"B4-1","v":"2022-12-31"},{"$f":"DATE(YEAR(M7)+1,MONTH(M7),DAY(M7))","v":"2023-12-31"},{"$f":"D4-1","v":"2020-12-31"},{"$f":"DATE(YEAR(O7)+1,MONTH(O7),DAY(O7))","v":"2021-12-31"},{"$f":"E4-1","v":"2019-12-31"},{"$f":"DATE(YEAR(Q7)+1,MONTH(Q7),DAY(Q7))","v":"2020-12-31"},{"$f":"F4-1","v":"2018-12-31"},{"$f":"DATE(YEAR(S7)+1,MONTH(S7),DAY(S7))","v":"2019-12-31"}]
[]
["Foreningens navn:","xxxxxxxxxxxxx",null,null,null,null,null,"Revisionspåtegning: (1-3)",null,null,1,"0= tomt felt"]
[]
["Kasserer :","Kasserer",null,null,null,null,null,"Næste medl. Nr. :",null,null,109]
[]
["Bilagskontollant :","xxxx xxxx",null,null,null,null,null,"SE-NR : ",88739817]
[]
["Bilagskontollant :","xxxxx xx"]
[]
["Mail til Revisor :","xxx"]
[]
["Revisionspåtegning: 1"]
["Regnskabet er d.d. revideret. Beholdningkonti er fundet til stede. Bogføringen er kontrollet. \nRevisionen gav anledning til flg. Bemærkning"]
[]
["Revisionspåtegning: 2"]
["Kalenderårsregnskabet med resultatopgørese og balance er gennemgået og afstemt af\ngeneralforsamlingsvante revisorer samt jf. foreningens lov/vedtægt\nmed bogføringsbekendtgørelsen som vejledning.\nFra statustidspunktet og til revisionsdatoen er der ikke kendskab til forhold, som vil kunne forrykke\nvurderingen af regnskabet, som giver et retvisende billede.\n\n"]
[]
["Revisionspåtegning: 3"]
["Årsregnskabet med bilag, resultat, balance og udtog er gennemgået og afstemt af\nde valgte revisorer.\nGennemgangen har ikke givet anledning til bemærkninger."]
[]
["Bemærkninger:"]
["Regnskabet er det 6. i Bornholmske Dragoner, og på baggrund af 74 betalende medlemmer.\nDer er 14 restancer."]
[]
[]
[]
[]
[2021]

{"sheet":"Regnskab GF2","index":8,"n_rows":31,"n_cols":7,"rows_kept":31,"cut":false,"hidden":true,"merged":[[1,1,1,7],[20,1,20,6],[35,1,35,7]]}
[]
[null,"REGNSKAB FOR 3. ORDINÆRE GENERALFORSAMLING 13.01.18. "]
[]
[null,null,"Antal",null,"Indtægt","Udgift","Resultat"]
[null,"Kuv. Gule ærter/Stroganof",null,150]
[null,"øl",null,10]
[null,"Kaffe, småkager"]
[null,"12 Morgenmad inkl. bestyrelse"]
[null,"Værelser (10 enheder)",null,75]
[null,"Duge, servietter m.m."]
[null,"Salg af øl",null,20]
[null,"Salg af snaps",null,20]
[null,"Salg af vand",null,10]
[null,"Salg af mærker",null,50]
[null,null,null,null,null,0]
[null,null,null,null,null,0]
[null,null,null,null,null,0]
[null,"Gave til ",null,null,null,0]
[null,"I alt",null,null,{"$f":"SUM(E5:E18)","v":0},{"$f":"SUM(F5:F18)","v":0},{"$f":"E19-F19","v":0}]
[]
[null,"Salget på denne generalforsamling har vist sig at passe perfekt - det stemmer på øren - og det er dejligt. Ved optælling af beholdning af øl og snaps, er der 30 øl og lidt snaps, til næste arrangement."]
[]
[]
[null,null,null,null,"Indtægt","Udgift","TOTAL"]
[null,"Kontant fra festen indsat i bank"]
[]
[null,"Salg af 11 klister/stofmærker"]
[null,"Salg af 79 øl og 27 snaps = 106"]
[null,"Salg af 8 vand"]
[null,"I alt"]
[null,"Overskud",null,null,null,null,{"$f":"G25-G30","v":0}]

{"sheet":"vejlend.","index":9,"n_rows":46,"n_cols":5,"rows_kept":46,"cut":false,"hidden":true,"merged":[]}
["HUSK:"]
["Ved årsskifte / regnskabsårsafslutning."]
[]
["PRINT:","DETTE ÅR:"]
[null,"Bogføring hele året"]
[null,"Kontoplan"]
[null,"Regnskab"]
[null,"1. Kontoudtog fra banken hele året (fra 1/1 til 31/12)"]
[null,"2. Kontoudtog fra banken hele året (fra 1/1 til 31/12)"]
[]
["PRINT:","NYT ÅR:"]
[null,"Bogføring for nyt år"]
[null,"Kontoplan"]
[null,"1. Kontoudtog fra banken nyt år (fra 1/1 -  ….)"]
[null,"2. Kontoudtog fra banken nyt år (fra 1/1 -  ….)"]
[]
["Mail til REVISOR:","Sende mail med vedhæftet:"]
[null,"Bogføring dette år"]
[null,"Bogføring nyt år"]
[null,"Tid for besøg med bilag"]
[null,"Evt.  -  bemærkninger til året"]
[]
["Til REVISOR:","Alle bilag"]
[null,"Alle udtog"]
[null,"Alle kontoudtog / bankkontoudtog"]
[null,"Alle opgørelser"]
[null,"Evt. køb/salg"]
[null,"evt. +???"]
[]
[]
["ÅRSSKIFTE","Ændre til nyt år på ÅR p.t."]
[null,"BEMÆRK:"]
[null,"år 1 = budget / næste år",null,null,"rettes efter aktuelt år"]
["nyt år","år 2 = aktuelt år / dette år",null,null,"KUN aktuelt år indtastes"]
[null,"år 3 = sidste år realiseret",null,null,"rettes efter aktuelt år"]
[null,"år 4 = forrige år realiseret",null,null,"rettes efter aktuelt år"]
[]
["nyt år","Rette ARK Bogføring: B55 til ny dato"]
[null,"(rette ARK Bogføring: B45 til ny dato)"]
[]
["BUDGET:","indtastes i Bogføring med næste års dato"]
[null,"(evt. i hovedtal) - nyt regnskabsår + 1 år.."]
[]
[]
["NB.","Afslutningsposter i tilhørende år (31/12 / ultimo)"]
[null,"Åbningsposter fra tilhørende år (1/1 / primo)"]

{"sheet":"Udmeldelser","index":10,"n_rows":11,"n_cols":9,"rows_kept":11,"cut":false,"hidden":true,"merged":[]}
["Medl.nr. :","NAVN","ADRESSE ","POSTNR","By","TELEFON","E-MAIL","Udmeldt ","Bemærkning:"]
[1,"Finn Bræstrup Karlsen","Vimmelskaftet 14",3700,"Rønne",null,"fjkarlsen@gmail.com"]
[2,"Lone Kure","Harbovej 40A",3700,"Rønne",null,"lonekure2014@gmail.com"]
[3,"Ole og Olga Drobova Andersen","Vesterbro 10",3720,"Åkirkeby",null,"ole_andersen@hotmail.com"]
[4,"Ole Koefoed Marker","Piberegård, Bodernevej 17",3720,"Åkirkeby",null,null,null,"DØD-oplyst 13.09.19."]
[5,"Birgit Andersen","Mulebyvej 2",3700,"Rønne",null,"birgitkure@gmail.com"]
[6,"Birthe Juel-Jensen","Egeløkken 3",3700,"Rønne",56961052,null,null,"Død - jan 2020"]
[7,"Sven Munch og Pyllis Holm","Morbærstien 5",3700,"Rønne",null,null,null,"Død - feb 2020"]
[29,"Nina Vibe","Charlottevej 7, Muleby",3700,"Rønne",null,"ninavibe@live.dk","2020-04-07"]
[133,"Jonna Jensen","Spodsbjergvej 127",5900,"Rudkøbing",20311031,"GIRO",2019]
[1007,"MALERFIRMAET Borg Aps","Åkirkebyvej 66",3700,"Rønne",null," info@malerborg.dk"]

{"sheet":"Om","index":11,"n_rows":71,"n_cols":3,"rows_kept":71,"cut":false,"hidden":true,"merged":[]}
[null,"Dette regneark er lavet efter en ide fra Excelgaard.dk"]
[null,"Revideret af Bjarne Hansen "]
[]
[null,"Besøg excelgaard.dk"]
[]
[null,"START med DATAår + kontoplan"]
[null,"Jeg vil gerne knytte en kommentar til det regneark, som Bjarne H. har lagt op..."]
[]
[null,"Fra: EXCELGAARD:  19/4-2018:"]
[null,"1. Bemærk, at man skal kende til, og benytte det dobbelt bogføringssystem, med debit og kredit posteringer."]
[null,"2. En \"fed\" ting ved systemet, er, at man kan benytte bogføringen løbende år efter år, og i princippet aldrig behøver opstarte et nyt bogføringsark, selvom man starter et nyt regnskabsår - ja, faktisk er det meningen, at man blot skal forsætte, og så på 'Regnskab' arket, skal man benytter '=SUM.HVISSER()' til både, at afgrænse på konto og datoer (regnskabsår)."]
[null,"(Bjarne er netop opstartet på regnearket, og afgrænser, lige nu, blot på konto, men, når der skiftes regnskabsår, skal formlerne lige udvides til datoer også"]
[null,"3. Er man rigtigt snu, så laver man et felt til indtastning af regnskabsår på ARK: \"ÅR p.t.\", og dermed kan man altid hente et bestemt regnskabsår, med sammenligningsregnskab, selvom årene går."]
[null,"4. Man kan let udvide bogføringsarket til også, at indeholde dimensioner - hvis man f.eks. tilføjer en kolonne, der hedder 'Faktua', kan man altid indtast både egne og leverandørers faktura nummer, og fremover hurtigt finde dem, ved hjælp af filteret."]
[null,"5. Og, det er jo kun fantasien, der bestemmer, hvilke dimensioner man ønsker på posteringerne, f.eks. 'Køretøj', 'Medarbejder', 'Afdeling', 'Formål', 'Bærer', 'Kunde', 'Medlem', 'Leverandør', o.s.v.."]
[]
[null,"Kilde:"]
[null,"Udarbejdet af: Excelgaard 2016"]
[null,"Tilrettet af: Bjarne Hansen 2018"]
[null,"+ønsker m.m. fra: InfoTAL / H.C. 04/2018 (via DRF)"]
[]
[null,"Dette program er velegnet til "]
[null,"mindre regnskaber for foreninger o.l."]
[]
[null,"Skal der være konti med moms, så se evt. på: www.dinero.dk"]
[null,"(u/beregning u/revisionsmodul - ellers gebyr pr. md.)"]
[]
[null,"BOGFØRING: - (vejledning) - ARK: Bogføring"]
[null,"ART:                Debet                    Kredit"]
[null,"drift                 udgift                     indtægt"]
[null,"status              ejer                        skylder"]
[]
[null,"egenkapital     negativ                   positiv"]
[null,"resultat           positiv                    negativ"]
[]
[]
[]
["ÅRSSKIFTE","Ændre til nyt år på ÅR p.t."]
[null,"BEMÆRK:"]
[null,"år 1 = budget / næste år","rettes efter aktuelt år"]
[null,"år 2 = aktuelt år / dette år","KUN aktuelt år indtastes"]
[null,"år 3 = sidste år realiseret","rettes efter aktuelt år"]
[null,"år 4 = forrige år realiseret","rettes efter aktuelt år"]
[]
["BUDGET:","indtastes i Bogføring med næste års dato"]
[null,"(evt. i hovedtal)"]
[]
[]
["NB.","Afslutningsposter i tilhørende år (31/12 / ultimo)"]
[null,"Åbningsposter fra tilhørende år (1/1 / primo)"]
[]
[]
["(daglig)","ARK: Bogføring= posteriger e/bilag o.l. (kasse) m/saldokontrol"]
[null,"ARK: vejledn.= vejledning"]
["(opstart)","ARK: Kontoplan= opret/oprettede konti"]
[null,"ARK: Regnskab= de bogførte bilag/poster på konti"]
["(årligt)","ARK: ÅR p.t.= til oprettelse af aktuelt regnskabsår"]
[null,"ARK: Om= beskrivelse af funktioner"]
[null,"ARK: Afv %= er BUDGET + aktuelt år og de sidste 2 år - med sammenligning/afvigelse"]
[null,"            (Budget oprettes i Bogføring - se vejledning)"]
[null,"FORMLER:  MÅ IKKE ÆNDRES - så virker regnearket ikke.."]
[]
[null,"Revisionspåtegning:"]
[null,"Tilrettes efter revisorernes eget valg  (kun forslag på ARK: Regnskab)"]
[]
[null,"KONTROL:"]
[null,"Bankkonti afstemmes løbende på ARK: Bogføring øverst efter E1 og E2 (saldo)"]
[]
[null,"LÅSTE CELLER:"]
[null,"Der er ikke låste celler - det kan frit oprettes e/ønske"]
[null,"Frys ruder kan udvides e/ønske"]

{"sheet":"Kontokort","index":12,"n_rows":44,"n_cols":12,"rows_kept":44,"cut":false,"hidden":false,"merged":[[43,0,43,1],[3,0,4,9],[0,0,1,1],[0,2,1,3],[0,8,0,9],[1,8,1,9],[2,8,2,9],[5,0,6,1],[5,2,6,7],[5,8,5,9],[7,0,8,0],[7,1,8,2],[7,3,8,7],[7,8,8,8],[7,9,8,9]]}
[]
[]
[]
["KONTOKORT"]
[]
["Kontonavn",null,{"$f":"VLOOKUP(J7,Kontoplan!A2:B94,2,0)","v":"Kasse"},null,null,null,null,null,"Konto nr."]
[null,null,null,null,null,null,null,null,null,12320]
["År",null,null,null,null,null,null,null,"Side"]
[]
["Dato",null,"Bilag nr.","Tekst","Medl nr","Årstal","Debet","Kredit","D/K","Saldo",null,"Sammenflettede celler er noget af det værste bras,"]
[{"$f":"_xlfn._xlws.FILTER(Bogføring!B6:B950,(Bogføring!G6:G950=Kontokort!J7)*(Bogføring!B6:B950>=T!C4)*(Bogføring!B6:B950<=T!C5),\"\")","v":"2022-01-01"},null,null,null,null,null,{"$f":"_xlfn._xlws.FILTER(Bogføring!H6:I950,(Bogføring!G6:G950=Kontokort!J7)*(Bogføring!B6:B950>=T!C4)*(Bogføring!B6:B950<=T!C5),\"\")","v":851},0,null,{"$f":"IF(A11,SUM(G$11:G11)-SUM(H$11:H11),\"\")","v":851},null,"hvilket filen her er et afskrækkende eksempel på."]
["2022-01-23",null,null,null,null,null,1425,0,null,{"$f":"IF(A12,SUM(G$11:G12)-SUM(H$11:H12),\"\")","v":2276},null,"Brug Center Across Selection i stedet for."]
["2022-05-04",null,null,null,null,null,605,0,null,{"$f":"IF(A13,SUM(G$11:G13)-SUM(H$11:H13),\"\")","v":2881},null,"(Format, Format Cells, Alignment, Center Across Selection)."]
["2022-05-05",null,null,null,null,null,1265,0,null,{"$f":"IF(A14,SUM(G$11:G14)-SUM(H$11:H14),\"\")","v":4146}]
["2022-05-06",null,null,null,null,null,530,0,null,{"$f":"IF(A15,SUM(G$11:G15)-SUM(H$11:H15),\"\")","v":4676}]
["2022-05-07",null,null,null,null,null,60,0,null,{"$f":"IF(A16,SUM(G$11:G16)-SUM(H$11:H16),\"\")","v":4736}]
[null,null,null,null,null,null,null,null,null,{"$f":"IF(A17,SUM(G$11:G17)-SUM(H$11:H17),\"\")","v":""}]
[null,null,null,null,null,null,null,null,null,{"$f":"IF(A18,SUM(G$11:G18)-SUM(H$11:H18),\"\")","v":""}]
[null,null,null,null,null,null,null,null,null,{"$f":"IF(A19,SUM(G$11:G19)-SUM(H$11:H19),\"\")","v":""}]
[null,null,null,null,null,null,null,null,null,{"$f":"IF(A20,SUM(G$11:G20)-SUM(H$11:H20),\"\")","v":""}]
[null,null,null,null,null,null,null,null,null,{"$f":"IF(A21,SUM(G$11:G21)-SUM(H$11:H21),\"\")","v":""}]
[null,null,null,null,null,null,null,null,null,{"$f":"IF(A22,SUM(G$11:G22)-SUM(H$11:H22),\"\")","v":""}]
[null,null,null,null,null,null,null,null,null,{"$f":"IF(A23,SUM(G$11:G23)-SUM(H$11:H23),\"\")","v":""}]
[null,null,null,null,null,null,null,null,null,{"$f":"IF(A24,SUM(G$11:G24)-SUM(H$11:H24),\"\")","v":""}]
[null,null,null,null,null,null,null,null,null,{"$f":"IF(A25,SUM(G$11:G25)-SUM(H$11:H25),\"\")","v":""}]
[null,null,null,null,null,null,null,null,null,{"$f":"IF(A26,SUM(G$11:G26)-SUM(H$11:H26),\"\")","v":""}]
[null,null,null,null,null,null,null,null,null,{"$f":"IF(A27,SUM(G$11:G27)-SUM(H$11:H27),\"\")","v":""}]
[null,null,null,null,null,null,null,null,null,{"$f":"IF(A28,SUM(G$11:G28)-SUM(H$11:H28),\"\")","v":""}]
[null,null,null,null,null,null,null,null,null,{"$f":"IF(A29,SUM(G$11:G29)-SUM(H$11:H29),\"\")","v":""}]
[null,null,null,null,null,null,null,null,null,{"$f":"IF(A30,SUM(G$11:G30)-SUM(H$11:H30),\"\")","v":""}]
[null,null,null,null,null,null,null,null,null,{"$f":"IF(A31,SUM(G$11:G31)-SUM(H$11:H31),\"\")","v":""}]
[null,null,null,null,null,null,null,null,null,{"$f":"IF(A32,SUM(G$11:G32)-SUM(H$11:H32),\"\")","v":""}]
[null,null,null,null,null,null,null,null,null,{"$f":"IF(A33,SUM(G$11:G33)-SUM(H$11:H33),\"\")","v":""}]
[null,null,null,null,null,null,null,null,null,{"$f":"IF(A34,SUM(G$11:G34)-SUM(H$11:H34),\"\")","v":""}]
[null,null,null,null,null,null,null,null,null,{"$f":"IF(A35,SUM(G$11:G35)-SUM(H$11:H35),\"\")","v":""}]
[null,null,null,null,null,null,null,null,null,{"$f":"IF(A36,SUM(G$11:G36)-SUM(H$11:H36),\"\")","v":""}]
[null,null,null,null,null,null,null,null,null,{"$f":"IF(A37,SUM(G$11:G37)-SUM(H$11:H37),\"\")","v":""}]
[null,null,null,null,null,null,null,null,null,{"$f":"IF(A38,SUM(G$11:G38)-SUM(H$11:H38),\"\")","v":""}]
[null,null,null,null,null,null,null,null,null,{"$f":"IF(A39,SUM(G$11:G39)-SUM(H$11:H39),\"\")","v":""}]
[null,null,null,null,null,null,null,null,null,{"$f":"IF(A40,SUM(G$11:G40)-SUM(H$11:H40),\"\")","v":""}]
[null,null,null,null,null,null,null,null,null,{"$f":"IF(A41,SUM(G$11:G41)-SUM(H$11:H41),\"\")","v":""}]
[null,null,null,null,null,null,null,null,null,{"$f":"IF(A42,SUM(G$11:G42)-SUM(H$11:H42),\"\")","v":""}]
[null,null,null,null,null,null,null,null,null,{"$f":"IF(A43,SUM(G$11:G43)-SUM(H$11:H43),\"\")","v":""}]
[null,null,null,null,null,null,null,null,null,{"$f":"IF(A44,SUM(G$11:G44)-SUM(H$11:H44),\"\")","v":""}]

{"sheet":"T2","index":13,"n_rows":43,"n_cols":23,"rows_kept":43,"cut":false,"hidden":false,"merged":[[12,10,12,13],[5,18,5,19],[3,7,3,9],[5,10,5,11],[5,12,5,13],[5,14,5,15],[5,16,5,17],[22,1,22,4],[6,2,6,4],[6,7,6,9],[8,1,8,4],[8,7,8,9],[10,1,10,4],[10,7,10,9],[12,1,12,4],[14,1,14,4],[16,1,16,4],[18,1,18,4],[20,1,20,4],[12,7,12,9],[39,0,39,4],[42,0,42,4],[43,0,43,5],[24,1,24,4],[26,1,26,4],[28,1,28,4],[30,1,30,4],[33,0,33,4],[36,0,36,4]]}
[null,null,null,null,null,null,null,null,null,null,null,null,null,null,null,null,null,null,null,null,null,null,"Formand/Sekretær"]
["Regnskabs år ",{"$f":"C2+1","v":2023},2022,{"$f":"C2-1","v":2021},{"$f":"C2-2","v":2020},{"$f":"D2-2","v":2019},null,"cellen C2","her indtastes det indeværende regnskabs år",null,null,null,null,null,null,null,null,null,null,null,null,null,"Næstformand"]
[null,{"$f":"IF(YEAR(B4)<>YEAR(B5),YEAR(B4)&\"-\"&YEAR(B5),YEAR(B4))","v":2023},{"$f":"IF(YEAR(C4)<>YEAR(C5),YEAR(C4)&\"-\"&YEAR(C5),YEAR(C4))","v":2022},{"$f":"IF(YEAR(D4)<>YEAR(D5),YEAR(D4)&\"-\"&YEAR(D5),YEAR(D4))","v":2021},{"$f":"IF(YEAR(E4)<>YEAR(E5),YEAR(E4)&\"-\"&YEAR(E5),YEAR(E4))","v":2020},{"$f":"IF(YEAR(F4)<>YEAR(F5),YEAR(F4)&\"-\"&YEAR(F5),YEAR(F4))","v":2019},null,null,null,null,null,null,null,null,null,null,null,null,null,null,null,null,"Web ansvarlig"]
["Regnskabsårets start ",{"$f":"DATE(B2-I5,$L$5,$K$5)","v":"2023-01-01"},{"$f":"DATE(C2-I5,$L$5,$K$5)","v":"2022-01-01"},{"$f":"DATE(D2-I5,$L$5,$K$5)","v":"2021-01-01"},{"$f":"DATE(E2-I5,$L$5,$K$5)","v":"2020-01-01"},{"$f":"DATE(F2-I5,$L$5,$K$5)","v":"2019-01-01"},null,"Regnskabs året starter :",null,null,"dag","måned",null,null,null,null,null,null,null,null,null,null,"Forbindelsesp. til AK"]
["Regnskabs årets slut",{"$f":"N7","v":"2023-12-31"},{"$f":"L7","v":"2022-12-31"},{"$f":"P7","v":"2021-12-31"},{"$f":"R7","v":"2020-12-31"},{"$f":"T7","v":"2019-12-31"},null,null,0,null,1,1,null,null,null,null,null,null,null,null,null,null,"Ad hoc"]
[null,null,null,null,null,null,null,null,null,null,"Aktuelt år",null,"Budget år",null,"realiseret år",null,"realiseret år",null,"realiseret år",null,null,null,"Suppleant"]
[{"$f":"\"Periode : \"&TEXT(C4, \"dd-mm-åååå\")& \" - \"&TEXT(C5,\"dd-mm-åååå\")","v":"Periode : 01-01-2022 - 31-12-2022"},null,"version 2020.00.02.00",null,null,null,null,"Regnskabs året slutter :",null,null,{"$f":"C4-1","v":"2021-12-31"},{"$f":"DATE(YEAR(K7)+1,MONTH(K7),DAY(K7))","v":"2022-12-31"},{"$f":"B4-1","v":"2022-12-31"},{"$f":"DATE(YEAR(M7)+1,MONTH(M7),DAY(M7))","v":"2023-12-31"},{"$f":"D4-1","v":"2020-12-31"},{"$f":"DATE(YEAR(O7)+1,MONTH(O7),DAY(O7))","v":"2021-12-31"},{"$f":"E4-1","v":"2019-12-31"},{"$f":"DATE(YEAR(Q7)+1,MONTH(Q7),DAY(Q7))","v":"2020-12-31"},{"$f":"F4-1","v":"2018-12-31"},{"$f":"DATE(YEAR(S7)+1,MONTH(S7),DAY(S7))","v":"2019-12-31"},null,null,"Bilagskontrollant"]
[null,null,null,null,null,null,null,null,null,null,null,null,null,null,null,null,null,null,null,null,null,null,"Kasserer"]
["Foreningens navn:","TEST regnskab",null,null,null,null,null,"Revisionspåtegning: (1-3)",null,null,1,"0= tomt felt"]
[]
["Foreningens adresse : ","xxxxxxxxx",null,null,null,null,null,"Næste medl. Nr. :",null,null,147]
[]
["Foreningens Postnr & By : ","xxxxxxxxxx",null,null,null,null,null,"Kommune : ",null,null,"Bornholms Regionskommune"]
[]
["Formand : ","Formand"]
[]
["Kasserer :","Kassere"]
[]
["Bestyrelses medlem  : ","Bestyrelses medlem 1"]
[]
["Bestyrelses medlem  : ","Bestyrelses medlem 2"]
[]
["Bestyrelses medlem  : ","Bestyrelses medlem 3"]
[]
["Foreningens CVR-nr.  : ","xxxxxxxxx"]
[]
["Resiosor : ","xxxxxxxxx"]
[]
["Bilagskontollant :","xxxxxxxx"]
[]
["Mail til Revisor :","xxx"]
[]
["Revisionspåtegning: 1"]
["Regnskabet er d.d. revideret. Beholdningkonti er fundet til stede. Bogføringen er kontrollet. \nRevisionen gav anledning til flg. Bemærkning"]
[]
["Revisionspåtegning: 2"]
["Kalenderårsregnskabet med resultatopgørese og balance er gennemgået og afstemt af\ngeneralforsamlingsvante revisorer samt jf. foreningens lov/vedtægt\nmed bogføringsbekendtgørelsen som vejledning.\nFra statustidspunktet og til revisionsdatoen er der ikke kendskab til forhold, som vil kunne forrykke\nvurderingen af regnskabet, som giver et retvisende billede.\n\n"]
[]
["Revisionspåtegning: 3"]
["Årsregnskabet med bilag, resultat, balance og udtog er gennemgået og afstemt af\nde valgte revisorer.\nGennemgangen har ikke givet anledning til bemærkninger."]
[]
["Bemærkninger:"]
["Regnskabet er d.d. revideret. Beholdningkonti er fundet til stede. Bogføringen er kontrollet. \nRevisionen gav anledning til flg. Bemærkning"]

{"sheet":"Restanceliste","index":14,"n_rows":7,"n_cols":5,"rows_kept":7,"cut":false,"hidden":true,"merged":[[5,1,5,6],[4,0,4,6]]}
[]
[]
[]
[]
["der laves en funktion der danner restancelisten ved tryk på en knap\nhvis der findes en liste kommer der en msgbox om man ønsker at overskrive den"]
[null,"Hentes fra medlemslisten udfra A kolonnen med lopslag"]
["Medlems nr.:","Navn","Adresse","postnr","by"]