{"text_format":"1","workbook":"xlsx","n_sheets":15,"sheets":["Bogføring","Kontoplan","Regnskab GF","Medlemsliste","Afv %","Kontoplan (2)","Udgiftsbilag","T","Regnskab GF2","vejlend.","Udmeldelser","Om","Kontokort","T2","Restanceliste"],"not_rendered":{"charts":0,"images":7,"macros":1,"external_links":1,"defined_names":10,"comments":0,"pivot_tables":0},"unopened":[],"bounds":{"document_bytes":16777216,"sheet_cells":100000,"rows_first":2000,"rows_last":500,"rows_between":2000,"halvings":0,"cell_chars":16384,"cell_head_chars":4096},"cells_cut":0,"cells_raw":0,"read":"whole","date_system":"1900"}

{"sheet":"Bogføring","index":0,"n_rows":2624,"n_cols":10,"rows_kept":2624,"cut":false,"hidden":false,"merged":[]}
[]
[]
[null,12310,"Bankbeholdning",{"$f":"SUMIFS(Bogføring!$G:$G,Bogføring!$A:$A,\">=\"&T!$C$4,Bogføring!$A:$A,\"<=\"&T!$C$5,Bogføring!$F:$F,B3)-SUMIFS(Bogføring!$H:$H,Bogføring!$A:$A,\">=\"&T!$C$4,Bogføring!$A:$A,\"<=\"&T!$C$5,Bogføring!$F:$F,B3)","v":21291.5}]
[null,12320,"Kassebeholdning",{"$f":"SUMIFS(Bogføring!$G:$G,Bogføring!$A:$A,\">=\"&T!$C$4,Bogføring!$A:$A,\"<=\"&T!$C$5,Bogføring!$F:$F,B4)-SUMIFS(Bogføring!$H:$H,Bogføring!$A:$A,\">=\"&T!$C$4,Bogføring!$A:$A,\"<=\"&T!$C$5,Bogføring!$F:$F,B4)","v":4736},null,null,null,null,null,{"$f":"T!C7&\" / Bjarne Hansen\"","v":"version 1.00.009.047 / Bjarne Hansen"}]
["Dato","Bilag","Tekst","Medl. Nr.","Årstal","Konto","Debet","Kredit","Kontobeskrivelse","Kommentarer"]
["2021-01-01",null,"Åbningsbalance, Overført Saldi",null,null,12310,63030.82,null,{"$f":"IF(F6=\"\",\"\",IF(ISERROR(VLOOKUP(F6,Kontoplan!A:D,2,0)),\"Konto findes ikke!\",VLOOKUP(F6,Kontoplan!A:D,2,0)))","v":"Bank konto"}]
["2021-01-01",null,"Åbningsbalance, Overført Saldi",null,null,12320,2118,null,{"$f":"IF(F7=\"\",\"\",IF(ISERROR(VLOOKUP(F7,Kontoplan!A:D,2,0)),\"Konto findes ikke!\",VLOOKUP(F7,Kontoplan!A:D,2,0)))","v":"Kasse"}]
["2021-01-01",null,"Åbningsbalance, Overført Saldi",null,null,12330,null,65148.82,{"$f":"IF(F8=\"\",\"\",IF(ISERROR(VLOOKUP(F8,Kontoplan!A:D,2,0)),\"Konto findes ikke!\",VLOOKUP(F8,Kontoplan!A:D,2,0)))","v":"Egenkapital"}]
["2021-01-04",1,null,null,null,12310,null,377.75,{"$f":"IF(F9=\"\",\"\",IF(ISERROR(VLOOKUP(F9,Kontoplan!A:D,2,0)),\"Konto findes ikke!\",VLOOKUP(F9,Kontoplan!A:D,2,0)))","v":"Bank konto"}]
["2021-01-04",1,null,null,null,2060,377.75,null,{"$f":"IF(F10=\"\",\"\",IF(ISERROR(VLOOKUP(F10,Kontoplan!A:D,2,0)),\"Konto findes ikke!\",VLOOKUP(F10,Kontoplan!A:D,2,0)))","v":"Internet, mobiltelefon, Forsik."}]
["2021-01-04",2,null,null,null,12310,null,165.23,{"$f":"IF(F11=\"\",\"\",IF(ISERROR(VLOOKUP(F11,Kontoplan!A:D,2,0)),\"Konto findes ikke!\",VLOOKUP(F11,Kontoplan!A:D,2,0)))","v":"Bank konto"}]
["2021-01-04",2,null,null,null,2000,165.23,null,{"$f":"IF(F12=\"\",\"\",IF(ISERROR(VLOOKUP(F12,Kontoplan!A:D,2,0)),\"Konto findes ikke!\",VLOOKUP(F12,Kontoplan!A:D,2,0)))","v":"Bankgebyr"}]
["2021-01-05",3,null,null,null,12310,72498,null,{"$f":"IF(F13=\"\",\"\",IF(ISERROR(VLOOKUP(F13,Kontoplan!A:D,2,0)),\"Konto findes ikke!\",VLOOKUP(F13,Kontoplan!A:D,2,0)))","v":"Bank konto"}]
["2021-01-05",3,null,null,null,1020,null,72498,{"$f":"IF(F14=\"\",\"\",IF(ISERROR(VLOOKUP(F14,Kontoplan!A:D,2,0)),\"Konto findes ikke!\",VLOOKUP(F14,Kontoplan!A:D,2,0)))","v":"Tilskud fra BRK/ drifttilskud"}]
["2021-01-05",4,null,null,null,12310,null,2256.25,{"$f":"IF(F15=\"\",\"\",IF(ISERROR(VLOOKUP(F15,Kontoplan!A:D,2,0)),\"Konto findes ikke!\",VLOOKUP(F15,Kontoplan!A:D,2,0)))","v":"Bank konto"}]
["2021-01-05",4,null,null,null,2030,2256.25,null,{"$f":"IF(F16=\"\",\"\",IF(ISERROR(VLOOKUP(F16,Kontoplan!A:D,2,0)),\"Konto findes ikke!\",VLOOKUP(F16,Kontoplan!A:D,2,0)))","v":"Bygnings vedligehold"}]
["2021-01-05",5,null,null,null,12310,null,1205,{"$f":"IF(F17=\"\",\"\",IF(ISERROR(VLOOKUP(F17,Kontoplan!A:D,2,0)),\"Konto findes ikke!\",VLOOKUP(F17,Kontoplan!A:D,2,0)))","v":"Bank konto"}]
["2021-01-05",5,null,null,null,2030,1205,null,{"$f":"IF(F18=\"\",\"\",IF(ISERROR(VLOOKUP(F18,Kontoplan!A:D,2,0)),\"Konto findes ikke!\",VLOOKUP(F18,Kontoplan!A:D,2,0)))","v":"Bygnings vedligehold"}]
["2021-01-08",6,null,null,null,12310,null,943.31,{"$f":"IF(F19=\"\",\"\",IF(ISERROR(VLOOKUP(F19,Kontoplan!A:D,2,0)),\"Konto findes ikke!\",VLOOKUP(F19,Kontoplan!A:D,2,0)))","v":"Bank konto"}]
["2021-01-08",6,null,null,null,2165,943.31,null,{"$f":"IF(F20=\"\",\"\",IF(ISERROR(VLOOKUP(F20,Kontoplan!A:D,2,0)),\"Konto findes ikke!\",VLOOKUP(F20,Kontoplan!A:D,2,0)))","v":"G4S tyverialarm"}]
["2021-01-08",7,null,null,null,12310,null,109.68,{"$f":"IF(F21=\"\",\"\",IF(ISERROR(VLOOKUP(F21,Kontoplan!A:D,2,0)),\"Konto findes ikke!\",VLOOKUP(F21,Kontoplan!A:D,2,0)))","v":"Bank konto"}]
["2021-01-08",7,null,null,null,2110,109.68,null,{"$f":"IF(F22=\"\",\"\",IF(ISERROR(VLOOKUP(F22,Kontoplan!A:D,2,0)),\"Konto findes ikke!\",VLOOKUP(F22,Kontoplan!A:D,2,0)))","v":"Kontorhold - Porto - IT"}]
["2021-01-19",8,null,null,null,12310,5469.35,null,{"$f":"IF(F23=\"\",\"\",IF(ISERROR(VLOOKUP(F23,Kontoplan!A:D,2,0)),\"Konto findes ikke!\",VLOOKUP(F23,Kontoplan!A:D,2,0)))","v":"Bank konto"}]
["2021-01-19",8,null,null,null,1115,null,5469.35,{"$f":"IF(F24=\"\",\"\",IF(ISERROR(VLOOKUP(F24,Kontoplan!A:D,2,0)),\"Konto findes ikke!\",VLOOKUP(F24,Kontoplan!A:D,2,0)))","v":"Løn Retur fra visma"}]
["2021-01-20",9,null,null,null,12310,null,1832.75,{"$f":"IF(F25=\"\",\"\",IF(ISERROR(VLOOKUP(F25,Kontoplan!A:D,2,0)),\"Konto findes ikke!\",VLOOKUP(F25,Kontoplan!A:D,2,0)))","v":"Bank konto"}]
["2021-01-20",9,null,null,null,3120,1832.75,null,{"$f":"IF(F26=\"\",\"\",IF(ISERROR(VLOOKUP(F26,Kontoplan!A:D,2,0)),\"Konto findes ikke!\",VLOOKUP(F26,Kontoplan!A:D,2,0)))","v":"ATP"}]
["2021-01-25",10,null,null,null,12310,null,3170,{"$f":"IF(F27=\"\",\"\",IF(ISERROR(VLOOKUP(F27,Kontoplan!A:D,2,0)),\"Konto findes ikke!\",VLOOKUP(F27,Kontoplan!A:D,2,0)))","v":"Bank konto"}]
["2021-01-25",10,null,null,null,2190,3170,null,{"$f":"IF(F28=\"\",\"\",IF(ISERROR(VLOOKUP(F28,Kontoplan!A:D,2,0)),\"Konto findes ikke!\",VLOOKUP(F28,Kontoplan!A:D,2,0)))","v":"Diverse Udgifter"}]
["2021-01-29",11,null,null,null,12310,null,4477,{"$f":"IF(F29=\"\",\"\",IF(ISERROR(VLOOKUP(F29,Kontoplan!A:D,2,0)),\"Konto findes ikke!\",VLOOKUP(F29,Kontoplan!A:D,2,0)))","v":"Bank konto"}]
["2021-01-29",11,null,null,null,3110,4477,null,{"$f":"IF(F30=\"\",\"\",IF(ISERROR(VLOOKUP(F30,Kontoplan!A:D,2,0)),\"Konto findes ikke!\",VLOOKUP(F30,Kontoplan!A:D,2,0)))","v":"Lønninger incl ATP -AM"},"skulle være trukket på skyldig skat"]
["2021-01-29",12,null,null,null,12310,null,1.5,{"$f":"IF(F31=\"\",\"\",IF(ISERROR(VLOOKUP(F31,Kontoplan!A:D,2,0)),\"Konto findes ikke!\",VLOOKUP(F31,Kontoplan!A:D,2,0)))","v":"Bank konto"}]
["2021-01-29",12,null,null,null,2000,1.5,null,{"$f":"IF(F32=\"\",\"\",IF(ISERROR(VLOOKUP(F32,Kontoplan!A:D,2,0)),\"Konto findes ikke!\",VLOOKUP(F32,Kontoplan!A:D,2,0)))","v":"Bankgebyr"}]
["2021-02-01",13,null,null,null,12310,null,192.5,{"$f":"IF(F33=\"\",\"\",IF(ISERROR(VLOOKUP(F33,Kontoplan!A:D,2,0)),\"Konto findes ikke!\",VLOOKUP(F33,Kontoplan!A:D,2,0)))","v":"Bank konto"}]
["2021-02-01",13,null,null,null,2010,192.5,null,{"$f":"IF(F34=\"\",\"\",IF(ISERROR(VLOOKUP(F34,Kontoplan!A:D,2,0)),\"Konto findes ikke!\",VLOOKUP(F34,Kontoplan!A:D,2,0)))","v":"Danløn"}]
["2021-02-01",14,null,null,null,12310,null,3316.9,{"$f":"IF(F35=\"\",\"\",IF(ISERROR(VLOOKUP(F35,Kontoplan!A:D,2,0)),\"Konto findes ikke!\",VLOOKUP(F35,Kontoplan!A:D,2,0)))","v":"Bank konto"}]
["2021-02-01",14,null,null,null,2040,3316.9,null,{"$f":"IF(F36=\"\",\"\",IF(ISERROR(VLOOKUP(F36,Kontoplan!A:D,2,0)),\"Konto findes ikke!\",VLOOKUP(F36,Kontoplan!A:D,2,0)))","v":"El, Vand og Varme"}]
["2021-02-01",15,null,null,null,12310,null,2064.17,{"$f":"IF(F37=\"\",\"\",IF(ISERROR(VLOOKUP(F37,Kontoplan!A:D,2,0)),\"Konto findes ikke!\",VLOOKUP(F37,Kontoplan!A:D,2,0)))","v":"Bank konto"}]
["2021-02-01",15,null,null,null,2040,2064.17,null,{"$f":"IF(F38=\"\",\"\",IF(ISERROR(VLOOKUP(F38,Kontoplan!A:D,2,0)),\"Konto findes ikke!\",VLOOKUP(F38,Kontoplan!A:D,2,0)))","v":"El, Vand og Varme"}]
["2021-02-01",16,null,null,null,12310,null,377.75,{"$f":"IF(F39=\"\",\"\",IF(ISERROR(VLOOKUP(F39,Kontoplan!A:D,2,0)),\"Konto findes ikke!\",VLOOKUP(F39,Kontoplan!A:D,2,0)))","v":"Bank konto"}]
["2021-02-01",16,null,null,null,2060,377.75,null,{"$f":"IF(F40=\"\",\"\",IF(ISERROR(VLOOKUP(F40,Kontoplan!A:D,2,0)),\"Konto findes ikke!\",VLOOKUP(F40,Kontoplan!A:D,2,0)))","v":"Internet, mobiltelefon, Forsik."}]
["2021-02-08",17,null,null,null,12310,null,6000,{"$f":"IF(F41=\"\",\"\",IF(ISERROR(VLOOKUP(F41,Kontoplan!A:D,2,0)),\"Konto findes ikke!\",VLOOKUP(F41,Kontoplan!A:D,2,0)))","v":"Bank konto"}]
["2021-02-08",17,null,null,null,2030,6000,null,{"$f":"IF(F42=\"\",\"\",IF(ISERROR(VLOOKUP(F42,Kontoplan!A:D,2,0)),\"Konto findes ikke!\",VLOOKUP(F42,Kontoplan!A:D,2,0)))","v":"Bygnings vedligehold"}]
["2021-02-08",18,null,null,null,12310,null,284,{"$f":"IF(F43=\"\",\"\",IF(ISERROR(VLOOKUP(F43,Kontoplan!A:D,2,0)),\"Konto findes ikke!\",VLOOKUP(F43,Kontoplan!A:D,2,0)))","v":"Bank konto"}]
["2021-02-08",18,null,null,null,3110,284,null,{"$f":"IF(F44=\"\",\"\",IF(ISERROR(VLOOKUP(F44,Kontoplan!A:D,2,0)),\"Konto findes ikke!\",VLOOKUP(F44,Kontoplan!A:D,2,0)))","v":"Lønninger incl ATP -AM"}]
["2021-02-24",19,null,null,null,12310,null,947.14,{"$f":"IF(F45=\"\",\"\",IF(ISERROR(VLOOKUP(F45,Kontoplan!A:D,2,0)),\"Konto findes ikke!\",VLOOKUP(F45,Kontoplan!A:D,2,0)))","v":"Bank konto"}]
["2021-02-24",19,null,null,null,2120,947.14,null,{"$f":"IF(F46=\"\",\"\",IF(ISERROR(VLOOKUP(F46,Kontoplan!A:D,2,0)),\"Konto findes ikke!\",VLOOKUP(F46,Kontoplan!A:D,2,0)))","v":"Hjemmeside"}]
["2021-03-01",20,null,null,null,12310,null,1,{"$f":"IF(F47=\"\",\"\",IF(ISERROR(VLOOKUP(F47,Kontoplan!A:D,2,0)),\"Konto findes ikke!\",VLOOKUP(F47,Kontoplan!A:D,2,0)))","v":"Bank konto"}]
["2021-03-01",20,null,null,null,2000,1,null,{"$f":"IF(F48=\"\",\"\",IF(ISERROR(VLOOKUP(F48,Kontoplan!A:D,2,0)),\"Konto findes ikke!\",VLOOKUP(F48,Kontoplan!A:D,2,0)))","v":"Bankgebyr"}]
["2021-03-01",21,null,null,null,12310,null,456.05,{"$f":"IF(F49=\"\",\"\",IF(ISERROR(VLOOKUP(F49,Kontoplan!A:D,2,0)),\"Konto findes ikke!\",VLOOKUP(F49,Kontoplan!A:D,2,0)))","v":"Bank konto"}]
["2021-03-01",21,null,null,null,2060,456.05,null,{"$f":"IF(F50=\"\",\"\",IF(ISERROR(VLOOKUP(F50,Kontoplan!A:D,2,0)),\"Konto findes ikke!\",VLOOKUP(F50,Kontoplan!A:D,2,0)))","v":"Internet, mobiltelefon, Forsik."}]
["2021-03-01",22,null,null,null,12310,null,192.5,{"$f":"IF(F51=\"\",\"\",IF(ISERROR(VLOOKUP(F51,Kontoplan!A:D,2,0)),\"Konto findes ikke!\",VLOOKUP(F51,Kontoplan!A:D,2,0)))","v":"Bank konto"}]
["2021-03-01",22,null,null,null,2010,192.5,null,{"$f":"IF(F52=\"\",\"\",IF(ISERROR(VLOOKUP(F52,Kontoplan!A:D,2,0)),\"Konto findes ikke!\",VLOOKUP(F52,Kontoplan!A:D,2,0)))","v":"Danløn"}]
["2021-03-03",23,null,null,null,12310,null,104.39,{"$f":"IF(F53=\"\",\"\",IF(ISERROR(VLOOKUP(F53,Kontoplan!A:D,2,0)),\"Konto findes ikke!\",VLOOKUP(F53,Kontoplan!A:D,2,0)))","v":"Bank konto"}]
["2021-03-03",23,null,null,null,2110,104.39,null,{"$f":"IF(F54=\"\",\"\",IF(ISERROR(VLOOKUP(F54,Kontoplan!A:D,2,0)),\"Konto findes ikke!\",VLOOKUP(F54,Kontoplan!A:D,2,0)))","v":"Kontorhold - Porto - IT"}]
["2021-03-05",24,null,null,null,12310,null,7316.64,{"$f":"IF(F55=\"\",\"\",IF(ISERROR(VLOOKUP(F55,Kontoplan!A:D,2,0)),\"Konto findes ikke!\",VLOOKUP(F55,Kontoplan!A:D,2,0)))","v":"Bank konto"}]
["2021-03-05",24,null,null,null,2060,7316.64,null,{"$f":"IF(F56=\"\",\"\",IF(ISERROR(VLOOKUP(F56,Kontoplan!A:D,2,0)),\"Konto findes ikke!\",VLOOKUP(F56,Kontoplan!A:D,2,0)))","v":"Internet, mobiltelefon, Forsik."}]
["2021-03-08",25,null,null,null,12310,null,12500,{"$f":"IF(F57=\"\",\"\",IF(ISERROR(VLOOKUP(F57,Kontoplan!A:D,2,0)),\"Konto findes ikke!\",VLOOKUP(F57,Kontoplan!A:D,2,0)))","v":"Bank konto"}]
["2021-03-08",25,null,null,null,2020,12500,null,{"$f":"IF(F58=\"\",\"\",IF(ISERROR(VLOOKUP(F58,Kontoplan!A:D,2,0)),\"Konto findes ikke!\",VLOOKUP(F58,Kontoplan!A:D,2,0)))","v":"Revision"}]
["2021-03-10",26,null,null,null,12310,null,514.25,{"$f":"IF(F59=\"\",\"\",IF(ISERROR(VLOOKUP(F59,Kontoplan!A:D,2,0)),\"Konto findes ikke!\",VLOOKUP(F59,Kontoplan!A:D,2,0)))","v":"Bank konto"}]
["2021-03-10",26,null,null,null,2040,514.25,null,{"$f":"IF(F60=\"\",\"\",IF(ISERROR(VLOOKUP(F60,Kontoplan!A:D,2,0)),\"Konto findes ikke!\",VLOOKUP(F60,Kontoplan!A:D,2,0)))","v":"El, Vand og Varme"}]
["2021-03-11",27,null,null,null,12310,null,550,{"$f":"IF(F61=\"\",\"\",IF(ISERROR(VLOOKUP(F61,Kontoplan!A:D,2,0)),\"Konto findes ikke!\",VLOOKUP(F61,Kontoplan!A:D,2,0)))","v":"Bank konto"}]
["2021-03-11",27,null,null,null,2090,550,null,{"$f":"IF(F62=\"\",\"\",IF(ISERROR(VLOOKUP(F62,Kontoplan!A:D,2,0)),\"Konto findes ikke!\",VLOOKUP(F62,Kontoplan!A:D,2,0)))","v":"Kontingent til andre Foreninger"}]
["2021-03-12",28,null,null,null,12310,10000,null,{"$f":"IF(F63=\"\",\"\",IF(ISERROR(VLOOKUP(F63,Kontoplan!A:D,2,0)),\"Konto findes ikke!\",VLOOKUP(F63,Kontoplan!A:D,2,0)))","v":"Bank konto"}]
["2021-03-12",28,null,null,null,1040,null,10000,{"$f":"IF(F64=\"\",\"\",IF(ISERROR(VLOOKUP(F64,Kontoplan!A:D,2,0)),\"Konto findes ikke!\",VLOOKUP(F64,Kontoplan!A:D,2,0)))","v":"Fonde/Gaver"}]
["2021-03-12",29,null,null,null,12310,null,16000,{"$f":"IF(F65=\"\",\"\",IF(ISERROR(VLOOKUP(F65,Kontoplan!A:D,2,0)),\"Konto findes ikke!\",VLOOKUP(F65,Kontoplan!A:D,2,0)))","v":"Bank konto"}]
["2021-03-12",29,null,null,null,2030,16000,null,{"$f":"IF(F66=\"\",\"\",IF(ISERROR(VLOOKUP(F66,Kontoplan!A:D,2,0)),\"Konto findes ikke!\",VLOOKUP(F66,Kontoplan!A:D,2,0)))","v":"Bygnings vedligehold"}]
["2021-03-12",30,null,null,null,12310,null,8125,{"$f":"IF(F67=\"\",\"\",IF(ISERROR(VLOOKUP(F67,Kontoplan!A:D,2,0)),\"Konto findes ikke!\",VLOOKUP(F67,Kontoplan!A:D,2,0)))","v":"Bank konto"}]
["2021-03-12",30,null,null,null,2030,8125,null,{"$f":"IF(F68=\"\",\"\",IF(ISERROR(VLOOKUP(F68,Kontoplan!A:D,2,0)),\"Konto findes ikke!\",VLOOKUP(F68,Kontoplan!A:D,2,0)))","v":"Bygnings vedligehold"}]
["2021-03-16",31,null,null,null,12310,84,null,{"$f":"IF(F69=\"\",\"\",IF(ISERROR(VLOOKUP(F69,Kontoplan!A:D,2,0)),\"Konto findes ikke!\",VLOOKUP(F69,Kontoplan!A:D,2,0)))","v":"Bank konto"}]
["2021-03-16",31,null,null,null,1080,null,84,{"$f":"IF(F70=\"\",\"\",IF(ISERROR(VLOOKUP(F70,Kontoplan!A:D,2,0)),\"Konto findes ikke!\",VLOOKUP(F70,Kontoplan!A:D,2,0)))","v":"Flaskepant retur"}]
["2021-03-23",32,null,null,null,12310,250,null,{"$f":"IF(F71=\"\",\"\",IF(ISERROR(VLOOKUP(F71,Kontoplan!A:D,2,0)),\"Konto findes ikke!\",VLOOKUP(F71,Kontoplan!A:D,2,0)))","v":"Bank konto"}]
["2021-03-23",32,null,null,null,1125,null,250,{"$f":"IF(F72=\"\",\"\",IF(ISERROR(VLOOKUP(F72,Kontoplan!A:D,2,0)),\"Konto findes ikke!\",VLOOKUP(F72,Kontoplan!A:D,2,0)))","v":"Salg af inventar"}]
["2021-03-27",33,null,null,null,12310,null,289,{"$f":"IF(F73=\"\",\"\",IF(ISERROR(VLOOKUP(F73,Kontoplan!A:D,2,0)),\"Konto findes ikke!\",VLOOKUP(F73,Kontoplan!A:D,2,0)))","v":"Bank konto"}]
["2021-03-27",33,null,null,null,2100,289,null,{"$f":"IF(F74=\"\",\"\",IF(ISERROR(VLOOKUP(F74,Kontoplan!A:D,2,0)),\"Konto findes ikke!\",VLOOKUP(F74,Kontoplan!A:D,2,0)))","v":"Forplejning til møder/Rejser"}]
["2021-03-31",34,null,null,null,12310,3350,null,{"$f":"IF(F75=\"\",\"\",IF(ISERROR(VLOOKUP(F75,Kontoplan!A:D,2,0)),\"Konto findes ikke!\",VLOOKUP(F75,Kontoplan!A:D,2,0)))","v":"Bank konto"}]
["2021-03-31",34,null,null,null,1125,null,3350,{"$f":"IF(F76=\"\",\"\",IF(ISERROR(VLOOKUP(F76,Kontoplan!A:D,2,0)),\"Konto findes ikke!\",VLOOKUP(F76,Kontoplan!A:D,2,0)))","v":"Salg af inventar"}]
["2021-03-31",35,null,null,null,12310,null,4477,{"$f":"IF(F77=\"\",\"\",IF(ISERROR(VLOOKUP(F77,Kontoplan!A:D,2,0)),\"Konto findes ikke!\",VLOOKUP(F77,Kontoplan!A:D,2,0)))","v":"Bank konto"}]
["2021-03-31",35,null,null,null,3110,4477,null,{"$f":"IF(F78=\"\",\"\",IF(ISERROR(VLOOKUP(F78,Kontoplan!A:D,2,0)),\"Konto findes ikke!\",VLOOKUP(F78,Kontoplan!A:D,2,0)))","v":"Lønninger incl ATP -AM"}]
["2021-03-31",36,null,null,null,12310,null,106,{"$f":"IF(F79=\"\",\"\",IF(ISERROR(VLOOKUP(F79,Kontoplan!A:D,2,0)),\"Konto findes ikke!\",VLOOKUP(F79,Kontoplan!A:D,2,0)))","v":"Bank konto"}]
["2021-03-31",36,null,null,null,2000,106,null,{"$f":"IF(F80=\"\",\"\",IF(ISERROR(VLOOKUP(F80,Kontoplan!A:D,2,0)),\"Konto findes ikke!\",VLOOKUP(F80,Kontoplan!A:D,2,0)))","v":"Bankgebyr"}]
["2021-04-06",37,null,null,null,12310,null,414,{"$f":"IF(F81=\"\",\"\",IF(ISERROR(VLOOKUP(F81,Kontoplan!A:D,2,0)),\"Konto findes ikke!\",VLOOKUP(F81,Kontoplan!A:D,2,0)))","v":"Bank konto"}]
["2021-04-06",37,null,null,null,2060,414,null,{"$f":"IF(F82=\"\",\"\",IF(ISERROR(VLOOKUP(F82,Kontoplan!A:D,2,0)),\"Konto findes ikke!\",VLOOKUP(F82,Kontoplan!A:D,2,0)))","v":"Internet, mobiltelefon, Forsik."}]
["2021-04-06",38,null,null,null,12310,null,7907.79,{"$f":"IF(F83=\"\",\"\",IF(ISERROR(VLOOKUP(F83,Kontoplan!A:D,2,0)),\"Konto findes ikke!\",VLOOKUP(F83,Kontoplan!A:D,2,0)))","v":"Bank konto"}]
["2021-04-06",38,null,null,null,2165,7907.79,null,{"$f":"IF(F84=\"\",\"\",IF(ISERROR(VLOOKUP(F84,Kontoplan!A:D,2,0)),\"Konto findes ikke!\",VLOOKUP(F84,Kontoplan!A:D,2,0)))","v":"G4S tyverialarm"}]
["2021-04-06",39,null,null,null,12310,null,192.5,{"$f":"IF(F85=\"\",\"\",IF(ISERROR(VLOOKUP(F85,Kontoplan!A:D,2,0)),\"Konto findes ikke!\",VLOOKUP(F85,Kontoplan!A:D,2,0)))","v":"Bank konto"}]
["2021-04-06",39,null,null,null,2010,192.5,null,{"$f":"IF(F86=\"\",\"\",IF(ISERROR(VLOOKUP(F86,Kontoplan!A:D,2,0)),\"Konto findes ikke!\",VLOOKUP(F86,Kontoplan!A:D,2,0)))","v":"Danløn"}]
["2021-04-07",40,null,null,null,12310,7907.79,null,{"$f":"IF(F87=\"\",\"\",IF(ISERROR(VLOOKUP(F87,Kontoplan!A:D,2,0)),\"Konto findes ikke!\",VLOOKUP(F87,Kontoplan!A:D,2,0)))","v":"Bank konto"}]
["2021-04-07",40,null,null,null,2165,null,7907.79,{"$f":"IF(F88=\"\",\"\",IF(ISERROR(VLOOKUP(F88,Kontoplan!A:D,2,0)),\"Konto findes ikke!\",VLOOKUP(F88,Kontoplan!A:D,2,0)))","v":"G4S tyverialarm"}]
["2021-04-08",41,null,null,null,12310,null,1337.06,{"$f":"IF(F89=\"\",\"\",IF(ISERROR(VLOOKUP(F89,Kontoplan!A:D,2,0)),\"Konto findes ikke!\",VLOOKUP(F89,Kontoplan!A:D,2,0)))","v":"Bank konto"}]
["2021-04-08",41,null,null,null,2165,1337.06,null,{"$f":"IF(F90=\"\",\"\",IF(ISERROR(VLOOKUP(F90,Kontoplan!A:D,2,0)),\"Konto findes ikke!\",VLOOKUP(F90,Kontoplan!A:D,2,0)))","v":"G4S tyverialarm"}]
["2021-04-08",42,null,null,null,12310,null,105.05,{"$f":"IF(F91=\"\",\"\",IF(ISERROR(VLOOKUP(F91,Kontoplan!A:D,2,0)),\"Konto findes ikke!\",VLOOKUP(F91,Kontoplan!A:D,2,0)))","v":"Bank konto"}]
["2021-04-08",42,null,null,null,2100,105.05,null,{"$f":"IF(F92=\"\",\"\",IF(ISERROR(VLOOKUP(F92,Kontoplan!A:D,2,0)),\"Konto findes ikke!\",VLOOKUP(F92,Kontoplan!A:D,2,0)))","v":"Forplejning til møder/Rejser"}]
["2021-04-08",43,null,null,null,12310,null,477.75,{"$f":"IF(F93=\"\",\"\",IF(ISERROR(VLOOKUP(F93,Kontoplan!A:D,2,0)),\"Konto findes ikke!\",VLOOKUP(F93,Kontoplan!A:D,2,0)))","v":"Bank konto"}]
["2021-04-08",43,null,null,null,2035,477.75,null,{"$f":"IF(F94=\"\",\"\",IF(ISERROR(VLOOKUP(F94,Kontoplan!A:D,2,0)),\"Konto findes ikke!\",VLOOKUP(F94,Kontoplan!A:D,2,0)))","v":"Grønne områder"}]
["2021-04-12",44,null,null,null,12310,null,73.13,{"$f":"IF(F95=\"\",\"\",IF(ISERROR(VLOOKUP(F95,Kontoplan!A:D,2,0)),\"Konto findes ikke!\",VLOOKUP(F95,Kontoplan!A:D,2,0)))","v":"Bank konto"}]
["2021-04-12",44,null,null,null,2190,73.13,null,{"$f":"IF(F96=\"\",\"\",IF(ISERROR(VLOOKUP(F96,Kontoplan!A:D,2,0)),\"Konto findes ikke!\",VLOOKUP(F96,Kontoplan!A:D,2,0)))","v":"Diverse Udgifter"}]
["2021-04-14",45,null,null,null,12310,30000,null,{"$f":"IF(F97=\"\",\"\",IF(ISERROR(VLOOKUP(F97,Kontoplan!A:D,2,0)),\"Konto findes ikke!\",VLOOKUP(F97,Kontoplan!A:D,2,0)))","v":"Bank konto"}]
["2021-04-14",45,null,null,null,1025,null,30000,{"$f":"IF(F98=\"\",\"\",IF(ISERROR(VLOOKUP(F98,Kontoplan!A:D,2,0)),\"Konto findes ikke!\",VLOOKUP(F98,Kontoplan!A:D,2,0)))","v":"Tilskud fra BRK "}]
["2021-04-14",46,null,null,null,12310,null,194.39,{"$f":"IF(F99=\"\",\"\",IF(ISERROR(VLOOKUP(F99,Kontoplan!A:D,2,0)),\"Konto findes ikke!\",VLOOKUP(F99,Kontoplan!A:D,2,0)))","v":"Bank konto"}]
["2021-04-14",46,null,null,null,3110,194.39,null,{"$f":"IF(F100=\"\",\"\",IF(ISERROR(VLOOKUP(F100,Kontoplan!A:D,2,0)),\"Konto findes ikke!\",VLOOKUP(F100,Kontoplan!A:D,2,0)))","v":"Lønninger incl ATP -AM"}]
["2021-04-15",47,null,null,null,12310,400,null,{"$f":"IF(F101=\"\",\"\",IF(ISERROR(VLOOKUP(F101,Kontoplan!A:D,2,0)),\"Konto findes ikke!\",VLOOKUP(F101,Kontoplan!A:D,2,0)))","v":"Bank konto"}]
["2021-04-15",47,null,null,null,1125,null,400,{"$f":"IF(F102=\"\",\"\",IF(ISERROR(VLOOKUP(F102,Kontoplan!A:D,2,0)),\"Konto findes ikke!\",VLOOKUP(F102,Kontoplan!A:D,2,0)))","v":"Salg af inventar"}]
["2021-04-22",48,null,null,null,12310,null,464.69,{"$f":"IF(F103=\"\",\"\",IF(ISERROR(VLOOKUP(F103,Kontoplan!A:D,2,0)),\"Konto findes ikke!\",VLOOKUP(F103,Kontoplan!A:D,2,0)))","v":"Bank konto"}]
["2021-04-22",48,null,null,null,2165,464.69,null,{"$f":"IF(F104=\"\",\"\",IF(ISERROR(VLOOKUP(F104,Kontoplan!A:D,2,0)),\"Konto findes ikke!\",VLOOKUP(F104,Kontoplan!A:D,2,0)))","v":"G4S tyverialarm"}]
["2021-04-22",49,null,null,null,12310,null,1337.06,{"$f":"IF(F105=\"\",\"\",IF(ISERROR(VLOOKUP(F105,Kontoplan!A:D,2,0)),\"Konto findes ikke!\",VLOOKUP(F105,Kontoplan!A:D,2,0)))","v":"Bank konto"}]
["2021-04-22",49,null,null,null,2165,1337.06,null,{"$f":"IF(F106=\"\",\"\",IF(ISERROR(VLOOKUP(F106,Kontoplan!A:D,2,0)),\"Konto findes ikke!\",VLOOKUP(F106,Kontoplan!A:D,2,0)))","v":"G4S tyverialarm"}]
["2021-04-24",50,null,null,null,12310,null,65,{"$f":"IF(F107=\"\",\"\",IF(ISERROR(VLOOKUP(F107,Kontoplan!A:D,2,0)),\"Konto findes ikke!\",VLOOKUP(F107,Kontoplan!A:D,2,0)))","v":"Bank konto"}]
["2021-04-24",50,null,null,null,2100,65,null,{"$f":"IF(F108=\"\",\"\",IF(ISERROR(VLOOKUP(F108,Kontoplan!A:D,2,0)),\"Konto findes ikke!\",VLOOKUP(F108,Kontoplan!A:D,2,0)))","v":"Forplejning til møder/Rejser"}]
["2021-04-29",51,null,null,null,12310,null,7000,{"$f":"IF(F109=\"\",\"\",IF(ISERROR(VLOOKUP(F109,Kontoplan!A:D,2,0)),\"Konto findes ikke!\",VLOOKUP(F109,Kontoplan!A:D,2,0)))","v":"Bank konto"}]
["2021-04-29",51,null,null,null,3110,7000,null,{"$f":"IF(F110=\"\",\"\",IF(ISERROR(VLOOKUP(F110,Kontoplan!A:D,2,0)),\"Konto findes ikke!\",VLOOKUP(F110,Kontoplan!A:D,2,0)))","v":"Lønninger incl ATP -AM"}]
["2021-04-29",52,null,null,null,12310,null,71,{"$f":"IF(F111=\"\",\"\",IF(ISERROR(VLOOKUP(F111,Kontoplan!A:D,2,0)),\"Konto findes ikke!\",VLOOKUP(F111,Kontoplan!A:D,2,0)))","v":"Bank konto"}]
["2021-04-29",52,null,null,null,2190,71,null,{"$f":"IF(F112=\"\",\"\",IF(ISERROR(VLOOKUP(F112,Kontoplan!A:D,2,0)),\"Konto findes ikke!\",VLOOKUP(F112,Kontoplan!A:D,2,0)))","v":"Diverse Udgifter"}]
["2021-05-01",53,null,null,null,12310,null,1,{"$f":"IF(F113=\"\",\"\",IF(ISERROR(VLOOKUP(F113,Kontoplan!A:D,2,0)),\"Konto findes ikke!\",VLOOKUP(F113,Kontoplan!A:D,2,0)))","v":"Bank konto"}]
["2021-05-01",53,null,null,null,2000,1,null,{"$f":"IF(F114=\"\",\"\",IF(ISERROR(VLOOKUP(F114,Kontoplan!A:D,2,0)),\"Konto findes ikke!\",VLOOKUP(F114,Kontoplan!A:D,2,0)))","v":"Bankgebyr"}]
["2021-05-03",54,null,null,null,12310,null,15121.69,{"$f":"IF(F115=\"\",\"\",IF(ISERROR(VLOOKUP(F115,Kontoplan!A:D,2,0)),\"Konto findes ikke!\",VLOOKUP(F115,Kontoplan!A:D,2,0)))","v":"Bank konto"}]
["2021-05-03",54,null,null,null,2040,15121.69,null,{"$f":"IF(F116=\"\",\"\",IF(ISERROR(VLOOKUP(F116,Kontoplan!A:D,2,0)),\"Konto findes ikke!\",VLOOKUP(F116,Kontoplan!A:D,2,0)))","v":"El, Vand og Varme"}]
["2021-05-03",55,null,null,null,12310,null,3449.73,{"$f":"IF(F117=\"\",\"\",IF(ISERROR(VLOOKUP(F117,Kontoplan!A:D,2,0)),\"Konto findes ikke!\",VLOOKUP(F117,Kontoplan!A:D,2,0)))","v":"Bank konto"}]
["2021-05-03",55,null,null,null,2040,3449.73,null,{"$f":"IF(F118=\"\",\"\",IF(ISERROR(VLOOKUP(F118,Kontoplan!A:D,2,0)),\"Konto findes ikke!\",VLOOKUP(F118,Kontoplan!A:D,2,0)))","v":"El, Vand og Varme"}]
["2021-05-03",56,null,null,null,12310,null,414,{"$f":"IF(F119=\"\",\"\",IF(ISERROR(VLOOKUP(F119,Kontoplan!A:D,2,0)),\"Konto findes ikke!\",VLOOKUP(F119,Kontoplan!A:D,2,0)))","v":"Bank konto"}]
["2021-05-03",56,null,null,null,2060,414,null,{"$f":"IF(F120=\"\",\"\",IF(ISERROR(VLOOKUP(F120,Kontoplan!A:D,2,0)),\"Konto findes ikke!\",VLOOKUP(F120,Kontoplan!A:D,2,0)))","v":"Internet, mobiltelefon, Forsik."}]
["2021-05-03",57,null,null,null,12310,null,345,{"$f":"IF(F121=\"\",\"\",IF(ISERROR(VLOOKUP(F121,Kontoplan!A:D,2,0)),\"Konto findes ikke!\",VLOOKUP(F121,Kontoplan!A:D,2,0)))","v":"Bank konto"}]
["2021-05-03",57,null,null,null,2065,345,null,{"$f":"IF(F122=\"\",\"\",IF(ISERROR(VLOOKUP(F122,Kontoplan!A:D,2,0)),\"Konto findes ikke!\",VLOOKUP(F122,Kontoplan!A:D,2,0)))","v":"Udstilling"}]
["2021-05-03",58,null,null,null,12310,null,192.5,{"$f":"IF(F123=\"\",\"\",IF(ISERROR(VLOOKUP(F123,Kontoplan!A:D,2,0)),\"Konto findes ikke!\",VLOOKUP(F123,Kontoplan!A:D,2,0)))","v":"Bank konto"}]
["2021-05-03",58,null,null,null,2010,192.5,null,{"$f":"IF(F124=\"\",\"\",IF(ISERROR(VLOOKUP(F124,Kontoplan!A:D,2,0)),\"Konto findes ikke!\",VLOOKUP(F124,Kontoplan!A:D,2,0)))","v":"Danløn"}]
["2021-05-07",59,null,null,null,12310,null,739.05,{"$f":"IF(F125=\"\",\"\",IF(ISERROR(VLOOKUP(F125,Kontoplan!A:D,2,0)),\"Konto findes ikke!\",VLOOKUP(F125,Kontoplan!A:D,2,0)))","v":"Bank konto"}]
["2021-05-07",59,null,null,null,2065,739.05,null,{"$f":"IF(F126=\"\",\"\",IF(ISERROR(VLOOKUP(F126,Kontoplan!A:D,2,0)),\"Konto findes ikke!\",VLOOKUP(F126,Kontoplan!A:D,2,0)))","v":"Udstilling"}]
["2021-05-08",60,null,null,null,12310,null,2349.2600000000002,{"$f":"IF(F127=\"\",\"\",IF(ISERROR(VLOOKUP(F127,Kontoplan!A:D,2,0)),\"Konto findes ikke!\",VLOOKUP(F127,Kontoplan!A:D,2,0)))","v":"Bank konto"}]
["2021-05-08",60,null,null,null,2037,2349.2600000000002,null,{"$f":"IF(F128=\"\",\"\",IF(ISERROR(VLOOKUP(F128,Kontoplan!A:D,2,0)),\"Konto findes ikke!\",VLOOKUP(F128,Kontoplan!A:D,2,0)))","v":"Rengørringsartikler"}]
["2021-05-08",61,null,null,null,12310,null,150,{"$f":"IF(F129=\"\",\"\",IF(ISERROR(VLOOKUP(F129,Kontoplan!A:D,2,0)),\"Konto findes ikke!\",VLOOKUP(F129,Kontoplan!A:D,2,0)))","v":"Bank konto"}]
["2021-05-08",61,null,null,null,2200,150,null,{"$f":"IF(F130=\"\",\"\",IF(ISERROR(VLOOKUP(F130,Kontoplan!A:D,2,0)),\"Konto findes ikke!\",VLOOKUP(F130,Kontoplan!A:D,2,0)))","v":"Kontingenter overført til KVB"}]
["2021-05-11",62,null,null,null,12310,1294.24,null,{"$f":"IF(F131=\"\",\"\",IF(ISERROR(VLOOKUP(F131,Kontoplan!A:D,2,0)),\"Konto findes ikke!\",VLOOKUP(F131,Kontoplan!A:D,2,0)))","v":"Bank konto"}]
["2021-05-11",62,null,null,null,1000,null,1294.24,{"$f":"IF(F132=\"\",\"\",IF(ISERROR(VLOOKUP(F132,Kontoplan!A:D,2,0)),\"Konto findes ikke!\",VLOOKUP(F132,Kontoplan!A:D,2,0)))","v":"Entre"}]
["2021-05-12",63,null,null,null,12310,null,1667.5,{"$f":"IF(F133=\"\",\"\",IF(ISERROR(VLOOKUP(F133,Kontoplan!A:D,2,0)),\"Konto findes ikke!\",VLOOKUP(F133,Kontoplan!A:D,2,0)))","v":"Bank konto"}]
["2021-05-12",63,null,null,null,2065,1667.5,null,{"$f":"IF(F134=\"\",\"\",IF(ISERROR(VLOOKUP(F134,Kontoplan!A:D,2,0)),\"Konto findes ikke!\",VLOOKUP(F134,Kontoplan!A:D,2,0)))","v":"Udstilling"}]
["2021-05-14",64,null,null,null,12310,null,100,{"$f":"IF(F135=\"\",\"\",IF(ISERROR(VLOOKUP(F135,Kontoplan!A:D,2,0)),\"Konto findes ikke!\",VLOOKUP(F135,Kontoplan!A:D,2,0)))","v":"Bank konto"}]
["2021-05-14",64,null,null,null,2065,100,null,{"$f":"IF(F136=\"\",\"\",IF(ISERROR(VLOOKUP(F136,Kontoplan!A:D,2,0)),\"Konto findes ikke!\",VLOOKUP(F136,Kontoplan!A:D,2,0)))","v":"Udstilling"}]
["2021-05-14",65,null,null,null,12310,null,150,{"$f":"IF(F137=\"\",\"\",IF(ISERROR(VLOOKUP(F137,Kontoplan!A:D,2,0)),\"Konto findes ikke!\",VLOOKUP(F137,Kontoplan!A:D,2,0)))","v":"Bank konto"}]
["2021-05-14",65,null,null,null,2200,150,null,{"$f":"IF(F138=\"\",\"\",IF(ISERROR(VLOOKUP(F138,Kontoplan!A:D,2,0)),\"Konto findes ikke!\",VLOOKUP(F138,Kontoplan!A:D,2,0)))","v":"Kontingenter overført til KVB"}]
["2021-05-14",66,null,null,null,12310,null,150,{"$f":"IF(F139=\"\",\"\",IF(ISERROR(VLOOKUP(F139,Kontoplan!A:D,2,0)),\"Konto findes ikke!\",VLOOKUP(F139,Kontoplan!A:D,2,0)))","v":"Bank konto"}]
["2021-05-14",66,null,null,null,2200,150,null,{"$f":"IF(F140=\"\",\"\",IF(ISERROR(VLOOKUP(F140,Kontoplan!A:D,2,0)),\"Konto findes ikke!\",VLOOKUP(F140,Kontoplan!A:D,2,0)))","v":"Kontingenter overført til KVB"}]
["2021-05-14",67,null,null,null,12310,null,150,{"$f":"IF(F141=\"\",\"\",IF(ISERROR(VLOOKUP(F141,Kontoplan!A:D,2,0)),\"Konto findes ikke!\",VLOOKUP(F141,Kontoplan!A:D,2,0)))","v":"Bank konto"}]
["2021-05-14",67,null,null,null,2200,150,null,{"$f":"IF(F142=\"\",\"\",IF(ISERROR(VLOOKUP(F142,Kontoplan!A:D,2,0)),\"Konto findes ikke!\",VLOOKUP(F142,Kontoplan!A:D,2,0)))","v":"Kontingenter overført til KVB"}]
["2021-05-18",68,null,null,null,12310,3142.44,null,{"$f":"IF(F143=\"\",\"\",IF(ISERROR(VLOOKUP(F143,Kontoplan!A:D,2,0)),\"Konto findes ikke!\",VLOOKUP(F143,Kontoplan!A:D,2,0)))","v":"Bank konto"}]
["2021-05-18",68,null,null,null,1000,null,3142.44,{"$f":"IF(F144=\"\",\"\",IF(ISERROR(VLOOKUP(F144,Kontoplan!A:D,2,0)),\"Konto findes ikke!\",VLOOKUP(F144,Kontoplan!A:D,2,0)))","v":"Entre"}]
["2021-05-21",69,null,null,null,12310,null,60,{"$f":"IF(F145=\"\",\"\",IF(ISERROR(VLOOKUP(F145,Kontoplan!A:D,2,0)),\"Konto findes ikke!\",VLOOKUP(F145,Kontoplan!A:D,2,0)))","v":"Bank konto"}]
["2021-05-21",69,null,null,null,2065,60,null,{"$f":"IF(F146=\"\",\"\",IF(ISERROR(VLOOKUP(F146,Kontoplan!A:D,2,0)),\"Konto findes ikke!\",VLOOKUP(F146,Kontoplan!A:D,2,0)))","v":"Udstilling"}]
["2021-05-21",70,null,null,null,12310,null,1899,{"$f":"IF(F147=\"\",\"\",IF(ISERROR(VLOOKUP(F147,Kontoplan!A:D,2,0)),\"Konto findes ikke!\",VLOOKUP(F147,Kontoplan!A:D,2,0)))","v":"Bank konto"}]
["2021-05-21",70,null,null,null,2035,1899,null,{"$f":"IF(F148=\"\",\"\",IF(ISERROR(VLOOKUP(F148,Kontoplan!A:D,2,0)),\"Konto findes ikke!\",VLOOKUP(F148,Kontoplan!A:D,2,0)))","v":"Grønne områder"}]
["2021-05-21",71,null,null,null,12310,null,1899,{"$f":"IF(F149=\"\",\"\",IF(ISERROR(VLOOKUP(F149,Kontoplan!A:D,2,0)),\"Konto findes ikke!\",VLOOKUP(F149,Kontoplan!A:D,2,0)))","v":"Bank konto"}]
["2021-05-21",71,null,null,null,2035,1899,null,{"$f":"IF(F150=\"\",\"\",IF(ISERROR(VLOOKUP(F150,Kontoplan!A:D,2,0)),\"Konto findes ikke!\",VLOOKUP(F150,Kontoplan!A:D,2,0)))","v":"Grønne områder"}]
["2021-05-21",72,null,null,null,12310,null,150,{"$f":"IF(F151=\"\",\"\",IF(ISERROR(VLOOKUP(F151,Kontoplan!A:D,2,0)),\"Konto findes ikke!\",VLOOKUP(F151,Kontoplan!A:D,2,0)))","v":"Bank konto"}]
["2021-05-21",72,null,null,null,2200,150,null,{"$f":"IF(F152=\"\",\"\",IF(ISERROR(VLOOKUP(F152,Kontoplan!A:D,2,0)),\"Konto findes ikke!\",VLOOKUP(F152,Kontoplan!A:D,2,0)))","v":"Kontingenter overført til KVB"}]
["2021-05-26",73,null,null,null,12310,1843.27,null,{"$f":"IF(F153=\"\",\"\",IF(ISERROR(VLOOKUP(F153,Kontoplan!A:D,2,0)),\"Konto findes ikke!\",VLOOKUP(F153,Kontoplan!A:D,2,0)))","v":"Bank konto"}]
["2021-05-26",73,null,null,null,1000,null,1843.27,{"$f":"IF(F154=\"\",\"\",IF(ISERROR(VLOOKUP(F154,Kontoplan!A:D,2,0)),\"Konto findes ikke!\",VLOOKUP(F154,Kontoplan!A:D,2,0)))","v":"Entre"}]
["2021-05-26",74,null,null,null,12310,3000,null,{"$f":"IF(F155=\"\",\"\",IF(ISERROR(VLOOKUP(F155,Kontoplan!A:D,2,0)),\"Konto findes ikke!\",VLOOKUP(F155,Kontoplan!A:D,2,0)))","v":"Bank konto"}]
["2021-05-26",74,null,null,null,1130,null,3000,{"$f":"IF(F156=\"\",\"\",IF(ISERROR(VLOOKUP(F156,Kontoplan!A:D,2,0)),\"Konto findes ikke!\",VLOOKUP(F156,Kontoplan!A:D,2,0)))","v":"Diverse Indtægter"}]
["2021-05-26",75,null,null,null,12310,null,3000,{"$f":"IF(F157=\"\",\"\",IF(ISERROR(VLOOKUP(F157,Kontoplan!A:D,2,0)),\"Konto findes ikke!\",VLOOKUP(F157,Kontoplan!A:D,2,0)))","v":"Bank konto"}]
["2021-05-26",75,null,null,null,2065,3000,null,{"$f":"IF(F158=\"\",\"\",IF(ISERROR(VLOOKUP(F158,Kontoplan!A:D,2,0)),\"Konto findes ikke!\",VLOOKUP(F158,Kontoplan!A:D,2,0)))","v":"Udstilling"}]
["2021-05-27",76,null,null,null,12310,null,300,{"$f":"IF(F159=\"\",\"\",IF(ISERROR(VLOOKUP(F159,Kontoplan!A:D,2,0)),\"Konto findes ikke!\",VLOOKUP(F159,Kontoplan!A:D,2,0)))","v":"Bank konto"}]
["2021-05-27",76,null,null,null,3100,300,null,{"$f":"IF(F160=\"\",\"\",IF(ISERROR(VLOOKUP(F160,Kontoplan!A:D,2,0)),\"Konto findes ikke!\",VLOOKUP(F160,Kontoplan!A:D,2,0)))","v":"Lønomkostninger"}]
["2021-05-26",77,null,null,null,12310,null,799,{"$f":"IF(F161=\"\",\"\",IF(ISERROR(VLOOKUP(F161,Kontoplan!A:D,2,0)),\"Konto findes ikke!\",VLOOKUP(F161,Kontoplan!A:D,2,0)))","v":"Bank konto"}]
["2021-05-26",77,null,null,null,2060,799,null,{"$f":"IF(F162=\"\",\"\",IF(ISERROR(VLOOKUP(F162,Kontoplan!A:D,2,0)),\"Konto findes ikke!\",VLOOKUP(F162,Kontoplan!A:D,2,0)))","v":"Internet, mobiltelefon, Forsik."}]
["2021-05-28",78,null,null,null,12310,null,107.18,{"$f":"IF(F163=\"\",\"\",IF(ISERROR(VLOOKUP(F163,Kontoplan!A:D,2,0)),\"Konto findes ikke!\",VLOOKUP(F163,Kontoplan!A:D,2,0)))","v":"Bank konto"}]
["2021-05-28",78,null,null,null,2100,107.18,null,{"$f":"IF(F164=\"\",\"\",IF(ISERROR(VLOOKUP(F164,Kontoplan!A:D,2,0)),\"Konto findes ikke!\",VLOOKUP(F164,Kontoplan!A:D,2,0)))","v":"Forplejning til møder/Rejser"}]
["2021-05-31",79,null,null,null,12310,null,4436,{"$f":"IF(F165=\"\",\"\",IF(ISERROR(VLOOKUP(F165,Kontoplan!A:D,2,0)),\"Konto findes ikke!\",VLOOKUP(F165,Kontoplan!A:D,2,0)))","v":"Bank konto"}]
["2021-05-31",79,null,null,null,3100,4436,null,{"$f":"IF(F166=\"\",\"\",IF(ISERROR(VLOOKUP(F166,Kontoplan!A:D,2,0)),\"Konto findes ikke!\",VLOOKUP(F166,Kontoplan!A:D,2,0)))","v":"Lønomkostninger"}]
["2021-05-31",80,null,null,null,12310,null,370,{"$f":"IF(F167=\"\",\"\",IF(ISERROR(VLOOKUP(F167,Kontoplan!A:D,2,0)),\"Konto findes ikke!\",VLOOKUP(F167,Kontoplan!A:D,2,0)))","v":"Bank konto"}]
["2021-05-31",80,null,null,null,2035,370,null,{"$f":"IF(F168=\"\",\"\",IF(ISERROR(VLOOKUP(F168,Kontoplan!A:D,2,0)),\"Konto findes ikke!\",VLOOKUP(F168,Kontoplan!A:D,2,0)))","v":"Grønne områder"}]
["2021-05-31",81,null,null,null,12310,null,1733,{"$f":"IF(F169=\"\",\"\",IF(ISERROR(VLOOKUP(F169,Kontoplan!A:D,2,0)),\"Konto findes ikke!\",VLOOKUP(F169,Kontoplan!A:D,2,0)))","v":"Bank konto"}]
["2021-05-31",81,null,null,null,2110,44,null,{"$f":"IF(F170=\"\",\"\",IF(ISERROR(VLOOKUP(F170,Kontoplan!A:D,2,0)),\"Konto findes ikke!\",VLOOKUP(F170,Kontoplan!A:D,2,0)))","v":"Kontorhold - Porto - IT"}]
["2021-05-31",81,null,null,null,2035,1689,null,{"$f":"IF(F171=\"\",\"\",IF(ISERROR(VLOOKUP(F171,Kontoplan!A:D,2,0)),\"Konto findes ikke!\",VLOOKUP(F171,Kontoplan!A:D,2,0)))","v":"Grønne områder"}]
["2021-05-31",82,null,null,null,12310,null,45,{"$f":"IF(F172=\"\",\"\",IF(ISERROR(VLOOKUP(F172,Kontoplan!A:D,2,0)),\"Konto findes ikke!\",VLOOKUP(F172,Kontoplan!A:D,2,0)))","v":"Bank konto"}]
["2021-05-31",82,null,null,null,2065,45,null,{"$f":"IF(F173=\"\",\"\",IF(ISERROR(VLOOKUP(F173,Kontoplan!A:D,2,0)),\"Konto findes ikke!\",VLOOKUP(F173,Kontoplan!A:D,2,0)))","v":"Udstilling"}]
["2021-06-01",83,null,null,null,12310,null,1,{"$f":"IF(F174=\"\",\"\",IF(ISERROR(VLOOKUP(F174,Kontoplan!A:D,2,0)),\"Konto findes ikke!\",VLOOKUP(F174,Kontoplan!A:D,2,0)))","v":"Bank konto"}]
["2021-06-01",83,null,null,null,2000,1,null,{"$f":"IF(F175=\"\",\"\",IF(ISERROR(VLOOKUP(F175,Kontoplan!A:D,2,0)),\"Konto findes ikke!\",VLOOKUP(F175,Kontoplan!A:D,2,0)))","v":"Bankgebyr"}]
["2021-06-01",84,null,null,null,12310,1745.27,null,{"$f":"IF(F176=\"\",\"\",IF(ISERROR(VLOOKUP(F176,Kontoplan!A:D,2,0)),\"Konto findes ikke!\",VLOOKUP(F176,Kontoplan!A:D,2,0)))","v":"Bank konto"}]
["2021-06-01",84,null,null,null,1000,null,1745.27,{"$f":"IF(F177=\"\",\"\",IF(ISERROR(VLOOKUP(F177,Kontoplan!A:D,2,0)),\"Konto findes ikke!\",VLOOKUP(F177,Kontoplan!A:D,2,0)))","v":"Entre"}]
["2021-06-01",85,null,null,null,12310,null,414,{"$f":"IF(F178=\"\",\"\",IF(ISERROR(VLOOKUP(F178,Kontoplan!A:D,2,0)),\"Konto findes ikke!\",VLOOKUP(F178,Kontoplan!A:D,2,0)))","v":"Bank konto"}]
["2021-06-01",85,null,null,null,2060,414,null,{"$f":"IF(F179=\"\",\"\",IF(ISERROR(VLOOKUP(F179,Kontoplan!A:D,2,0)),\"Konto findes ikke!\",VLOOKUP(F179,Kontoplan!A:D,2,0)))","v":"Internet, mobiltelefon, Forsik."}]
["2021-06-01",86,null,null,null,12310,null,192.5,{"$f":"IF(F180=\"\",\"\",IF(ISERROR(VLOOKUP(F180,Kontoplan!A:D,2,0)),\"Konto findes ikke!\",VLOOKUP(F180,Kontoplan!A:D,2,0)))","v":"Bank konto"}]
["2021-06-01",86,null,null,null,2010,192.5,null,{"$f":"IF(F181=\"\",\"\",IF(ISERROR(VLOOKUP(F181,Kontoplan!A:D,2,0)),\"Konto findes ikke!\",VLOOKUP(F181,Kontoplan!A:D,2,0)))","v":"Danløn"}]
["2021-06-02",87,null,null,null,12310,550,null,{"$f":"IF(F182=\"\",\"\",IF(ISERROR(VLOOKUP(F182,Kontoplan!A:D,2,0)),\"Konto findes ikke!\",VLOOKUP(F182,Kontoplan!A:D,2,0)))","v":"Bank konto"}]
["2021-06-02",87,null,null,null,1125,null,550,{"$f":"IF(F183=\"\",\"\",IF(ISERROR(VLOOKUP(F183,Kontoplan!A:D,2,0)),\"Konto findes ikke!\",VLOOKUP(F183,Kontoplan!A:D,2,0)))","v":"Salg af inventar"}]
["2021-06-02",88,null,null,null,12310,null,7000,{"$f":"IF(F184=\"\",\"\",IF(ISERROR(VLOOKUP(F184,Kontoplan!A:D,2,0)),\"Konto findes ikke!\",VLOOKUP(F184,Kontoplan!A:D,2,0)))","v":"Bank konto"}]
["2021-06-02",88,null,null,null,3110,7000,null,{"$f":"IF(F185=\"\",\"\",IF(ISERROR(VLOOKUP(F185,Kontoplan!A:D,2,0)),\"Konto findes ikke!\",VLOOKUP(F185,Kontoplan!A:D,2,0)))","v":"Lønninger incl ATP -AM"}]
["2021-06-04",89,null,null,null,12310,null,1347.78,{"$f":"IF(F186=\"\",\"\",IF(ISERROR(VLOOKUP(F186,Kontoplan!A:D,2,0)),\"Konto findes ikke!\",VLOOKUP(F186,Kontoplan!A:D,2,0)))","v":"Bank konto"}]
["2021-06-04",89,null,null,null,2110,1347.78,null,{"$f":"IF(F187=\"\",\"\",IF(ISERROR(VLOOKUP(F187,Kontoplan!A:D,2,0)),\"Konto findes ikke!\",VLOOKUP(F187,Kontoplan!A:D,2,0)))","v":"Kontorhold - Porto - IT"}]
["2021-06-04",90,null,null,null,12310,null,374,{"$f":"IF(F188=\"\",\"\",IF(ISERROR(VLOOKUP(F188,Kontoplan!A:D,2,0)),\"Konto findes ikke!\",VLOOKUP(F188,Kontoplan!A:D,2,0)))","v":"Bank konto"}]
["2021-06-04",90,null,null,null,2065,374,null,{"$f":"IF(F189=\"\",\"\",IF(ISERROR(VLOOKUP(F189,Kontoplan!A:D,2,0)),\"Konto findes ikke!\",VLOOKUP(F189,Kontoplan!A:D,2,0)))","v":"Udstilling"}]
["2021-06-08",91,null,null,null,12310,2323.73,null,{"$f":"IF(F190=\"\",\"\",IF(ISERROR(VLOOKUP(F190,Kontoplan!A:D,2,0)),\"Konto findes ikke!\",VLOOKUP(F190,Kontoplan!A:D,2,0)))","v":"Bank konto"}]
["2021-06-08",91,null,null,null,1000,null,2323.73,{"$f":"IF(F191=\"\",\"\",IF(ISERROR(VLOOKUP(F191,Kontoplan!A:D,2,0)),\"Konto findes ikke!\",VLOOKUP(F191,Kontoplan!A:D,2,0)))","v":"Entre"}]
["2021-06-08",92,null,null,null,12310,1200,null,{"$f":"IF(F192=\"\",\"\",IF(ISERROR(VLOOKUP(F192,Kontoplan!A:D,2,0)),\"Konto findes ikke!\",VLOOKUP(F192,Kontoplan!A:D,2,0)))","v":"Bank konto"}]
["2021-06-08",92,null,null,null,1000,null,1200,{"$f":"IF(F193=\"\",\"\",IF(ISERROR(VLOOKUP(F193,Kontoplan!A:D,2,0)),\"Konto findes ikke!\",VLOOKUP(F193,Kontoplan!A:D,2,0)))","v":"Entre"}]
["2021-06-09",93,null,null,null,12310,1300,null,{"$f":"IF(F194=\"\",\"\",IF(ISERROR(VLOOKUP(F194,Kontoplan!A:D,2,0)),\"Konto findes ikke!\",VLOOKUP(F194,Kontoplan!A:D,2,0)))","v":"Bank konto"}]
["2021-06-09",93,null,null,null,1130,null,1300,{"$f":"IF(F195=\"\",\"\",IF(ISERROR(VLOOKUP(F195,Kontoplan!A:D,2,0)),\"Konto findes ikke!\",VLOOKUP(F195,Kontoplan!A:D,2,0)))","v":"Diverse Indtægter"}]
["2021-06-09",94,null,null,null,12310,294,null,{"$f":"IF(F196=\"\",\"\",IF(ISERROR(VLOOKUP(F196,Kontoplan!A:D,2,0)),\"Konto findes ikke!\",VLOOKUP(F196,Kontoplan!A:D,2,0)))","v":"Bank konto"}]
["2021-06-09",94,null,null,null,1130,null,294,{"$f":"IF(F197=\"\",\"\",IF(ISERROR(VLOOKUP(F197,Kontoplan!A:D,2,0)),\"Konto findes ikke!\",VLOOKUP(F197,Kontoplan!A:D,2,0)))","v":"Diverse Indtægter"}]
["2021-06-09",95,null,null,null,12310,null,208.78,{"$f":"IF(F198=\"\",\"\",IF(ISERROR(VLOOKUP(F198,Kontoplan!A:D,2,0)),\"Konto findes ikke!\",VLOOKUP(F198,Kontoplan!A:D,2,0)))","v":"Bank konto"}]
["2021-06-09",95,null,null,null,2110,208.78,null,{"$f":"IF(F199=\"\",\"\",IF(ISERROR(VLOOKUP(F199,Kontoplan!A:D,2,0)),\"Konto findes ikke!\",VLOOKUP(F199,Kontoplan!A:D,2,0)))","v":"Kontorhold - Porto - IT"}]
["2021-06-10",96,null,null,null,12310,null,601.1,{"$f":"IF(F200=\"\",\"\",IF(ISERROR(VLOOKUP(F200,Kontoplan!A:D,2,0)),\"Konto findes ikke!\",VLOOKUP(F200,Kontoplan!A:D,2,0)))","v":"Bank konto"}]
["2021-06-10",96,null,null,null,2040,601.1,null,{"$f":"IF(F201=\"\",\"\",IF(ISERROR(VLOOKUP(F201,Kontoplan!A:D,2,0)),\"Konto findes ikke!\",VLOOKUP(F201,Kontoplan!A:D,2,0)))","v":"El, Vand og Varme"}]
["2021-06-15",97,null,null,null,12310,1359.19,null,{"$f":"IF(F202=\"\",\"\",IF(ISERROR(VLOOKUP(F202,Kontoplan!A:D,2,0)),\"Konto findes ikke!\",VLOOKUP(F202,Kontoplan!A:D,2,0)))","v":"Bank konto"}]
["2021-06-15",97,null,null,null,1130,null,1359.19,{"$f":"IF(F203=\"\",\"\",IF(ISERROR(VLOOKUP(F203,Kontoplan!A:D,2,0)),\"Konto findes ikke!\",VLOOKUP(F203,Kontoplan!A:D,2,0)))","v":"Diverse Indtægter"}]
["2021-06-15",98,null,null,null,12310,3054.22,null,{"$f":"IF(F204=\"\",\"\",IF(ISERROR(VLOOKUP(F204,Kontoplan!A:D,2,0)),\"Konto findes ikke!\",VLOOKUP(F204,Kontoplan!A:D,2,0)))","v":"Bank konto"}]
["2021-06-15",98,null,null,null,1000,null,3054.22,{"$f":"IF(F205=\"\",\"\",IF(ISERROR(VLOOKUP(F205,Kontoplan!A:D,2,0)),\"Konto findes ikke!\",VLOOKUP(F205,Kontoplan!A:D,2,0)))","v":"Entre"}]
["2021-06-15",99,null,null,null,12310,350,null,{"$f":"IF(F206=\"\",\"\",IF(ISERROR(VLOOKUP(F206,Kontoplan!A:D,2,0)),\"Konto findes ikke!\",VLOOKUP(F206,Kontoplan!A:D,2,0)))","v":"Bank konto"}]
["2021-06-15",99,null,null,null,1125,null,350,{"$f":"IF(F207=\"\",\"\",IF(ISERROR(VLOOKUP(F207,Kontoplan!A:D,2,0)),\"Konto findes ikke!\",VLOOKUP(F207,Kontoplan!A:D,2,0)))","v":"Salg af inventar"}]
["2021-06-16",100,null,null,null,12310,null,115.85,{"$f":"IF(F208=\"\",\"\",IF(ISERROR(VLOOKUP(F208,Kontoplan!A:D,2,0)),\"Konto findes ikke!\",VLOOKUP(F208,Kontoplan!A:D,2,0)))","v":"Bank konto"}]
["2021-06-16",100,null,null,null,2055,115.85,null,{"$f":"IF(F209=\"\",\"\",IF(ISERROR(VLOOKUP(F209,Kontoplan!A:D,2,0)),\"Konto findes ikke!\",VLOOKUP(F209,Kontoplan!A:D,2,0)))","v":"Indkøb af øl + vand"}]
["2021-06-16",101,null,null,null,12320,null,543,{"$f":"IF(F210=\"\",\"\",IF(ISERROR(VLOOKUP(F210,Kontoplan!A:D,2,0)),\"Konto findes ikke!\",VLOOKUP(F210,Kontoplan!A:D,2,0)))","v":"Kasse"}]
["2021-06-16",101,null,null,null,2140,543,null,{"$f":"IF(F211=\"\",\"\",IF(ISERROR(VLOOKUP(F211,Kontoplan!A:D,2,0)),\"Konto findes ikke!\",VLOOKUP(F211,Kontoplan!A:D,2,0)))","v":"Kassedifferance"},"Opgørelse af kassen ved start af kasserapport"]
["2021-06-16",102,null,null,null,1010,null,204,{"$f":"IF(F212=\"\",\"\",IF(ISERROR(VLOOKUP(F212,Kontoplan!A:D,2,0)),\"Konto findes ikke!\",VLOOKUP(F212,Kontoplan!A:D,2,0)))","v":"Kiosk salg"}]
["2021-06-16",102,null,null,null,12320,204,null,{"$f":"IF(F213=\"\",\"\",IF(ISERROR(VLOOKUP(F213,Kontoplan!A:D,2,0)),\"Konto findes ikke!\",VLOOKUP(F213,Kontoplan!A:D,2,0)))","v":"Kasse"}]
["2021-06-17",103,null,null,null,12310,null,1500,{"$f":"IF(F214=\"\",\"\",IF(ISERROR(VLOOKUP(F214,Kontoplan!A:D,2,0)),\"Konto findes ikke!\",VLOOKUP(F214,Kontoplan!A:D,2,0)))","v":"Bank konto"}]
["2021-06-17",103,null,null,null,2090,1500,null,{"$f":"IF(F215=\"\",\"\",IF(ISERROR(VLOOKUP(F215,Kontoplan!A:D,2,0)),\"Konto findes ikke!\",VLOOKUP(F215,Kontoplan!A:D,2,0)))","v":"Kontingent til andre Foreninger"}]
["2021-06-17",104,null,null,null,1010,null,280,{"$f":"IF(F216=\"\",\"\",IF(ISERROR(VLOOKUP(F216,Kontoplan!A:D,2,0)),\"Konto findes ikke!\",VLOOKUP(F216,Kontoplan!A:D,2,0)))","v":"Kiosk salg"}]
["2021-06-17",104,null,null,null,12320,280,null,{"$f":"IF(F217=\"\",\"\",IF(ISERROR(VLOOKUP(F217,Kontoplan!A:D,2,0)),\"Konto findes ikke!\",VLOOKUP(F217,Kontoplan!A:D,2,0)))","v":"Kasse"}]
["2021-06-18",105,null,null,null,1010,null,125,{"$f":"IF(F218=\"\",\"\",IF(ISERROR(VLOOKUP(F218,Kontoplan!A:D,2,0)),\"Konto findes ikke!\",VLOOKUP(F218,Kontoplan!A:D,2,0)))","v":"Kiosk salg"}]
["2021-06-18",105,null,null,null,12320,125,null,{"$f":"IF(F219=\"\",\"\",IF(ISERROR(VLOOKUP(F219,Kontoplan!A:D,2,0)),\"Konto findes ikke!\",VLOOKUP(F219,Kontoplan!A:D,2,0)))","v":"Kasse"}]
["2021-06-19",106,null,null,null,1010,null,560,{"$f":"IF(F220=\"\",\"\",IF(ISERROR(VLOOKUP(F220,Kontoplan!A:D,2,0)),\"Konto findes ikke!\",VLOOKUP(F220,Kontoplan!A:D,2,0)))","v":"Kiosk salg"}]
["2021-06-19",106,null,null,null,12320,560,null,{"$f":"IF(F221=\"\",\"\",IF(ISERROR(VLOOKUP(F221,Kontoplan!A:D,2,0)),\"Konto findes ikke!\",VLOOKUP(F221,Kontoplan!A:D,2,0)))","v":"Kasse"}]
["2021-06-22",107,null,null,null,12310,2529.62,null,{"$f":"IF(F222=\"\",\"\",IF(ISERROR(VLOOKUP(F222,Kontoplan!A:D,2,0)),\"Konto findes ikke!\",VLOOKUP(F222,Kontoplan!A:D,2,0)))","v":"Bank konto"}]
["2021-06-22",107,null,null,null,1000,null,2529.62,{"$f":"IF(F223=\"\",\"\",IF(ISERROR(VLOOKUP(F223,Kontoplan!A:D,2,0)),\"Konto findes ikke!\",VLOOKUP(F223,Kontoplan!A:D,2,0)))","v":"Entre"}]
["2021-06-23",108,null,null,null,12320,235,null,{"$f":"IF(F224=\"\",\"\",IF(ISERROR(VLOOKUP(F224,Kontoplan!A:D,2,0)),\"Konto findes ikke!\",VLOOKUP(F224,Kontoplan!A:D,2,0)))","v":"Kasse"}]
["2021-06-23",108,null,null,null,1010,null,235,{"$f":"IF(F225=\"\",\"\",IF(ISERROR(VLOOKUP(F225,Kontoplan!A:D,2,0)),\"Konto findes ikke!\",VLOOKUP(F225,Kontoplan!A:D,2,0)))","v":"Kiosk salg"}]
["2021-06-23",109,null,null,null,12310,null,828.75,{"$f":"IF(F226=\"\",\"\",IF(ISERROR(VLOOKUP(F226,Kontoplan!A:D,2,0)),\"Konto findes ikke!\",VLOOKUP(F226,Kontoplan!A:D,2,0)))","v":"Bank konto"}]
["2021-06-23",109,null,null,null,2070,828.75,null,{"$f":"IF(F227=\"\",\"\",IF(ISERROR(VLOOKUP(F227,Kontoplan!A:D,2,0)),\"Konto findes ikke!\",VLOOKUP(F227,Kontoplan!A:D,2,0)))","v":"Tin og sortkrudt"}]
["2021-06-24",110,null,null,null,12320,410,null,{"$f":"IF(F228=\"\",\"\",IF(ISERROR(VLOOKUP(F228,Kontoplan!A:D,2,0)),\"Konto findes ikke!\",VLOOKUP(F228,Kontoplan!A:D,2,0)))","v":"Kasse"}]
["2021-06-24",110,null,null,null,1010,null,410,{"$f":"IF(F229=\"\",\"\",IF(ISERROR(VLOOKUP(F229,Kontoplan!A:D,2,0)),\"Konto findes ikke!\",VLOOKUP(F229,Kontoplan!A:D,2,0)))","v":"Kiosk salg"}]
["2021-06-25",111,null,null,null,12320,805,null,{"$f":"IF(F230=\"\",\"\",IF(ISERROR(VLOOKUP(F230,Kontoplan!A:D,2,0)),\"Konto findes ikke!\",VLOOKUP(F230,Kontoplan!A:D,2,0)))","v":"Kasse"}]
["2021-06-25",111,null,null,null,1010,null,805,{"$f":"IF(F231=\"\",\"\",IF(ISERROR(VLOOKUP(F231,Kontoplan!A:D,2,0)),\"Konto findes ikke!\",VLOOKUP(F231,Kontoplan!A:D,2,0)))","v":"Kiosk salg"}]
["2021-06-26",112,null,null,null,12320,520,null,{"$f":"IF(F232=\"\",\"\",IF(ISERROR(VLOOKUP(F232,Kontoplan!A:D,2,0)),\"Konto findes ikke!\",VLOOKUP(F232,Kontoplan!A:D,2,0)))","v":"Kasse"}]
["2021-06-26",112,null,null,null,1010,null,520,{"$f":"IF(F233=\"\",\"\",IF(ISERROR(VLOOKUP(F233,Kontoplan!A:D,2,0)),\"Konto findes ikke!\",VLOOKUP(F233,Kontoplan!A:D,2,0)))","v":"Kiosk salg"}]
["2021-06-29",113,null,null,null,12310,4279.7700000000004,null,{"$f":"IF(F234=\"\",\"\",IF(ISERROR(VLOOKUP(F234,Kontoplan!A:D,2,0)),\"Konto findes ikke!\",VLOOKUP(F234,Kontoplan!A:D,2,0)))","v":"Bank konto"}]
["2021-06-29",113,null,null,null,1000,null,4279.7700000000004,{"$f":"IF(F235=\"\",\"\",IF(ISERROR(VLOOKUP(F235,Kontoplan!A:D,2,0)),\"Konto findes ikke!\",VLOOKUP(F235,Kontoplan!A:D,2,0)))","v":"Entre"}]
["2021-06-30",114,null,null,null,12310,null,1351.74,{"$f":"IF(F236=\"\",\"\",IF(ISERROR(VLOOKUP(F236,Kontoplan!A:D,2,0)),\"Konto findes ikke!\",VLOOKUP(F236,Kontoplan!A:D,2,0)))","v":"Bank konto"}]
["2021-06-30",114,null,null,null,2030,1351.74,null,{"$f":"IF(F237=\"\",\"\",IF(ISERROR(VLOOKUP(F237,Kontoplan!A:D,2,0)),\"Konto findes ikke!\",VLOOKUP(F237,Kontoplan!A:D,2,0)))","v":"Bygnings vedligehold"}]
["2021-06-30",115,null,null,null,12310,null,300,{"$f":"IF(F238=\"\",\"\",IF(ISERROR(VLOOKUP(F238,Kontoplan!A:D,2,0)),\"Konto findes ikke!\",VLOOKUP(F238,Kontoplan!A:D,2,0)))","v":"Bank konto"}]
["2021-06-30",115,null,null,null,2200,300,null,{"$f":"IF(F239=\"\",\"\",IF(ISERROR(VLOOKUP(F239,Kontoplan!A:D,2,0)),\"Konto findes ikke!\",VLOOKUP(F239,Kontoplan!A:D,2,0)))","v":"Kontingenter overført til KVB"}]
["2021-06-30",116,null,null,null,12320,317,null,{"$f":"IF(F240=\"\",\"\",IF(ISERROR(VLOOKUP(F240,Kontoplan!A:D,2,0)),\"Konto findes ikke!\",VLOOKUP(F240,Kontoplan!A:D,2,0)))","v":"Kasse"}]
["2021-06-30",116,null,null,null,1010,null,317,{"$f":"IF(F241=\"\",\"\",IF(ISERROR(VLOOKUP(F241,Kontoplan!A:D,2,0)),\"Konto findes ikke!\",VLOOKUP(F241,Kontoplan!A:D,2,0)))","v":"Kiosk salg"}]
["2021-07-01",117,null,null,null,12310,null,105.5,{"$f":"IF(F242=\"\",\"\",IF(ISERROR(VLOOKUP(F242,Kontoplan!A:D,2,0)),\"Konto findes ikke!\",VLOOKUP(F242,Kontoplan!A:D,2,0)))","v":"Bank konto"}]
["2021-07-01",117,null,null,null,2000,105.5,null,{"$f":"IF(F243=\"\",\"\",IF(ISERROR(VLOOKUP(F243,Kontoplan!A:D,2,0)),\"Konto findes ikke!\",VLOOKUP(F243,Kontoplan!A:D,2,0)))","v":"Bankgebyr"}]
["2021-07-01",118,null,null,null,12310,null,414,{"$f":"IF(F244=\"\",\"\",IF(ISERROR(VLOOKUP(F244,Kontoplan!A:D,2,0)),\"Konto findes ikke!\",VLOOKUP(F244,Kontoplan!A:D,2,0)))","v":"Bank konto"}]
["2021-07-01",118,null,null,null,2060,414,null,{"$f":"IF(F245=\"\",\"\",IF(ISERROR(VLOOKUP(F245,Kontoplan!A:D,2,0)),\"Konto findes ikke!\",VLOOKUP(F245,Kontoplan!A:D,2,0)))","v":"Internet, mobiltelefon, Forsik."}]
["2021-07-01",119,null,null,null,12310,null,192.5,{"$f":"IF(F246=\"\",\"\",IF(ISERROR(VLOOKUP(F246,Kontoplan!A:D,2,0)),\"Konto findes ikke!\",VLOOKUP(F246,Kontoplan!A:D,2,0)))","v":"Bank konto"}]
["2021-07-01",119,null,null,null,2010,192.5,null,{"$f":"IF(F247=\"\",\"\",IF(ISERROR(VLOOKUP(F247,Kontoplan!A:D,2,0)),\"Konto findes ikke!\",VLOOKUP(F247,Kontoplan!A:D,2,0)))","v":"Danløn"}]
["2021-07-01",120,null,null,null,12320,410,null,{"$f":"IF(F248=\"\",\"\",IF(ISERROR(VLOOKUP(F248,Kontoplan!A:D,2,0)),\"Konto findes ikke!\",VLOOKUP(F248,Kontoplan!A:D,2,0)))","v":"Kasse"}]
["2021-07-01",120,null,null,null,1010,null,410,{"$f":"IF(F249=\"\",\"\",IF(ISERROR(VLOOKUP(F249,Kontoplan!A:D,2,0)),\"Konto findes ikke!\",VLOOKUP(F249,Kontoplan!A:D,2,0)))","v":"Kiosk salg"}]
["2021-07-02",121,null,null,null,12320,430,null,{"$f":"IF(F250=\"\",\"\",IF(ISERROR(VLOOKUP(F250,Kontoplan!A:D,2,0)),\"Konto findes ikke!\",VLOOKUP(F250,Kontoplan!A:D,2,0)))","v":"Kasse"}]
["2021-07-02",121,null,null,null,1010,null,430,{"$f":"IF(F251=\"\",\"\",IF(ISERROR(VLOOKUP(F251,Kontoplan!A:D,2,0)),\"Konto findes ikke!\",VLOOKUP(F251,Kontoplan!A:D,2,0)))","v":"Kiosk salg"}]
["2021-07-02",122,null,null,null,12320,null,3346,{"$f":"IF(F252=\"\",\"\",IF(ISERROR(VLOOKUP(F252,Kontoplan!A:D,2,0)),\"Konto findes ikke!\",VLOOKUP(F252,Kontoplan!A:D,2,0)))","v":"Kasse"}]
["2021-07-02",122,null,null,null,12310,3346,null,{"$f":"IF(F253=\"\",\"\",IF(ISERROR(VLOOKUP(F253,Kontoplan!A:D,2,0)),\"Konto findes ikke!\",VLOOKUP(F253,Kontoplan!A:D,2,0)))","v":"Bank konto"}]
["2021-07-02",123,null,null,null,12310,null,118.35,{"$f":"IF(F254=\"\",\"\",IF(ISERROR(VLOOKUP(F254,Kontoplan!A:D,2,0)),\"Konto findes ikke!\",VLOOKUP(F254,Kontoplan!A:D,2,0)))","v":"Bank konto"}]
["2021-07-02",123,null,null,null,2055,118.35,null,{"$f":"IF(F255=\"\",\"\",IF(ISERROR(VLOOKUP(F255,Kontoplan!A:D,2,0)),\"Konto findes ikke!\",VLOOKUP(F255,Kontoplan!A:D,2,0)))","v":"Indkøb af øl + vand"}]
["2021-07-03",124,null,null,null,12310,null,360.94,{"$f":"IF(F256=\"\",\"\",IF(ISERROR(VLOOKUP(F256,Kontoplan!A:D,2,0)),\"Konto findes ikke!\",VLOOKUP(F256,Kontoplan!A:D,2,0)))","v":"Bank konto"}]
["2021-07-03",124,null,null,null,2025,360.94,null,{"$f":"IF(F257=\"\",\"\",IF(ISERROR(VLOOKUP(F257,Kontoplan!A:D,2,0)),\"Konto findes ikke!\",VLOOKUP(F257,Kontoplan!A:D,2,0)))","v":"Regnskabsservice"}]
["2021-07-03",125,null,null,null,12320,330,null,{"$f":"IF(F258=\"\",\"\",IF(ISERROR(VLOOKUP(F258,Kontoplan!A:D,2,0)),\"Konto findes ikke!\",VLOOKUP(F258,Kontoplan!A:D,2,0)))","v":"Kasse"}]
["2021-07-03",125,null,null,null,1010,null,330,{"$f":"IF(F259=\"\",\"\",IF(ISERROR(VLOOKUP(F259,Kontoplan!A:D,2,0)),\"Konto findes ikke!\",VLOOKUP(F259,Kontoplan!A:D,2,0)))","v":"Kiosk salg"}]
["2021-07-05",126,null,null,null,12310,null,19,{"$f":"IF(F260=\"\",\"\",IF(ISERROR(VLOOKUP(F260,Kontoplan!A:D,2,0)),\"Konto findes ikke!\",VLOOKUP(F260,Kontoplan!A:D,2,0)))","v":"Bank konto"}]
["2021-07-05",126,null,null,null,2060,19,null,{"$f":"IF(F261=\"\",\"\",IF(ISERROR(VLOOKUP(F261,Kontoplan!A:D,2,0)),\"Konto findes ikke!\",VLOOKUP(F261,Kontoplan!A:D,2,0)))","v":"Internet, mobiltelefon, Forsik."}]
["2021-07-06",127,null,null,null,12310,9995.14,null,{"$f":"IF(F262=\"\",\"\",IF(ISERROR(VLOOKUP(F262,Kontoplan!A:D,2,0)),\"Konto findes ikke!\",VLOOKUP(F262,Kontoplan!A:D,2,0)))","v":"Bank konto"}]
["2021-07-06",127,null,null,null,1000,null,9995.14,{"$f":"IF(F263=\"\",\"\",IF(ISERROR(VLOOKUP(F263,Kontoplan!A:D,2,0)),\"Konto findes ikke!\",VLOOKUP(F263,Kontoplan!A:D,2,0)))","v":"Entre"}]
["2021-07-06",128,null,null,null,12310,null,6230.35,{"$f":"IF(F264=\"\",\"\",IF(ISERROR(VLOOKUP(F264,Kontoplan!A:D,2,0)),\"Konto findes ikke!\",VLOOKUP(F264,Kontoplan!A:D,2,0)))","v":"Bank konto"}]
["2021-07-06",128,null,null,null,3110,6230.35,null,{"$f":"IF(F265=\"\",\"\",IF(ISERROR(VLOOKUP(F265,Kontoplan!A:D,2,0)),\"Konto findes ikke!\",VLOOKUP(F265,Kontoplan!A:D,2,0)))","v":"Lønninger incl ATP -AM"}]
["2021-07-07",129,null,null,null,12320,860,null,{"$f":"IF(F266=\"\",\"\",IF(ISERROR(VLOOKUP(F266,Kontoplan!A:D,2,0)),\"Konto findes ikke!\",VLOOKUP(F266,Kontoplan!A:D,2,0)))","v":"Kasse"}]
["2021-07-07",129,null,null,null,1010,null,860,{"$f":"IF(F267=\"\",\"\",IF(ISERROR(VLOOKUP(F267,Kontoplan!A:D,2,0)),\"Konto findes ikke!\",VLOOKUP(F267,Kontoplan!A:D,2,0)))","v":"Kiosk salg"}]
["2021-07-08",130,null,null,null,12320,345,null,{"$f":"IF(F268=\"\",\"\",IF(ISERROR(VLOOKUP(F268,Kontoplan!A:D,2,0)),\"Konto findes ikke!\",VLOOKUP(F268,Kontoplan!A:D,2,0)))","v":"Kasse"}]
["2021-07-08",130,null,null,null,1010,null,345,{"$f":"IF(F269=\"\",\"\",IF(ISERROR(VLOOKUP(F269,Kontoplan!A:D,2,0)),\"Konto findes ikke!\",VLOOKUP(F269,Kontoplan!A:D,2,0)))","v":"Kiosk salg"}]
["2021-07-08",131,null,null,null,12310,null,1401.19,{"$f":"IF(F270=\"\",\"\",IF(ISERROR(VLOOKUP(F270,Kontoplan!A:D,2,0)),\"Konto findes ikke!\",VLOOKUP(F270,Kontoplan!A:D,2,0)))","v":"Bank konto"}]
["2021-07-08",131,null,null,null,2165,1401.19,null,{"$f":"IF(F271=\"\",\"\",IF(ISERROR(VLOOKUP(F271,Kontoplan!A:D,2,0)),\"Konto findes ikke!\",VLOOKUP(F271,Kontoplan!A:D,2,0)))","v":"G4S tyverialarm"}]
["2021-07-08",132,null,null,null,12310,null,150,{"$f":"IF(F272=\"\",\"\",IF(ISERROR(VLOOKUP(F272,Kontoplan!A:D,2,0)),\"Konto findes ikke!\",VLOOKUP(F272,Kontoplan!A:D,2,0)))","v":"Bank konto"}]
["2021-07-08",132,null,null,null,2060,150,null,{"$f":"IF(F273=\"\",\"\",IF(ISERROR(VLOOKUP(F273,Kontoplan!A:D,2,0)),\"Konto findes ikke!\",VLOOKUP(F273,Kontoplan!A:D,2,0)))","v":"Internet, mobiltelefon, Forsik."}]
["2021-07-09",133,null,null,null,12320,185,null,{"$f":"IF(F274=\"\",\"\",IF(ISERROR(VLOOKUP(F274,Kontoplan!A:D,2,0)),\"Konto findes ikke!\",VLOOKUP(F274,Kontoplan!A:D,2,0)))","v":"Kasse"}]
["2021-07-09",133,null,null,null,1010,null,185,{"$f":"IF(F275=\"\",\"\",IF(ISERROR(VLOOKUP(F275,Kontoplan!A:D,2,0)),\"Konto findes ikke!\",VLOOKUP(F275,Kontoplan!A:D,2,0)))","v":"Kiosk salg"}]
["2021-07-10",134,null,null,null,12310,null,300,{"$f":"IF(F276=\"\",\"\",IF(ISERROR(VLOOKUP(F276,Kontoplan!A:D,2,0)),\"Konto findes ikke!\",VLOOKUP(F276,Kontoplan!A:D,2,0)))","v":"Bank konto"}]
["2021-07-10",134,null,null,null,2200,300,null,{"$f":"IF(F277=\"\",\"\",IF(ISERROR(VLOOKUP(F277,Kontoplan!A:D,2,0)),\"Konto findes ikke!\",VLOOKUP(F277,Kontoplan!A:D,2,0)))","v":"Kontingenter overført til KVB"}]
["2021-07-10",135,null,null,null,12310,null,150,{"$f":"IF(F278=\"\",\"\",IF(ISERROR(VLOOKUP(F278,Kontoplan!A:D,2,0)),\"Konto findes ikke!\",VLOOKUP(F278,Kontoplan!A:D,2,0)))","v":"Bank konto"}]
["2021-07-10",135,null,null,null,2200,150,null,{"$f":"IF(F279=\"\",\"\",IF(ISERROR(VLOOKUP(F279,Kontoplan!A:D,2,0)),\"Konto findes ikke!\",VLOOKUP(F279,Kontoplan!A:D,2,0)))","v":"Kontingenter overført til KVB"}]
["2021-07-10",136,null,null,null,12320,830,null,{"$f":"IF(F280=\"\",\"\",IF(ISERROR(VLOOKUP(F280,Kontoplan!A:D,2,0)),\"Konto findes ikke!\",VLOOKUP(F280,Kontoplan!A:D,2,0)))","v":"Kasse"}]
["2021-07-10",136,null,null,null,1010,null,830,{"$f":"IF(F281=\"\",\"\",IF(ISERROR(VLOOKUP(F281,Kontoplan!A:D,2,0)),\"Konto findes ikke!\",VLOOKUP(F281,Kontoplan!A:D,2,0)))","v":"Kiosk salg"}]
["2021-07-12",137,null,null,null,12310,null,98.95,{"$f":"IF(F282=\"\",\"\",IF(ISERROR(VLOOKUP(F282,Kontoplan!A:D,2,0)),\"Konto findes ikke!\",VLOOKUP(F282,Kontoplan!A:D,2,0)))","v":"Bank konto"}]
["2021-07-12",137,null,null,null,2190,98.95,null,{"$f":"IF(F283=\"\",\"\",IF(ISERROR(VLOOKUP(F283,Kontoplan!A:D,2,0)),\"Konto findes ikke!\",VLOOKUP(F283,Kontoplan!A:D,2,0)))","v":"Diverse Udgifter"}]
["2021-07-13",138,null,null,null,12310,20438.259999999998,null,{"$f":"IF(F284=\"\",\"\",IF(ISERROR(VLOOKUP(F284,Kontoplan!A:D,2,0)),\"Konto findes ikke!\",VLOOKUP(F284,Kontoplan!A:D,2,0)))","v":"Bank konto"}]
["2021-07-13",138,null,null,null,1000,null,20438.259999999998,{"$f":"IF(F285=\"\",\"\",IF(ISERROR(VLOOKUP(F285,Kontoplan!A:D,2,0)),\"Konto findes ikke!\",VLOOKUP(F285,Kontoplan!A:D,2,0)))","v":"Entre"}]
["2021-07-13",139,null,null,null,12310,null,150,{"$f":"IF(F286=\"\",\"\",IF(ISERROR(VLOOKUP(F286,Kontoplan!A:D,2,0)),\"Konto findes ikke!\",VLOOKUP(F286,Kontoplan!A:D,2,0)))","v":"Bank konto"}]
["2021-07-13",139,null,null,null,2060,150,null,{"$f":"IF(F287=\"\",\"\",IF(ISERROR(VLOOKUP(F287,Kontoplan!A:D,2,0)),\"Konto findes ikke!\",VLOOKUP(F287,Kontoplan!A:D,2,0)))","v":"Internet, mobiltelefon, Forsik."}]
["2021-07-14",140,null,null,null,12310,null,46.25,{"$f":"IF(F288=\"\",\"\",IF(ISERROR(VLOOKUP(F288,Kontoplan!A:D,2,0)),\"Konto findes ikke!\",VLOOKUP(F288,Kontoplan!A:D,2,0)))","v":"Bank konto"}]
["2021-07-14",140,null,null,null,2037,46.25,null,{"$f":"IF(F289=\"\",\"\",IF(ISERROR(VLOOKUP(F289,Kontoplan!A:D,2,0)),\"Konto findes ikke!\",VLOOKUP(F289,Kontoplan!A:D,2,0)))","v":"Rengørringsartikler"}]
["2021-07-14",141,null,null,null,12320,1348,null,{"$f":"IF(F290=\"\",\"\",IF(ISERROR(VLOOKUP(F290,Kontoplan!A:D,2,0)),\"Konto findes ikke!\",VLOOKUP(F290,Kontoplan!A:D,2,0)))","v":"Kasse"}]
["2021-07-14",141,null,null,null,1010,null,1348,{"$f":"IF(F291=\"\",\"\",IF(ISERROR(VLOOKUP(F291,Kontoplan!A:D,2,0)),\"Konto findes ikke!\",VLOOKUP(F291,Kontoplan!A:D,2,0)))","v":"Kiosk salg"}]
["2021-07-15",142,null,null,null,12320,383,null,{"$f":"IF(F292=\"\",\"\",IF(ISERROR(VLOOKUP(F292,Kontoplan!A:D,2,0)),\"Konto findes ikke!\",VLOOKUP(F292,Kontoplan!A:D,2,0)))","v":"Kasse"}]
["2021-07-15",142,null,null,null,1010,null,383,{"$f":"IF(F293=\"\",\"\",IF(ISERROR(VLOOKUP(F293,Kontoplan!A:D,2,0)),\"Konto findes ikke!\",VLOOKUP(F293,Kontoplan!A:D,2,0)))","v":"Kiosk salg"}]
["2021-07-15",143,null,null,null,12310,4056,null,{"$f":"IF(F294=\"\",\"\",IF(ISERROR(VLOOKUP(F294,Kontoplan!A:D,2,0)),\"Konto findes ikke!\",VLOOKUP(F294,Kontoplan!A:D,2,0)))","v":"Bank konto"}]
["2021-07-15",143,null,null,null,12320,null,4056,{"$f":"IF(F295=\"\",\"\",IF(ISERROR(VLOOKUP(F295,Kontoplan!A:D,2,0)),\"Konto findes ikke!\",VLOOKUP(F295,Kontoplan!A:D,2,0)))","v":"Kasse"}]
["2021-07-15",144,null,null,null,12310,null,132.55000000000001,{"$f":"IF(F296=\"\",\"\",IF(ISERROR(VLOOKUP(F296,Kontoplan!A:D,2,0)),\"Konto findes ikke!\",VLOOKUP(F296,Kontoplan!A:D,2,0)))","v":"Bank konto"}]
["2021-07-15",144,null,null,null,2055,132.55000000000001,null,{"$f":"IF(F297=\"\",\"\",IF(ISERROR(VLOOKUP(F297,Kontoplan!A:D,2,0)),\"Konto findes ikke!\",VLOOKUP(F297,Kontoplan!A:D,2,0)))","v":"Indkøb af øl + vand"}]
["2021-07-16",145,null,null,null,12320,130,null,{"$f":"IF(F298=\"\",\"\",IF(ISERROR(VLOOKUP(F298,Kontoplan!A:D,2,0)),\"Konto findes ikke!\",VLOOKUP(F298,Kontoplan!A:D,2,0)))","v":"Kasse"}]
["2021-07-16",145,null,null,null,1010,null,130,{"$f":"IF(F299=\"\",\"\",IF(ISERROR(VLOOKUP(F299,Kontoplan!A:D,2,0)),\"Konto findes ikke!\",VLOOKUP(F299,Kontoplan!A:D,2,0)))","v":"Kiosk salg"}]
["2021-07-17",146,null,null,null,12320,10,null,{"$f":"IF(F300=\"\",\"\",IF(ISERROR(VLOOKUP(F300,Kontoplan!A:D,2,0)),\"Konto findes ikke!\",VLOOKUP(F300,Kontoplan!A:D,2,0)))","v":"Kasse"}]
["2021-07-17",146,null,null,null,1010,null,10,{"$f":"IF(F301=\"\",\"\",IF(ISERROR(VLOOKUP(F301,Kontoplan!A:D,2,0)),\"Konto findes ikke!\",VLOOKUP(F301,Kontoplan!A:D,2,0)))","v":"Kiosk salg"}]
["2021-07-19",147,null,null,null,12310,null,44,{"$f":"IF(F302=\"\",\"\",IF(ISERROR(VLOOKUP(F302,Kontoplan!A:D,2,0)),\"Konto findes ikke!\",VLOOKUP(F302,Kontoplan!A:D,2,0)))","v":"Bank konto"}]
["2021-07-19",147,null,null,null,2110,44,null,{"$f":"IF(F303=\"\",\"\",IF(ISERROR(VLOOKUP(F303,Kontoplan!A:D,2,0)),\"Konto findes ikke!\",VLOOKUP(F303,Kontoplan!A:D,2,0)))","v":"Kontorhold - Porto - IT"}]
["2021-07-20",148,null,null,null,12310,9647.9500000000007,null,{"$f":"IF(F304=\"\",\"\",IF(ISERROR(VLOOKUP(F304,Kontoplan!A:D,2,0)),\"Konto findes ikke!\",VLOOKUP(F304,Kontoplan!A:D,2,0)))","v":"Bank konto"}]
["2021-07-20",148,null,null,null,1000,null,9647.9500000000007,{"$f":"IF(F305=\"\",\"\",IF(ISERROR(VLOOKUP(F305,Kontoplan!A:D,2,0)),\"Konto findes ikke!\",VLOOKUP(F305,Kontoplan!A:D,2,0)))","v":"Entre"}]
["2021-07-21",149,null,null,null,12310,null,150,{"$f":"IF(F306=\"\",\"\",IF(ISERROR(VLOOKUP(F306,Kontoplan!A:D,2,0)),\"Konto findes ikke!\",VLOOKUP(F306,Kontoplan!A:D,2,0)))","v":"Bank konto"}]
["2021-07-21",149,null,null,null,2060,150,null,{"$f":"IF(F307=\"\",\"\",IF(ISERROR(VLOOKUP(F307,Kontoplan!A:D,2,0)),\"Konto findes ikke!\",VLOOKUP(F307,Kontoplan!A:D,2,0)))","v":"Internet, mobiltelefon, Forsik."}]
["2021-07-21",150,null,null,null,12320,1400,null,{"$f":"IF(F308=\"\",\"\",IF(ISERROR(VLOOKUP(F308,Kontoplan!A:D,2,0)),\"Konto findes ikke!\",VLOOKUP(F308,Kontoplan!A:D,2,0)))","v":"Kasse"}]
["2021-07-21",150,null,null,null,1010,null,1400,{"$f":"IF(F309=\"\",\"\",IF(ISERROR(VLOOKUP(F309,Kontoplan!A:D,2,0)),\"Konto findes ikke!\",VLOOKUP(F309,Kontoplan!A:D,2,0)))","v":"Kiosk salg"}]
["2021-07-22",151,null,null,null,12310,null,1664.79,{"$f":"IF(F310=\"\",\"\",IF(ISERROR(VLOOKUP(F310,Kontoplan!A:D,2,0)),\"Konto findes ikke!\",VLOOKUP(F310,Kontoplan!A:D,2,0)))","v":"Bank konto"}]
["2021-07-22",151,null,null,null,2110,1664.79,null,{"$f":"IF(F311=\"\",\"\",IF(ISERROR(VLOOKUP(F311,Kontoplan!A:D,2,0)),\"Konto findes ikke!\",VLOOKUP(F311,Kontoplan!A:D,2,0)))","v":"Kontorhold - Porto - IT"}]
["2021-07-22",152,null,null,null,12310,null,482.41,{"$f":"IF(F312=\"\",\"\",IF(ISERROR(VLOOKUP(F312,Kontoplan!A:D,2,0)),\"Konto findes ikke!\",VLOOKUP(F312,Kontoplan!A:D,2,0)))","v":"Bank konto"}]
["2021-07-22",152,null,null,null,2080,482.41,null,{"$f":"IF(F313=\"\",\"\",IF(ISERROR(VLOOKUP(F313,Kontoplan!A:D,2,0)),\"Konto findes ikke!\",VLOOKUP(F313,Kontoplan!A:D,2,0)))","v":"Indkøb af bøger"}]
["2021-07-22",153,null,null,null,12310,null,2357.04,{"$f":"IF(F314=\"\",\"\",IF(ISERROR(VLOOKUP(F314,Kontoplan!A:D,2,0)),\"Konto findes ikke!\",VLOOKUP(F314,Kontoplan!A:D,2,0)))","v":"Bank konto"}]
["2021-07-22",153,null,null,null,2130,2357.04,null,{"$f":"IF(F315=\"\",\"\",IF(ISERROR(VLOOKUP(F315,Kontoplan!A:D,2,0)),\"Konto findes ikke!\",VLOOKUP(F315,Kontoplan!A:D,2,0)))","v":"Annoncer"}]
["2021-07-22",154,null,null,null,12320,580,null,{"$f":"IF(F316=\"\",\"\",IF(ISERROR(VLOOKUP(F316,Kontoplan!A:D,2,0)),\"Konto findes ikke!\",VLOOKUP(F316,Kontoplan!A:D,2,0)))","v":"Kasse"}]
["2021-07-22",154,null,null,null,1010,null,580,{"$f":"IF(F317=\"\",\"\",IF(ISERROR(VLOOKUP(F317,Kontoplan!A:D,2,0)),\"Konto findes ikke!\",VLOOKUP(F317,Kontoplan!A:D,2,0)))","v":"Kiosk salg"}]
["2021-07-23",155,null,null,null,12320,890,null,{"$f":"IF(F318=\"\",\"\",IF(ISERROR(VLOOKUP(F318,Kontoplan!A:D,2,0)),\"Konto findes ikke!\",VLOOKUP(F318,Kontoplan!A:D,2,0)))","v":"Kasse"}]
["2021-07-23",155,null,null,null,1010,null,890,{"$f":"IF(F319=\"\",\"\",IF(ISERROR(VLOOKUP(F319,Kontoplan!A:D,2,0)),\"Konto findes ikke!\",VLOOKUP(F319,Kontoplan!A:D,2,0)))","v":"Kiosk salg"}]
["2021-07-24",156,null,null,null,12320,1113,null,{"$f":"IF(F320=\"\",\"\",IF(ISERROR(VLOOKUP(F320,Kontoplan!A:D,2,0)),\"Konto findes ikke!\",VLOOKUP(F320,Kontoplan!A:D,2,0)))","v":"Kasse"}]
["2021-07-24",156,null,null,null,1010,null,1113,{"$f":"IF(F321=\"\",\"\",IF(ISERROR(VLOOKUP(F321,Kontoplan!A:D,2,0)),\"Konto findes ikke!\",VLOOKUP(F321,Kontoplan!A:D,2,0)))","v":"Kiosk salg"}]
["2021-07-26",157,null,null,null,12310,null,110.1,{"$f":"IF(F322=\"\",\"\",IF(ISERROR(VLOOKUP(F322,Kontoplan!A:D,2,0)),\"Konto findes ikke!\",VLOOKUP(F322,Kontoplan!A:D,2,0)))","v":"Bank konto"}]
["2021-07-26",157,null,null,null,2060,110.1,null,{"$f":"IF(F323=\"\",\"\",IF(ISERROR(VLOOKUP(F323,Kontoplan!A:D,2,0)),\"Konto findes ikke!\",VLOOKUP(F323,Kontoplan!A:D,2,0)))","v":"Internet, mobiltelefon, Forsik."}]
["2021-07-26",158,null,null,null,12310,null,200,{"$f":"IF(F324=\"\",\"\",IF(ISERROR(VLOOKUP(F324,Kontoplan!A:D,2,0)),\"Konto findes ikke!\",VLOOKUP(F324,Kontoplan!A:D,2,0)))","v":"Bank konto"}]
["2021-07-26",158,null,null,null,2060,200,null,{"$f":"IF(F325=\"\",\"\",IF(ISERROR(VLOOKUP(F325,Kontoplan!A:D,2,0)),\"Konto findes ikke!\",VLOOKUP(F325,Kontoplan!A:D,2,0)))","v":"Internet, mobiltelefon, Forsik."}]
["2021-07-26",159,null,null,null,12310,null,2375,{"$f":"IF(F326=\"\",\"\",IF(ISERROR(VLOOKUP(F326,Kontoplan!A:D,2,0)),\"Konto findes ikke!\",VLOOKUP(F326,Kontoplan!A:D,2,0)))","v":"Bank konto"}]
["2021-07-26",159,null,null,null,2130,2375,null,{"$f":"IF(F327=\"\",\"\",IF(ISERROR(VLOOKUP(F327,Kontoplan!A:D,2,0)),\"Konto findes ikke!\",VLOOKUP(F327,Kontoplan!A:D,2,0)))","v":"Annoncer"}]
["2021-07-26",160,null,null,null,12310,null,500,{"$f":"IF(F328=\"\",\"\",IF(ISERROR(VLOOKUP(F328,Kontoplan!A:D,2,0)),\"Konto findes ikke!\",VLOOKUP(F328,Kontoplan!A:D,2,0)))","v":"Bank konto"}]
["2021-07-26",160,null,null,null,2015,500,null,{"$f":"IF(F329=\"\",\"\",IF(ISERROR(VLOOKUP(F329,Kontoplan!A:D,2,0)),\"Konto findes ikke!\",VLOOKUP(F329,Kontoplan!A:D,2,0)))","v":"Advokat"}]
["2021-07-27",161,null,null,null,12310,12334.56,null,{"$f":"IF(F330=\"\",\"\",IF(ISERROR(VLOOKUP(F330,Kontoplan!A:D,2,0)),\"Konto findes ikke!\",VLOOKUP(F330,Kontoplan!A:D,2,0)))","v":"Bank konto"}]
["2021-07-27",161,null,null,null,1000,null,12334.56,{"$f":"IF(F331=\"\",\"\",IF(ISERROR(VLOOKUP(F331,Kontoplan!A:D,2,0)),\"Konto findes ikke!\",VLOOKUP(F331,Kontoplan!A:D,2,0)))","v":"Entre"}]
["2021-07-28",162,null,null,null,12320,null,5037,{"$f":"IF(F332=\"\",\"\",IF(ISERROR(VLOOKUP(F332,Kontoplan!A:D,2,0)),\"Konto findes ikke!\",VLOOKUP(F332,Kontoplan!A:D,2,0)))","v":"Kasse"}]
["2021-07-28",162,null,null,null,12310,5037,null,{"$f":"IF(F333=\"\",\"\",IF(ISERROR(VLOOKUP(F333,Kontoplan!A:D,2,0)),\"Konto findes ikke!\",VLOOKUP(F333,Kontoplan!A:D,2,0)))","v":"Bank konto"}]
["2021-07-28",163,null,null,null,12310,null,150,{"$f":"IF(F334=\"\",\"\",IF(ISERROR(VLOOKUP(F334,Kontoplan!A:D,2,0)),\"Konto findes ikke!\",VLOOKUP(F334,Kontoplan!A:D,2,0)))","v":"Bank konto"}]
["2021-07-28",163,null,null,null,2200,150,null,{"$f":"IF(F335=\"\",\"\",IF(ISERROR(VLOOKUP(F335,Kontoplan!A:D,2,0)),\"Konto findes ikke!\",VLOOKUP(F335,Kontoplan!A:D,2,0)))","v":"Kontingenter overført til KVB"}]
["2021-07-28",164,null,null,null,12310,null,283.95,{"$f":"IF(F336=\"\",\"\",IF(ISERROR(VLOOKUP(F336,Kontoplan!A:D,2,0)),\"Konto findes ikke!\",VLOOKUP(F336,Kontoplan!A:D,2,0)))","v":"Bank konto"}]
["2021-07-28",164,null,null,null,3120,283.95,null,{"$f":"IF(F337=\"\",\"\",IF(ISERROR(VLOOKUP(F337,Kontoplan!A:D,2,0)),\"Konto findes ikke!\",VLOOKUP(F337,Kontoplan!A:D,2,0)))","v":"ATP"}]
["2021-07-28",165,null,null,null,12320,675,null,{"$f":"IF(F338=\"\",\"\",IF(ISERROR(VLOOKUP(F338,Kontoplan!A:D,2,0)),\"Konto findes ikke!\",VLOOKUP(F338,Kontoplan!A:D,2,0)))","v":"Kasse"}]
["2021-07-28",165,null,null,null,1010,null,675,{"$f":"IF(F339=\"\",\"\",IF(ISERROR(VLOOKUP(F339,Kontoplan!A:D,2,0)),\"Konto findes ikke!\",VLOOKUP(F339,Kontoplan!A:D,2,0)))","v":"Kiosk salg"}]
["2021-07-29",166,null,null,null,12320,320,null,{"$f":"IF(F340=\"\",\"\",IF(ISERROR(VLOOKUP(F340,Kontoplan!A:D,2,0)),\"Konto findes ikke!\",VLOOKUP(F340,Kontoplan!A:D,2,0)))","v":"Kasse"}]
["2021-07-29",166,null,null,null,1010,null,320,{"$f":"IF(F341=\"\",\"\",IF(ISERROR(VLOOKUP(F341,Kontoplan!A:D,2,0)),\"Konto findes ikke!\",VLOOKUP(F341,Kontoplan!A:D,2,0)))","v":"Kiosk salg"}]
["2021-07-29",167,null,null,null,12310,null,56.85,{"$f":"IF(F342=\"\",\"\",IF(ISERROR(VLOOKUP(F342,Kontoplan!A:D,2,0)),\"Konto findes ikke!\",VLOOKUP(F342,Kontoplan!A:D,2,0)))","v":"Bank konto"}]
["2021-07-29",167,null,null,null,2037,56.85,null,{"$f":"IF(F343=\"\",\"\",IF(ISERROR(VLOOKUP(F343,Kontoplan!A:D,2,0)),\"Konto findes ikke!\",VLOOKUP(F343,Kontoplan!A:D,2,0)))","v":"Rengørringsartikler"}]
["2021-07-29",168,null,null,null,12310,null,49.8,{"$f":"IF(F344=\"\",\"\",IF(ISERROR(VLOOKUP(F344,Kontoplan!A:D,2,0)),\"Konto findes ikke!\",VLOOKUP(F344,Kontoplan!A:D,2,0)))","v":"Bank konto"}]
["2021-07-29",168,null,null,null,2055,49.8,null,{"$f":"IF(F345=\"\",\"\",IF(ISERROR(VLOOKUP(F345,Kontoplan!A:D,2,0)),\"Konto findes ikke!\",VLOOKUP(F345,Kontoplan!A:D,2,0)))","v":"Indkøb af øl + vand"}]
["2021-07-30",169,null,null,null,12320,205,null,{"$f":"IF(F346=\"\",\"\",IF(ISERROR(VLOOKUP(F346,Kontoplan!A:D,2,0)),\"Konto findes ikke!\",VLOOKUP(F346,Kontoplan!A:D,2,0)))","v":"Kasse"}]
["2021-07-30",169,null,null,null,1010,null,205,{"$f":"IF(F347=\"\",\"\",IF(ISERROR(VLOOKUP(F347,Kontoplan!A:D,2,0)),\"Konto findes ikke!\",VLOOKUP(F347,Kontoplan!A:D,2,0)))","v":"Kiosk salg"}]
["2021-07-31",170,null,null,null,12320,205,null,{"$f":"IF(F348=\"\",\"\",IF(ISERROR(VLOOKUP(F348,Kontoplan!A:D,2,0)),\"Konto findes ikke!\",VLOOKUP(F348,Kontoplan!A:D,2,0)))","v":"Kasse"}]
["2021-07-31",170,null,null,null,1010,null,205,{"$f":"IF(F349=\"\",\"\",IF(ISERROR(VLOOKUP(F349,Kontoplan!A:D,2,0)),\"Konto findes ikke!\",VLOOKUP(F349,Kontoplan!A:D,2,0)))","v":"Kiosk salg"}]
["2021-08-01",171,null,null,null,12310,null,0.5,{"$f":"IF(F350=\"\",\"\",IF(ISERROR(VLOOKUP(F350,Kontoplan!A:D,2,0)),\"Konto findes ikke!\",VLOOKUP(F350,Kontoplan!A:D,2,0)))","v":"Bank konto"}]
["2021-08-01",171,null,null,null,2000,0.5,null,{"$f":"IF(F351=\"\",\"\",IF(ISERROR(VLOOKUP(F351,Kontoplan!A:D,2,0)),\"Konto findes ikke!\",VLOOKUP(F351,Kontoplan!A:D,2,0)))","v":"Bankgebyr"}]
["2021-08-02",172,null,null,null,12310,null,414,{"$f":"IF(F352=\"\",\"\",IF(ISERROR(VLOOKUP(F352,Kontoplan!A:D,2,0)),\"Konto findes ikke!\",VLOOKUP(F352,Kontoplan!A:D,2,0)))","v":"Bank konto"}]
["2021-08-02",172,null,null,null,2060,414,null,{"$f":"IF(F353=\"\",\"\",IF(ISERROR(VLOOKUP(F353,Kontoplan!A:D,2,0)),\"Konto findes ikke!\",VLOOKUP(F353,Kontoplan!A:D,2,0)))","v":"Internet, mobiltelefon, Forsik."}]
["2021-08-02",173,null,null,null,12310,null,4232.54,{"$f":"IF(F354=\"\",\"\",IF(ISERROR(VLOOKUP(F354,Kontoplan!A:D,2,0)),\"Konto findes ikke!\",VLOOKUP(F354,Kontoplan!A:D,2,0)))","v":"Bank konto"}]
["2021-08-02",173,null,null,null,2040,4232.54,null,{"$f":"IF(F355=\"\",\"\",IF(ISERROR(VLOOKUP(F355,Kontoplan!A:D,2,0)),\"Konto findes ikke!\",VLOOKUP(F355,Kontoplan!A:D,2,0)))","v":"El, Vand og Varme"}]
["2021-08-02",174,null,null,null,12310,null,1617.87,{"$f":"IF(F356=\"\",\"\",IF(ISERROR(VLOOKUP(F356,Kontoplan!A:D,2,0)),\"Konto findes ikke!\",VLOOKUP(F356,Kontoplan!A:D,2,0)))","v":"Bank konto"}]
["2021-08-02",174,null,null,null,2040,1617.87,null,{"$f":"IF(F357=\"\",\"\",IF(ISERROR(VLOOKUP(F357,Kontoplan!A:D,2,0)),\"Konto findes ikke!\",VLOOKUP(F357,Kontoplan!A:D,2,0)))","v":"El, Vand og Varme"}]
["2021-08-02",175,null,null,null,12310,null,192.5,{"$f":"IF(F358=\"\",\"\",IF(ISERROR(VLOOKUP(F358,Kontoplan!A:D,2,0)),\"Konto findes ikke!\",VLOOKUP(F358,Kontoplan!A:D,2,0)))","v":"Bank konto"}]
["2021-08-02",175,null,null,null,2010,192.5,null,{"$f":"IF(F359=\"\",\"\",IF(ISERROR(VLOOKUP(F359,Kontoplan!A:D,2,0)),\"Konto findes ikke!\",VLOOKUP(F359,Kontoplan!A:D,2,0)))","v":"Danløn"}]
["2021-08-03",176,null,null,null,12310,14339.59,null,{"$f":"IF(F360=\"\",\"\",IF(ISERROR(VLOOKUP(F360,Kontoplan!A:D,2,0)),\"Konto findes ikke!\",VLOOKUP(F360,Kontoplan!A:D,2,0)))","v":"Bank konto"}]
["2021-08-03",176,null,null,null,1000,null,14339.59,{"$f":"IF(F361=\"\",\"\",IF(ISERROR(VLOOKUP(F361,Kontoplan!A:D,2,0)),\"Konto findes ikke!\",VLOOKUP(F361,Kontoplan!A:D,2,0)))","v":"Entre"}]
["2021-08-03",177,null,null,null,12310,null,300,{"$f":"IF(F362=\"\",\"\",IF(ISERROR(VLOOKUP(F362,Kontoplan!A:D,2,0)),\"Konto findes ikke!\",VLOOKUP(F362,Kontoplan!A:D,2,0)))","v":"Bank konto"}]
["2021-08-03",177,null,null,null,2060,300,null,{"$f":"IF(F363=\"\",\"\",IF(ISERROR(VLOOKUP(F363,Kontoplan!A:D,2,0)),\"Konto findes ikke!\",VLOOKUP(F363,Kontoplan!A:D,2,0)))","v":"Internet, mobiltelefon, Forsik."}]
["2021-08-03",178,null,null,null,12310,null,36.68,{"$f":"IF(F364=\"\",\"\",IF(ISERROR(VLOOKUP(F364,Kontoplan!A:D,2,0)),\"Konto findes ikke!\",VLOOKUP(F364,Kontoplan!A:D,2,0)))","v":"Bank konto"}]
["2021-08-03",178,null,null,null,2060,36.68,null,{"$f":"IF(F365=\"\",\"\",IF(ISERROR(VLOOKUP(F365,Kontoplan!A:D,2,0)),\"Konto findes ikke!\",VLOOKUP(F365,Kontoplan!A:D,2,0)))","v":"Internet, mobiltelefon, Forsik."}]
["2021-08-04",179,null,null,null,12310,null,6743.45,{"$f":"IF(F366=\"\",\"\",IF(ISERROR(VLOOKUP(F366,Kontoplan!A:D,2,0)),\"Konto findes ikke!\",VLOOKUP(F366,Kontoplan!A:D,2,0)))","v":"Bank konto"}]
["2021-08-04",179,null,null,null,3110,6743.45,null,{"$f":"IF(F367=\"\",\"\",IF(ISERROR(VLOOKUP(F367,Kontoplan!A:D,2,0)),\"Konto findes ikke!\",VLOOKUP(F367,Kontoplan!A:D,2,0)))","v":"Lønninger incl ATP -AM"}]
["2021-08-04",180,null,null,null,12310,null,150,{"$f":"IF(F368=\"\",\"\",IF(ISERROR(VLOOKUP(F368,Kontoplan!A:D,2,0)),\"Konto findes ikke!\",VLOOKUP(F368,Kontoplan!A:D,2,0)))","v":"Bank konto"}]
["2021-08-04",180,null,null,null,2200,150,null,{"$f":"IF(F369=\"\",\"\",IF(ISERROR(VLOOKUP(F369,Kontoplan!A:D,2,0)),\"Konto findes ikke!\",VLOOKUP(F369,Kontoplan!A:D,2,0)))","v":"Kontingenter overført til KVB"}]
["2021-08-04",181,null,null,null,12320,745,null,{"$f":"IF(F370=\"\",\"\",IF(ISERROR(VLOOKUP(F370,Kontoplan!A:D,2,0)),\"Konto findes ikke!\",VLOOKUP(F370,Kontoplan!A:D,2,0)))","v":"Kasse"}]
["2021-08-04",181,null,null,null,1010,null,745,{"$f":"IF(F371=\"\",\"\",IF(ISERROR(VLOOKUP(F371,Kontoplan!A:D,2,0)),\"Konto findes ikke!\",VLOOKUP(F371,Kontoplan!A:D,2,0)))","v":"Kiosk salg"}]
["2021-08-05",182,null,null,null,12310,null,19,{"$f":"IF(F372=\"\",\"\",IF(ISERROR(VLOOKUP(F372,Kontoplan!A:D,2,0)),\"Konto findes ikke!\",VLOOKUP(F372,Kontoplan!A:D,2,0)))","v":"Bank konto"}]
["2021-08-05",182,null,null,null,2060,19,null,{"$f":"IF(F373=\"\",\"\",IF(ISERROR(VLOOKUP(F373,Kontoplan!A:D,2,0)),\"Konto findes ikke!\",VLOOKUP(F373,Kontoplan!A:D,2,0)))","v":"Internet, mobiltelefon, Forsik."}]
["2021-08-05",183,null,null,null,12310,null,120.31,{"$f":"IF(F374=\"\",\"\",IF(ISERROR(VLOOKUP(F374,Kontoplan!A:D,2,0)),\"Konto findes ikke!\",VLOOKUP(F374,Kontoplan!A:D,2,0)))","v":"Bank konto"}]
["2021-08-05",183,null,null,null,2025,120.31,null,{"$f":"IF(F375=\"\",\"\",IF(ISERROR(VLOOKUP(F375,Kontoplan!A:D,2,0)),\"Konto findes ikke!\",VLOOKUP(F375,Kontoplan!A:D,2,0)))","v":"Regnskabsservice"}]
["2021-08-05",184,null,null,null,12320,705,null,{"$f":"IF(F376=\"\",\"\",IF(ISERROR(VLOOKUP(F376,Kontoplan!A:D,2,0)),\"Konto findes ikke!\",VLOOKUP(F376,Kontoplan!A:D,2,0)))","v":"Kasse"}]
["2021-08-05",184,null,null,null,1010,null,705,{"$f":"IF(F377=\"\",\"\",IF(ISERROR(VLOOKUP(F377,Kontoplan!A:D,2,0)),\"Konto findes ikke!\",VLOOKUP(F377,Kontoplan!A:D,2,0)))","v":"Kiosk salg"}]
["2021-08-06",185,null,null,null,12310,null,75.95,{"$f":"IF(F378=\"\",\"\",IF(ISERROR(VLOOKUP(F378,Kontoplan!A:D,2,0)),\"Konto findes ikke!\",VLOOKUP(F378,Kontoplan!A:D,2,0)))","v":"Bank konto"}]
["2021-08-06",185,null,null,null,2100,75.95,null,{"$f":"IF(F379=\"\",\"\",IF(ISERROR(VLOOKUP(F379,Kontoplan!A:D,2,0)),\"Konto findes ikke!\",VLOOKUP(F379,Kontoplan!A:D,2,0)))","v":"Forplejning til møder/Rejser"}]
["2021-08-06",186,null,null,null,12310,null,9675,{"$f":"IF(F380=\"\",\"\",IF(ISERROR(VLOOKUP(F380,Kontoplan!A:D,2,0)),\"Konto findes ikke!\",VLOOKUP(F380,Kontoplan!A:D,2,0)))","v":"Bank konto"}]
["2021-08-06",186,null,null,null,3100,9675,null,{"$f":"IF(F381=\"\",\"\",IF(ISERROR(VLOOKUP(F381,Kontoplan!A:D,2,0)),\"Konto findes ikke!\",VLOOKUP(F381,Kontoplan!A:D,2,0)))","v":"Lønomkostninger"}]
["2021-08-06",187,null,null,null,12310,null,3225,{"$f":"IF(F382=\"\",\"\",IF(ISERROR(VLOOKUP(F382,Kontoplan!A:D,2,0)),\"Konto findes ikke!\",VLOOKUP(F382,Kontoplan!A:D,2,0)))","v":"Bank konto"}]
["2021-08-06",187,null,null,null,3100,3225,null,{"$f":"IF(F383=\"\",\"\",IF(ISERROR(VLOOKUP(F383,Kontoplan!A:D,2,0)),\"Konto findes ikke!\",VLOOKUP(F383,Kontoplan!A:D,2,0)))","v":"Lønomkostninger"}]
["2021-08-06",188,null,null,null,12310,null,150,{"$f":"IF(F384=\"\",\"\",IF(ISERROR(VLOOKUP(F384,Kontoplan!A:D,2,0)),\"Konto findes ikke!\",VLOOKUP(F384,Kontoplan!A:D,2,0)))","v":"Bank konto"}]
["2021-08-06",188,null,null,null,2200,150,null,{"$f":"IF(F385=\"\",\"\",IF(ISERROR(VLOOKUP(F385,Kontoplan!A:D,2,0)),\"Konto findes ikke!\",VLOOKUP(F385,Kontoplan!A:D,2,0)))","v":"Kontingenter overført til KVB"}]
["2021-08-06",189,null,null,null,12320,1119,null,{"$f":"IF(F386=\"\",\"\",IF(ISERROR(VLOOKUP(F386,Kontoplan!A:D,2,0)),\"Konto findes ikke!\",VLOOKUP(F386,Kontoplan!A:D,2,0)))","v":"Kasse"}]
["2021-08-06",189,null,null,null,1010,null,1119,{"$f":"IF(F387=\"\",\"\",IF(ISERROR(VLOOKUP(F387,Kontoplan!A:D,2,0)),\"Konto findes ikke!\",VLOOKUP(F387,Kontoplan!A:D,2,0)))","v":"Kiosk salg"}]
["2021-08-06",190,null,null,null,2135,300,null,{"$f":"IF(F388=\"\",\"\",IF(ISERROR(VLOOKUP(F388,Kontoplan!A:D,2,0)),\"Konto findes ikke!\",VLOOKUP(F388,Kontoplan!A:D,2,0)))","v":"Tryksager"}]
["2021-08-06",190,null,null,null,12310,null,300,{"$f":"IF(F389=\"\",\"\",IF(ISERROR(VLOOKUP(F389,Kontoplan!A:D,2,0)),\"Konto findes ikke!\",VLOOKUP(F389,Kontoplan!A:D,2,0)))","v":"Bank konto"}]
["2021-08-07",191,null,null,null,12320,485,null,{"$f":"IF(F390=\"\",\"\",IF(ISERROR(VLOOKUP(F390,Kontoplan!A:D,2,0)),\"Konto findes ikke!\",VLOOKUP(F390,Kontoplan!A:D,2,0)))","v":"Kasse"}]
["2021-08-07",191,null,null,null,1010,null,485,{"$f":"IF(F391=\"\",\"\",IF(ISERROR(VLOOKUP(F391,Kontoplan!A:D,2,0)),\"Konto findes ikke!\",VLOOKUP(F391,Kontoplan!A:D,2,0)))","v":"Kiosk salg"}]
["2021-08-08",192,null,null,null,3100,11389.11,null,{"$f":"IF(F392=\"\",\"\",IF(ISERROR(VLOOKUP(F392,Kontoplan!A:D,2,0)),\"Konto findes ikke!\",VLOOKUP(F392,Kontoplan!A:D,2,0)))","v":"Lønomkostninger"}]
["2021-08-08",192,null,null,null,12310,null,11389.11,{"$f":"IF(F393=\"\",\"\",IF(ISERROR(VLOOKUP(F393,Kontoplan!A:D,2,0)),\"Konto findes ikke!\",VLOOKUP(F393,Kontoplan!A:D,2,0)))","v":"Bank konto"}]
["2021-08-09",193,null,null,null,2165,1009.75,null,{"$f":"IF(F394=\"\",\"\",IF(ISERROR(VLOOKUP(F394,Kontoplan!A:D,2,0)),\"Konto findes ikke!\",VLOOKUP(F394,Kontoplan!A:D,2,0)))","v":"G4S tyverialarm"}]
["2021-08-09",193,null,null,null,12310,null,1009.75,{"$f":"IF(F395=\"\",\"\",IF(ISERROR(VLOOKUP(F395,Kontoplan!A:D,2,0)),\"Konto findes ikke!\",VLOOKUP(F395,Kontoplan!A:D,2,0)))","v":"Bank konto"}]
["2021-08-10",194,null,null,null,12310,9759.75,null,{"$f":"IF(F396=\"\",\"\",IF(ISERROR(VLOOKUP(F396,Kontoplan!A:D,2,0)),\"Konto findes ikke!\",VLOOKUP(F396,Kontoplan!A:D,2,0)))","v":"Bank konto"}]
["2021-08-10",194,null,null,null,1000,null,9759.75,{"$f":"IF(F397=\"\",\"\",IF(ISERROR(VLOOKUP(F397,Kontoplan!A:D,2,0)),\"Konto findes ikke!\",VLOOKUP(F397,Kontoplan!A:D,2,0)))","v":"Entre"}]
["2021-08-10",195,null,null,null,2010,125,null,{"$f":"IF(F398=\"\",\"\",IF(ISERROR(VLOOKUP(F398,Kontoplan!A:D,2,0)),\"Konto findes ikke!\",VLOOKUP(F398,Kontoplan!A:D,2,0)))","v":"Danløn"}]
["2021-08-10",195,null,null,null,12310,null,125,{"$f":"IF(F399=\"\",\"\",IF(ISERROR(VLOOKUP(F399,Kontoplan!A:D,2,0)),\"Konto findes ikke!\",VLOOKUP(F399,Kontoplan!A:D,2,0)))","v":"Bank konto"}]
["2021-08-10",196,null,null,null,2060,300,null,{"$f":"IF(F400=\"\",\"\",IF(ISERROR(VLOOKUP(F400,Kontoplan!A:D,2,0)),\"Konto findes ikke!\",VLOOKUP(F400,Kontoplan!A:D,2,0)))","v":"Internet, mobiltelefon, Forsik."}]
["2021-08-10",196,null,null,null,12310,null,300,{"$f":"IF(F401=\"\",\"\",IF(ISERROR(VLOOKUP(F401,Kontoplan!A:D,2,0)),\"Konto findes ikke!\",VLOOKUP(F401,Kontoplan!A:D,2,0)))","v":"Bank konto"}]
["2021-08-11",197,null,null,null,12310,3454,null,{"$f":"IF(F402=\"\",\"\",IF(ISERROR(VLOOKUP(F402,Kontoplan!A:D,2,0)),\"Konto findes ikke!\",VLOOKUP(F402,Kontoplan!A:D,2,0)))","v":"Bank konto"}]
["2021-08-11",197,null,null,null,12320,null,3454,{"$f":"IF(F403=\"\",\"\",IF(ISERROR(VLOOKUP(F403,Kontoplan!A:D,2,0)),\"Konto findes ikke!\",VLOOKUP(F403,Kontoplan!A:D,2,0)))","v":"Kasse"}]
["2021-08-11",198,null,null,null,2055,78.349999999999994,null,{"$f":"IF(F404=\"\",\"\",IF(ISERROR(VLOOKUP(F404,Kontoplan!A:D,2,0)),\"Konto findes ikke!\",VLOOKUP(F404,Kontoplan!A:D,2,0)))","v":"Indkøb af øl + vand"}]
["2021-08-11",198,null,null,null,12310,null,78.349999999999994,{"$f":"IF(F405=\"\",\"\",IF(ISERROR(VLOOKUP(F405,Kontoplan!A:D,2,0)),\"Konto findes ikke!\",VLOOKUP(F405,Kontoplan!A:D,2,0)))","v":"Bank konto"}]
["2021-08-11",199,null,null,null,2070,633.75,null,{"$f":"IF(F406=\"\",\"\",IF(ISERROR(VLOOKUP(F406,Kontoplan!A:D,2,0)),\"Konto findes ikke!\",VLOOKUP(F406,Kontoplan!A:D,2,0)))","v":"Tin og sortkrudt"}]
["2021-08-11",199,null,null,null,12310,null,633.75,{"$f":"IF(F407=\"\",\"\",IF(ISERROR(VLOOKUP(F407,Kontoplan!A:D,2,0)),\"Konto findes ikke!\",VLOOKUP(F407,Kontoplan!A:D,2,0)))","v":"Bank konto"}]
["2021-08-11",200,null,null,null,12320,365,null,{"$f":"IF(F408=\"\",\"\",IF(ISERROR(VLOOKUP(F408,Kontoplan!A:D,2,0)),\"Konto findes ikke!\",VLOOKUP(F408,Kontoplan!A:D,2,0)))","v":"Kasse"}]
["2021-08-11",200,null,null,null,1010,null,365,{"$f":"IF(F409=\"\",\"\",IF(ISERROR(VLOOKUP(F409,Kontoplan!A:D,2,0)),\"Konto findes ikke!\",VLOOKUP(F409,Kontoplan!A:D,2,0)))","v":"Kiosk salg"}]
["2021-08-12",201,null,null,null,2075,500,null,{"$f":"IF(F410=\"\",\"\",IF(ISERROR(VLOOKUP(F410,Kontoplan!A:D,2,0)),\"Konto findes ikke!\",VLOOKUP(F410,Kontoplan!A:D,2,0)))","v":"Gaver"}]
["2021-08-12",201,null,null,null,12310,null,500,{"$f":"IF(F411=\"\",\"\",IF(ISERROR(VLOOKUP(F411,Kontoplan!A:D,2,0)),\"Konto findes ikke!\",VLOOKUP(F411,Kontoplan!A:D,2,0)))","v":"Bank konto"}]
["2021-08-12",202,null,null,null,12320,315,null,{"$f":"IF(F412=\"\",\"\",IF(ISERROR(VLOOKUP(F412,Kontoplan!A:D,2,0)),\"Konto findes ikke!\",VLOOKUP(F412,Kontoplan!A:D,2,0)))","v":"Kasse"}]
["2021-08-12",202,null,null,null,1010,null,315,{"$f":"IF(F413=\"\",\"\",IF(ISERROR(VLOOKUP(F413,Kontoplan!A:D,2,0)),\"Konto findes ikke!\",VLOOKUP(F413,Kontoplan!A:D,2,0)))","v":"Kiosk salg"}]
["2021-08-13",203,null,null,null,12320,130,null,{"$f":"IF(F414=\"\",\"\",IF(ISERROR(VLOOKUP(F414,Kontoplan!A:D,2,0)),\"Konto findes ikke!\",VLOOKUP(F414,Kontoplan!A:D,2,0)))","v":"Kasse"}]
["2021-08-13",203,null,null,null,1010,null,130,{"$f":"IF(F415=\"\",\"\",IF(ISERROR(VLOOKUP(F415,Kontoplan!A:D,2,0)),\"Konto findes ikke!\",VLOOKUP(F415,Kontoplan!A:D,2,0)))","v":"Kiosk salg"}]
["2021-08-14",204,null,null,null,12320,1050,null,{"$f":"IF(F416=\"\",\"\",IF(ISERROR(VLOOKUP(F416,Kontoplan!A:D,2,0)),\"Konto findes ikke!\",VLOOKUP(F416,Kontoplan!A:D,2,0)))","v":"Kasse"}]
["2021-08-14",204,null,null,null,1010,null,1050,{"$f":"IF(F417=\"\",\"\",IF(ISERROR(VLOOKUP(F417,Kontoplan!A:D,2,0)),\"Konto findes ikke!\",VLOOKUP(F417,Kontoplan!A:D,2,0)))","v":"Kiosk salg"}]
["2021-08-16",205,null,null,null,2190,113.7,null,{"$f":"IF(F418=\"\",\"\",IF(ISERROR(VLOOKUP(F418,Kontoplan!A:D,2,0)),\"Konto findes ikke!\",VLOOKUP(F418,Kontoplan!A:D,2,0)))","v":"Diverse Udgifter"}]
["2021-08-16",205,null,null,null,12310,null,113.7,{"$f":"IF(F419=\"\",\"\",IF(ISERROR(VLOOKUP(F419,Kontoplan!A:D,2,0)),\"Konto findes ikke!\",VLOOKUP(F419,Kontoplan!A:D,2,0)))","v":"Bank konto"}]
["2021-08-17",206,null,null,null,12310,140,null,{"$f":"IF(F420=\"\",\"\",IF(ISERROR(VLOOKUP(F420,Kontoplan!A:D,2,0)),\"Konto findes ikke!\",VLOOKUP(F420,Kontoplan!A:D,2,0)))","v":"Bank konto"}]
["2021-08-17",206,null,null,null,1000,null,140,{"$f":"IF(F421=\"\",\"\",IF(ISERROR(VLOOKUP(F421,Kontoplan!A:D,2,0)),\"Konto findes ikke!\",VLOOKUP(F421,Kontoplan!A:D,2,0)))","v":"Entre"}]
["2021-08-17",207,null,null,null,12310,8868.48,null,{"$f":"IF(F422=\"\",\"\",IF(ISERROR(VLOOKUP(F422,Kontoplan!A:D,2,0)),\"Konto findes ikke!\",VLOOKUP(F422,Kontoplan!A:D,2,0)))","v":"Bank konto"}]
["2021-08-17",207,null,null,null,1000,null,8868.48,{"$f":"IF(F423=\"\",\"\",IF(ISERROR(VLOOKUP(F423,Kontoplan!A:D,2,0)),\"Konto findes ikke!\",VLOOKUP(F423,Kontoplan!A:D,2,0)))","v":"Entre"}]
["2021-08-19",208,null,null,null,2060,500,null,{"$f":"IF(F424=\"\",\"\",IF(ISERROR(VLOOKUP(F424,Kontoplan!A:D,2,0)),\"Konto findes ikke!\",VLOOKUP(F424,Kontoplan!A:D,2,0)))","v":"Internet, mobiltelefon, Forsik."}]
["2021-08-19",208,null,null,null,12310,null,500,{"$f":"IF(F425=\"\",\"\",IF(ISERROR(VLOOKUP(F425,Kontoplan!A:D,2,0)),\"Konto findes ikke!\",VLOOKUP(F425,Kontoplan!A:D,2,0)))","v":"Bank konto"}]
["2021-08-20",209,null,null,null,2190,515.86,null,{"$f":"IF(F426=\"\",\"\",IF(ISERROR(VLOOKUP(F426,Kontoplan!A:D,2,0)),\"Konto findes ikke!\",VLOOKUP(F426,Kontoplan!A:D,2,0)))","v":"Diverse Udgifter"}]
["2021-08-20",209,null,null,null,12310,null,515.86,{"$f":"IF(F427=\"\",\"\",IF(ISERROR(VLOOKUP(F427,Kontoplan!A:D,2,0)),\"Konto findes ikke!\",VLOOKUP(F427,Kontoplan!A:D,2,0)))","v":"Bank konto"}]
["2021-08-24",210,null,null,null,12310,8189.52,null,{"$f":"IF(F428=\"\",\"\",IF(ISERROR(VLOOKUP(F428,Kontoplan!A:D,2,0)),\"Konto findes ikke!\",VLOOKUP(F428,Kontoplan!A:D,2,0)))","v":"Bank konto"}]
["2021-08-24",210,null,null,null,1000,null,8189.52,{"$f":"IF(F429=\"\",\"\",IF(ISERROR(VLOOKUP(F429,Kontoplan!A:D,2,0)),\"Konto findes ikke!\",VLOOKUP(F429,Kontoplan!A:D,2,0)))","v":"Entre"}]
["2021-08-26",211,null,null,null,3100,4380,null,{"$f":"IF(F430=\"\",\"\",IF(ISERROR(VLOOKUP(F430,Kontoplan!A:D,2,0)),\"Konto findes ikke!\",VLOOKUP(F430,Kontoplan!A:D,2,0)))","v":"Lønomkostninger"}]
["2021-08-26",211,null,null,null,12310,null,4380,{"$f":"IF(F431=\"\",\"\",IF(ISERROR(VLOOKUP(F431,Kontoplan!A:D,2,0)),\"Konto findes ikke!\",VLOOKUP(F431,Kontoplan!A:D,2,0)))","v":"Bank konto"}]
["2021-08-29",212,null,null,null,2037,158.94999999999999,null,{"$f":"IF(F432=\"\",\"\",IF(ISERROR(VLOOKUP(F432,Kontoplan!A:D,2,0)),\"Konto findes ikke!\",VLOOKUP(F432,Kontoplan!A:D,2,0)))","v":"Rengørringsartikler"}]
["2021-08-29",212,null,null,null,12310,null,158.94999999999999,{"$f":"IF(F433=\"\",\"\",IF(ISERROR(VLOOKUP(F433,Kontoplan!A:D,2,0)),\"Konto findes ikke!\",VLOOKUP(F433,Kontoplan!A:D,2,0)))","v":"Bank konto"}]
["2021-08-30",213,null,null,null,3110,15168.75,null,{"$f":"IF(F434=\"\",\"\",IF(ISERROR(VLOOKUP(F434,Kontoplan!A:D,2,0)),\"Konto findes ikke!\",VLOOKUP(F434,Kontoplan!A:D,2,0)))","v":"Lønninger incl ATP -AM"}]
["2021-08-30",213,null,null,null,12310,null,15168.75,{"$f":"IF(F435=\"\",\"\",IF(ISERROR(VLOOKUP(F435,Kontoplan!A:D,2,0)),\"Konto findes ikke!\",VLOOKUP(F435,Kontoplan!A:D,2,0)))","v":"Bank konto"}]
["2021-08-30",214,null,null,null,2130,1455,null,{"$f":"IF(F436=\"\",\"\",IF(ISERROR(VLOOKUP(F436,Kontoplan!A:D,2,0)),\"Konto findes ikke!\",VLOOKUP(F436,Kontoplan!A:D,2,0)))","v":"Annoncer"}]
["2021-08-30",214,null,null,null,12310,null,1455,{"$f":"IF(F437=\"\",\"\",IF(ISERROR(VLOOKUP(F437,Kontoplan!A:D,2,0)),\"Konto findes ikke!\",VLOOKUP(F437,Kontoplan!A:D,2,0)))","v":"Bank konto"}]
["2021-08-30",215,null,null,null,2110,554.38,null,{"$f":"IF(F438=\"\",\"\",IF(ISERROR(VLOOKUP(F438,Kontoplan!A:D,2,0)),\"Konto findes ikke!\",VLOOKUP(F438,Kontoplan!A:D,2,0)))","v":"Kontorhold - Porto - IT"}]
["2021-08-30",215,null,null,null,12310,null,554.38,{"$f":"IF(F439=\"\",\"\",IF(ISERROR(VLOOKUP(F439,Kontoplan!A:D,2,0)),\"Konto findes ikke!\",VLOOKUP(F439,Kontoplan!A:D,2,0)))","v":"Bank konto"}]
["2021-08-30",216,null,null,null,3110,6743.45,null,{"$f":"IF(F440=\"\",\"\",IF(ISERROR(VLOOKUP(F440,Kontoplan!A:D,2,0)),\"Konto findes ikke!\",VLOOKUP(F440,Kontoplan!A:D,2,0)))","v":"Lønninger incl ATP -AM"}]
["2021-08-30",216,null,null,null,12310,null,6743.45,{"$f":"IF(F441=\"\",\"\",IF(ISERROR(VLOOKUP(F441,Kontoplan!A:D,2,0)),\"Konto findes ikke!\",VLOOKUP(F441,Kontoplan!A:D,2,0)))","v":"Bank konto"}]
["2021-08-31",217,null,null,null,12310,10049.959999999999,null,{"$f":"IF(F442=\"\",\"\",IF(ISERROR(VLOOKUP(F442,Kontoplan!A:D,2,0)),\"Konto findes ikke!\",VLOOKUP(F442,Kontoplan!A:D,2,0)))","v":"Bank konto"}]
["2021-08-31",217,null,null,null,1000,null,10049.959999999999,{"$f":"IF(F443=\"\",\"\",IF(ISERROR(VLOOKUP(F443,Kontoplan!A:D,2,0)),\"Konto findes ikke!\",VLOOKUP(F443,Kontoplan!A:D,2,0)))","v":"Entre"}]
["2021-08-31",218,null,null,null,2060,750,null,{"$f":"IF(F444=\"\",\"\",IF(ISERROR(VLOOKUP(F444,Kontoplan!A:D,2,0)),\"Konto findes ikke!\",VLOOKUP(F444,Kontoplan!A:D,2,0)))","v":"Internet, mobiltelefon, Forsik."}]
["2021-08-31",218,null,null,null,12310,null,750,{"$f":"IF(F445=\"\",\"\",IF(ISERROR(VLOOKUP(F445,Kontoplan!A:D,2,0)),\"Konto findes ikke!\",VLOOKUP(F445,Kontoplan!A:D,2,0)))","v":"Bank konto"}]
["2021-08-31",219,null,null,null,12310,9950,null,{"$f":"IF(F446=\"\",\"\",IF(ISERROR(VLOOKUP(F446,Kontoplan!A:D,2,0)),\"Konto findes ikke!\",VLOOKUP(F446,Kontoplan!A:D,2,0)))","v":"Bank konto"}]
["2021-08-31",219,null,null,null,12320,null,9950,{"$f":"IF(F447=\"\",\"\",IF(ISERROR(VLOOKUP(F447,Kontoplan!A:D,2,0)),\"Konto findes ikke!\",VLOOKUP(F447,Kontoplan!A:D,2,0)))","v":"Kasse"}]
["2021-09-04",220,null,null,null,12320,980,null,{"$f":"IF(F448=\"\",\"\",IF(ISERROR(VLOOKUP(F448,Kontoplan!A:D,2,0)),\"Konto findes ikke!\",VLOOKUP(F448,Kontoplan!A:D,2,0)))","v":"Kasse"}]
["2021-09-04",220,null,null,null,1010,null,980,{"$f":"IF(F449=\"\",\"\",IF(ISERROR(VLOOKUP(F449,Kontoplan!A:D,2,0)),\"Konto findes ikke!\",VLOOKUP(F449,Kontoplan!A:D,2,0)))","v":"Kiosk salg"}]
["2021-09-04",221,null,null,null,12320,909,null,{"$f":"IF(F450=\"\",\"\",IF(ISERROR(VLOOKUP(F450,Kontoplan!A:D,2,0)),\"Konto findes ikke!\",VLOOKUP(F450,Kontoplan!A:D,2,0)))","v":"Kasse"}]
["2021-09-04",221,null,null,null,1010,null,909,{"$f":"IF(F451=\"\",\"\",IF(ISERROR(VLOOKUP(F451,Kontoplan!A:D,2,0)),\"Konto findes ikke!\",VLOOKUP(F451,Kontoplan!A:D,2,0)))","v":"Kiosk salg"}]
["2021-09-04",222,null,null,null,12320,513.5,null,{"$f":"IF(F452=\"\",\"\",IF(ISERROR(VLOOKUP(F452,Kontoplan!A:D,2,0)),\"Konto findes ikke!\",VLOOKUP(F452,Kontoplan!A:D,2,0)))","v":"Kasse"}]
["2021-09-04",222,null,null,null,1010,null,513.5,{"$f":"IF(F453=\"\",\"\",IF(ISERROR(VLOOKUP(F453,Kontoplan!A:D,2,0)),\"Konto findes ikke!\",VLOOKUP(F453,Kontoplan!A:D,2,0)))","v":"Kiosk salg"}]
["2021-09-04",223,null,null,null,12320,453,null,{"$f":"IF(F454=\"\",\"\",IF(ISERROR(VLOOKUP(F454,Kontoplan!A:D,2,0)),\"Konto findes ikke!\",VLOOKUP(F454,Kontoplan!A:D,2,0)))","v":"Kasse"}]
["2021-09-04",223,null,null,null,1010,null,453,{"$f":"IF(F455=\"\",\"\",IF(ISERROR(VLOOKUP(F455,Kontoplan!A:D,2,0)),\"Konto findes ikke!\",VLOOKUP(F455,Kontoplan!A:D,2,0)))","v":"Kiosk salg"}]
["2021-09-04",224,null,null,null,12320,900,null,{"$f":"IF(F456=\"\",\"\",IF(ISERROR(VLOOKUP(F456,Kontoplan!A:D,2,0)),\"Konto findes ikke!\",VLOOKUP(F456,Kontoplan!A:D,2,0)))","v":"Kasse"}]
["2021-09-04",224,null,null,null,1010,null,900,{"$f":"IF(F457=\"\",\"\",IF(ISERROR(VLOOKUP(F457,Kontoplan!A:D,2,0)),\"Konto findes ikke!\",VLOOKUP(F457,Kontoplan!A:D,2,0)))","v":"Kiosk salg"}]
["2021-09-04",225,null,null,null,12320,1695,null,{"$f":"IF(F458=\"\",\"\",IF(ISERROR(VLOOKUP(F458,Kontoplan!A:D,2,0)),\"Konto findes ikke!\",VLOOKUP(F458,Kontoplan!A:D,2,0)))","v":"Kasse"}]
["2021-09-04",225,null,null,null,1010,null,1695,{"$f":"IF(F459=\"\",\"\",IF(ISERROR(VLOOKUP(F459,Kontoplan!A:D,2,0)),\"Konto findes ikke!\",VLOOKUP(F459,Kontoplan!A:D,2,0)))","v":"Kiosk salg"}]
["2021-09-04",226,null,null,null,12320,615,null,{"$f":"IF(F460=\"\",\"\",IF(ISERROR(VLOOKUP(F460,Kontoplan!A:D,2,0)),\"Konto findes ikke!\",VLOOKUP(F460,Kontoplan!A:D,2,0)))","v":"Kasse"}]
["2021-09-04",226,null,null,null,1010,null,615,{"$f":"IF(F461=\"\",\"\",IF(ISERROR(VLOOKUP(F461,Kontoplan!A:D,2,0)),\"Konto findes ikke!\",VLOOKUP(F461,Kontoplan!A:D,2,0)))","v":"Kiosk salg"}]
["2021-09-04",227,null,null,null,12320,725,null,{"$f":"IF(F462=\"\",\"\",IF(ISERROR(VLOOKUP(F462,Kontoplan!A:D,2,0)),\"Konto findes ikke!\",VLOOKUP(F462,Kontoplan!A:D,2,0)))","v":"Kasse"}]
["2021-09-04",227,null,null,null,1010,null,725,{"$f":"IF(F463=\"\",\"\",IF(ISERROR(VLOOKUP(F463,Kontoplan!A:D,2,0)),\"Konto findes ikke!\",VLOOKUP(F463,Kontoplan!A:D,2,0)))","v":"Kiosk salg"}]
["2021-09-04",228,null,null,null,12320,230,null,{"$f":"IF(F464=\"\",\"\",IF(ISERROR(VLOOKUP(F464,Kontoplan!A:D,2,0)),\"Konto findes ikke!\",VLOOKUP(F464,Kontoplan!A:D,2,0)))","v":"Kasse"}]
["2021-09-04",228,null,null,null,1010,null,230,{"$f":"IF(F465=\"\",\"\",IF(ISERROR(VLOOKUP(F465,Kontoplan!A:D,2,0)),\"Konto findes ikke!\",VLOOKUP(F465,Kontoplan!A:D,2,0)))","v":"Kiosk salg"}]
["2021-09-04",229,null,null,null,12320,370,null,{"$f":"IF(F466=\"\",\"\",IF(ISERROR(VLOOKUP(F466,Kontoplan!A:D,2,0)),\"Konto findes ikke!\",VLOOKUP(F466,Kontoplan!A:D,2,0)))","v":"Kasse"}]
["2021-09-04",229,null,null,null,1010,null,370,{"$f":"IF(F467=\"\",\"\",IF(ISERROR(VLOOKUP(F467,Kontoplan!A:D,2,0)),\"Konto findes ikke!\",VLOOKUP(F467,Kontoplan!A:D,2,0)))","v":"Kiosk salg"}]
["2021-09-04",230,null,null,null,12320,660,null,{"$f":"IF(F468=\"\",\"\",IF(ISERROR(VLOOKUP(F468,Kontoplan!A:D,2,0)),\"Konto findes ikke!\",VLOOKUP(F468,Kontoplan!A:D,2,0)))","v":"Kasse"}]
["2021-09-04",230,null,null,null,1010,null,660,{"$f":"IF(F469=\"\",\"\",IF(ISERROR(VLOOKUP(F469,Kontoplan!A:D,2,0)),\"Konto findes ikke!\",VLOOKUP(F469,Kontoplan!A:D,2,0)))","v":"Kiosk salg"}]
["2021-09-06",231,null,null,null,12320,720,null,{"$f":"IF(F470=\"\",\"\",IF(ISERROR(VLOOKUP(F470,Kontoplan!A:D,2,0)),\"Konto findes ikke!\",VLOOKUP(F470,Kontoplan!A:D,2,0)))","v":"Kasse"}]
["2021-09-06",231,null,null,null,1010,null,720,{"$f":"IF(F471=\"\",\"\",IF(ISERROR(VLOOKUP(F471,Kontoplan!A:D,2,0)),\"Konto findes ikke!\",VLOOKUP(F471,Kontoplan!A:D,2,0)))","v":"Kiosk salg"}]
["2021-09-06",232,null,null,null,2000,1.5,null,{"$f":"IF(F472=\"\",\"\",IF(ISERROR(VLOOKUP(F472,Kontoplan!A:D,2,0)),\"Konto findes ikke!\",VLOOKUP(F472,Kontoplan!A:D,2,0)))","v":"Bankgebyr"}]
["2021-09-06",232,null,null,null,12310,null,1.5,{"$f":"IF(F473=\"\",\"\",IF(ISERROR(VLOOKUP(F473,Kontoplan!A:D,2,0)),\"Konto findes ikke!\",VLOOKUP(F473,Kontoplan!A:D,2,0)))","v":"Bank konto"}]
["2021-09-06",233,null,null,null,2060,377.75,null,{"$f":"IF(F474=\"\",\"\",IF(ISERROR(VLOOKUP(F474,Kontoplan!A:D,2,0)),\"Konto findes ikke!\",VLOOKUP(F474,Kontoplan!A:D,2,0)))","v":"Internet, mobiltelefon, Forsik."}]
["2021-09-06",233,null,null,null,12310,null,377.75,{"$f":"IF(F475=\"\",\"\",IF(ISERROR(VLOOKUP(F475,Kontoplan!A:D,2,0)),\"Konto findes ikke!\",VLOOKUP(F475,Kontoplan!A:D,2,0)))","v":"Bank konto"}]
["2021-09-06",234,null,null,null,2010,192.5,null,{"$f":"IF(F476=\"\",\"\",IF(ISERROR(VLOOKUP(F476,Kontoplan!A:D,2,0)),\"Konto findes ikke!\",VLOOKUP(F476,Kontoplan!A:D,2,0)))","v":"Danløn"}]
["2021-09-06",234,null,null,null,12310,null,192.5,{"$f":"IF(F477=\"\",\"\",IF(ISERROR(VLOOKUP(F477,Kontoplan!A:D,2,0)),\"Konto findes ikke!\",VLOOKUP(F477,Kontoplan!A:D,2,0)))","v":"Bank konto"}]
["2021-09-06",235,null,null,null,2060,90.4,null,{"$f":"IF(F478=\"\",\"\",IF(ISERROR(VLOOKUP(F478,Kontoplan!A:D,2,0)),\"Konto findes ikke!\",VLOOKUP(F478,Kontoplan!A:D,2,0)))","v":"Internet, mobiltelefon, Forsik."}]
["2021-09-06",235,null,null,null,12310,null,90.4,{"$f":"IF(F479=\"\",\"\",IF(ISERROR(VLOOKUP(F479,Kontoplan!A:D,2,0)),\"Konto findes ikke!\",VLOOKUP(F479,Kontoplan!A:D,2,0)))","v":"Bank konto"}]
["2021-09-06",236,null,null,null,2060,19,null,{"$f":"IF(F480=\"\",\"\",IF(ISERROR(VLOOKUP(F480,Kontoplan!A:D,2,0)),\"Konto findes ikke!\",VLOOKUP(F480,Kontoplan!A:D,2,0)))","v":"Internet, mobiltelefon, Forsik."}]
["2021-09-06",236,null,null,null,12310,null,19,{"$f":"IF(F481=\"\",\"\",IF(ISERROR(VLOOKUP(F481,Kontoplan!A:D,2,0)),\"Konto findes ikke!\",VLOOKUP(F481,Kontoplan!A:D,2,0)))","v":"Bank konto"}]
["2021-09-06",237,null,null,null,2100,61.95,null,{"$f":"IF(F482=\"\",\"\",IF(ISERROR(VLOOKUP(F482,Kontoplan!A:D,2,0)),\"Konto findes ikke!\",VLOOKUP(F482,Kontoplan!A:D,2,0)))","v":"Forplejning til møder/Rejser"}]
["2021-09-06",237,null,null,null,12310,null,61.95,{"$f":"IF(F483=\"\",\"\",IF(ISERROR(VLOOKUP(F483,Kontoplan!A:D,2,0)),\"Konto findes ikke!\",VLOOKUP(F483,Kontoplan!A:D,2,0)))","v":"Bank konto"}]
["2021-09-07",238,null,null,null,12310,4520.05,null,{"$f":"IF(F484=\"\",\"\",IF(ISERROR(VLOOKUP(F484,Kontoplan!A:D,2,0)),\"Konto findes ikke!\",VLOOKUP(F484,Kontoplan!A:D,2,0)))","v":"Bank konto"}]
["2021-09-07",238,null,null,null,1000,null,4520.05,{"$f":"IF(F485=\"\",\"\",IF(ISERROR(VLOOKUP(F485,Kontoplan!A:D,2,0)),\"Konto findes ikke!\",VLOOKUP(F485,Kontoplan!A:D,2,0)))","v":"Entre"}]
["2021-09-07",239,null,null,null,2010,125,null,{"$f":"IF(F486=\"\",\"\",IF(ISERROR(VLOOKUP(F486,Kontoplan!A:D,2,0)),\"Konto findes ikke!\",VLOOKUP(F486,Kontoplan!A:D,2,0)))","v":"Danløn"}]
["2021-09-07",239,null,null,null,12310,null,125,{"$f":"IF(F487=\"\",\"\",IF(ISERROR(VLOOKUP(F487,Kontoplan!A:D,2,0)),\"Konto findes ikke!\",VLOOKUP(F487,Kontoplan!A:D,2,0)))","v":"Bank konto"}]
["2021-09-08",240,null,null,null,12320,650,null,{"$f":"IF(F488=\"\",\"\",IF(ISERROR(VLOOKUP(F488,Kontoplan!A:D,2,0)),\"Konto findes ikke!\",VLOOKUP(F488,Kontoplan!A:D,2,0)))","v":"Kasse"}]
["2021-09-08",240,null,null,null,1010,null,650,{"$f":"IF(F489=\"\",\"\",IF(ISERROR(VLOOKUP(F489,Kontoplan!A:D,2,0)),\"Konto findes ikke!\",VLOOKUP(F489,Kontoplan!A:D,2,0)))","v":"Kiosk salg"}]
["2021-09-09",241,null,null,null,2110,54,null,{"$f":"IF(F490=\"\",\"\",IF(ISERROR(VLOOKUP(F490,Kontoplan!A:D,2,0)),\"Konto findes ikke!\",VLOOKUP(F490,Kontoplan!A:D,2,0)))","v":"Kontorhold - Porto - IT"}]
["2021-09-09",241,null,null,null,12320,null,54,{"$f":"IF(F491=\"\",\"\",IF(ISERROR(VLOOKUP(F491,Kontoplan!A:D,2,0)),\"Konto findes ikke!\",VLOOKUP(F491,Kontoplan!A:D,2,0)))","v":"Kasse"}]
["2021-09-09",242,null,null,null,2100,299,null,{"$f":"IF(F492=\"\",\"\",IF(ISERROR(VLOOKUP(F492,Kontoplan!A:D,2,0)),\"Konto findes ikke!\",VLOOKUP(F492,Kontoplan!A:D,2,0)))","v":"Forplejning til møder/Rejser"}]
["2021-09-09",242,null,null,null,12320,null,299,{"$f":"IF(F493=\"\",\"\",IF(ISERROR(VLOOKUP(F493,Kontoplan!A:D,2,0)),\"Konto findes ikke!\",VLOOKUP(F493,Kontoplan!A:D,2,0)))","v":"Kasse"}]
["2021-09-10",243,null,null,null,2040,532,null,{"$f":"IF(F494=\"\",\"\",IF(ISERROR(VLOOKUP(F494,Kontoplan!A:D,2,0)),\"Konto findes ikke!\",VLOOKUP(F494,Kontoplan!A:D,2,0)))","v":"El, Vand og Varme"}]
["2021-09-10",243,null,null,null,12310,null,532,{"$f":"IF(F495=\"\",\"\",IF(ISERROR(VLOOKUP(F495,Kontoplan!A:D,2,0)),\"Konto findes ikke!\",VLOOKUP(F495,Kontoplan!A:D,2,0)))","v":"Bank konto"}]
["2021-09-10",244,null,null,null,3100,3225,null,{"$f":"IF(F496=\"\",\"\",IF(ISERROR(VLOOKUP(F496,Kontoplan!A:D,2,0)),\"Konto findes ikke!\",VLOOKUP(F496,Kontoplan!A:D,2,0)))","v":"Lønomkostninger"}]
["2021-09-10",244,null,null,null,12310,null,3225,{"$f":"IF(F497=\"\",\"\",IF(ISERROR(VLOOKUP(F497,Kontoplan!A:D,2,0)),\"Konto findes ikke!\",VLOOKUP(F497,Kontoplan!A:D,2,0)))","v":"Bank konto"}]
["2021-09-10",245,null,null,null,2025,120.31,null,{"$f":"IF(F498=\"\",\"\",IF(ISERROR(VLOOKUP(F498,Kontoplan!A:D,2,0)),\"Konto findes ikke!\",VLOOKUP(F498,Kontoplan!A:D,2,0)))","v":"Regnskabsservice"}]
["2021-09-10",245,null,null,null,12310,null,120.31,{"$f":"IF(F499=\"\",\"\",IF(ISERROR(VLOOKUP(F499,Kontoplan!A:D,2,0)),\"Konto findes ikke!\",VLOOKUP(F499,Kontoplan!A:D,2,0)))","v":"Bank konto"}]
["2021-09-10",246,null,null,null,2190,137.5,null,{"$f":"IF(F500=\"\",\"\",IF(ISERROR(VLOOKUP(F500,Kontoplan!A:D,2,0)),\"Konto findes ikke!\",VLOOKUP(F500,Kontoplan!A:D,2,0)))","v":"Diverse Udgifter"}]
["2021-09-10",246,null,null,null,12310,null,137.5,{"$f":"IF(F501=\"\",\"\",IF(ISERROR(VLOOKUP(F501,Kontoplan!A:D,2,0)),\"Konto findes ikke!\",VLOOKUP(F501,Kontoplan!A:D,2,0)))","v":"Bank konto"}]
["2021-09-10",247,null,null,null,2190,642.65,null,{"$f":"IF(F502=\"\",\"\",IF(ISERROR(VLOOKUP(F502,Kontoplan!A:D,2,0)),\"Konto findes ikke!\",VLOOKUP(F502,Kontoplan!A:D,2,0)))","v":"Diverse Udgifter"}]
["2021-09-10",247,null,null,null,12310,null,642.65,{"$f":"IF(F503=\"\",\"\",IF(ISERROR(VLOOKUP(F503,Kontoplan!A:D,2,0)),\"Konto findes ikke!\",VLOOKUP(F503,Kontoplan!A:D,2,0)))","v":"Bank konto"}]
["2021-09-10",248,null,null,null,2190,418.13,null,{"$f":"IF(F504=\"\",\"\",IF(ISERROR(VLOOKUP(F504,Kontoplan!A:D,2,0)),\"Konto findes ikke!\",VLOOKUP(F504,Kontoplan!A:D,2,0)))","v":"Diverse Udgifter"}]
["2021-09-10",248,null,null,null,12310,null,418.13,{"$f":"IF(F505=\"\",\"\",IF(ISERROR(VLOOKUP(F505,Kontoplan!A:D,2,0)),\"Konto findes ikke!\",VLOOKUP(F505,Kontoplan!A:D,2,0)))","v":"Bank konto"}]
["2021-09-10",249,null,null,null,2190,640,null,{"$f":"IF(F506=\"\",\"\",IF(ISERROR(VLOOKUP(F506,Kontoplan!A:D,2,0)),\"Konto findes ikke!\",VLOOKUP(F506,Kontoplan!A:D,2,0)))","v":"Diverse Udgifter"}]
["2021-09-10",249,null,null,null,12310,null,640,{"$f":"IF(F507=\"\",\"\",IF(ISERROR(VLOOKUP(F507,Kontoplan!A:D,2,0)),\"Konto findes ikke!\",VLOOKUP(F507,Kontoplan!A:D,2,0)))","v":"Bank konto"}]
["2021-09-10",250,null,null,null,2135,80,null,{"$f":"IF(F508=\"\",\"\",IF(ISERROR(VLOOKUP(F508,Kontoplan!A:D,2,0)),\"Konto findes ikke!\",VLOOKUP(F508,Kontoplan!A:D,2,0)))","v":"Tryksager"}]
["2021-09-10",250,null,null,null,12310,null,80,{"$f":"IF(F509=\"\",\"\",IF(ISERROR(VLOOKUP(F509,Kontoplan!A:D,2,0)),\"Konto findes ikke!\",VLOOKUP(F509,Kontoplan!A:D,2,0)))","v":"Bank konto"}]
["2021-09-10",251,null,null,null,2035,137.85,null,{"$f":"IF(F510=\"\",\"\",IF(ISERROR(VLOOKUP(F510,Kontoplan!A:D,2,0)),\"Konto findes ikke!\",VLOOKUP(F510,Kontoplan!A:D,2,0)))","v":"Grønne områder"}]
["2021-09-10",251,null,null,null,12310,null,137.85,{"$f":"IF(F511=\"\",\"\",IF(ISERROR(VLOOKUP(F511,Kontoplan!A:D,2,0)),\"Konto findes ikke!\",VLOOKUP(F511,Kontoplan!A:D,2,0)))","v":"Bank konto"}]
["2021-09-10",252,null,null,null,2190,1128,null,{"$f":"IF(F512=\"\",\"\",IF(ISERROR(VLOOKUP(F512,Kontoplan!A:D,2,0)),\"Konto findes ikke!\",VLOOKUP(F512,Kontoplan!A:D,2,0)))","v":"Diverse Udgifter"}]
["2021-09-10",252,null,null,null,12310,null,1128,{"$f":"IF(F513=\"\",\"\",IF(ISERROR(VLOOKUP(F513,Kontoplan!A:D,2,0)),\"Konto findes ikke!\",VLOOKUP(F513,Kontoplan!A:D,2,0)))","v":"Bank konto"}]
["2021-09-10",253,null,null,null,2190,72.5,null,{"$f":"IF(F514=\"\",\"\",IF(ISERROR(VLOOKUP(F514,Kontoplan!A:D,2,0)),\"Konto findes ikke!\",VLOOKUP(F514,Kontoplan!A:D,2,0)))","v":"Diverse Udgifter"}]
["2021-09-10",253,null,null,null,12310,null,72.5,{"$f":"IF(F515=\"\",\"\",IF(ISERROR(VLOOKUP(F515,Kontoplan!A:D,2,0)),\"Konto findes ikke!\",VLOOKUP(F515,Kontoplan!A:D,2,0)))","v":"Bank konto"}]
["2021-09-10",254,null,null,null,2100,28,null,{"$f":"IF(F516=\"\",\"\",IF(ISERROR(VLOOKUP(F516,Kontoplan!A:D,2,0)),\"Konto findes ikke!\",VLOOKUP(F516,Kontoplan!A:D,2,0)))","v":"Forplejning til møder/Rejser"}]
["2021-09-10",254,null,null,null,12310,null,28,{"$f":"IF(F517=\"\",\"\",IF(ISERROR(VLOOKUP(F517,Kontoplan!A:D,2,0)),\"Konto findes ikke!\",VLOOKUP(F517,Kontoplan!A:D,2,0)))","v":"Bank konto"}]
["2021-09-10",255,null,null,null,2055,198.75,null,{"$f":"IF(F518=\"\",\"\",IF(ISERROR(VLOOKUP(F518,Kontoplan!A:D,2,0)),\"Konto findes ikke!\",VLOOKUP(F518,Kontoplan!A:D,2,0)))","v":"Indkøb af øl + vand"}]
["2021-09-10",255,null,null,null,12310,null,198.75,{"$f":"IF(F519=\"\",\"\",IF(ISERROR(VLOOKUP(F519,Kontoplan!A:D,2,0)),\"Konto findes ikke!\",VLOOKUP(F519,Kontoplan!A:D,2,0)))","v":"Bank konto"}]
["2021-09-10",256,null,null,null,2200,150,null,{"$f":"IF(F520=\"\",\"\",IF(ISERROR(VLOOKUP(F520,Kontoplan!A:D,2,0)),\"Konto findes ikke!\",VLOOKUP(F520,Kontoplan!A:D,2,0)))","v":"Kontingenter overført til KVB"}]
["2021-09-10",256,null,null,null,12310,null,150,{"$f":"IF(F521=\"\",\"\",IF(ISERROR(VLOOKUP(F521,Kontoplan!A:D,2,0)),\"Konto findes ikke!\",VLOOKUP(F521,Kontoplan!A:D,2,0)))","v":"Bank konto"}]
["2021-09-10",257,null,null,null,12320,315,null,{"$f":"IF(F522=\"\",\"\",IF(ISERROR(VLOOKUP(F522,Kontoplan!A:D,2,0)),\"Konto findes ikke!\",VLOOKUP(F522,Kontoplan!A:D,2,0)))","v":"Kasse"}]
["2021-09-10",257,null,null,null,1010,null,315,{"$f":"IF(F523=\"\",\"\",IF(ISERROR(VLOOKUP(F523,Kontoplan!A:D,2,0)),\"Konto findes ikke!\",VLOOKUP(F523,Kontoplan!A:D,2,0)))","v":"Kiosk salg"}]
["2021-09-11",258,null,null,null,12320,1486.5,null,{"$f":"IF(F524=\"\",\"\",IF(ISERROR(VLOOKUP(F524,Kontoplan!A:D,2,0)),\"Konto findes ikke!\",VLOOKUP(F524,Kontoplan!A:D,2,0)))","v":"Kasse"}]
["2021-09-11",258,null,null,null,1010,null,1486.5,{"$f":"IF(F525=\"\",\"\",IF(ISERROR(VLOOKUP(F525,Kontoplan!A:D,2,0)),\"Konto findes ikke!\",VLOOKUP(F525,Kontoplan!A:D,2,0)))","v":"Kiosk salg"}]
["2021-09-11",259,null,null,null,2140,2,null,{"$f":"IF(F526=\"\",\"\",IF(ISERROR(VLOOKUP(F526,Kontoplan!A:D,2,0)),\"Konto findes ikke!\",VLOOKUP(F526,Kontoplan!A:D,2,0)))","v":"Kassedifferance"}]
["2021-09-11",259,null,null,null,12320,null,2,{"$f":"IF(F527=\"\",\"\",IF(ISERROR(VLOOKUP(F527,Kontoplan!A:D,2,0)),\"Konto findes ikke!\",VLOOKUP(F527,Kontoplan!A:D,2,0)))","v":"Kasse"}]
["2021-09-14",260,null,null,null,12310,4681.8,null,{"$f":"IF(F528=\"\",\"\",IF(ISERROR(VLOOKUP(F528,Kontoplan!A:D,2,0)),\"Konto findes ikke!\",VLOOKUP(F528,Kontoplan!A:D,2,0)))","v":"Bank konto"}]
["2021-09-14",260,null,null,null,1000,null,4681.8,{"$f":"IF(F529=\"\",\"\",IF(ISERROR(VLOOKUP(F529,Kontoplan!A:D,2,0)),\"Konto findes ikke!\",VLOOKUP(F529,Kontoplan!A:D,2,0)))","v":"Entre"}]
["2021-09-14",261,null,null,null,12310,600,null,{"$f":"IF(F530=\"\",\"\",IF(ISERROR(VLOOKUP(F530,Kontoplan!A:D,2,0)),\"Konto findes ikke!\",VLOOKUP(F530,Kontoplan!A:D,2,0)))","v":"Bank konto"}]
["2021-09-14",261,null,null,null,1000,null,600,{"$f":"IF(F531=\"\",\"\",IF(ISERROR(VLOOKUP(F531,Kontoplan!A:D,2,0)),\"Konto findes ikke!\",VLOOKUP(F531,Kontoplan!A:D,2,0)))","v":"Entre"}]
["2021-09-14",262,null,null,null,12310,20000,null,{"$f":"IF(F532=\"\",\"\",IF(ISERROR(VLOOKUP(F532,Kontoplan!A:D,2,0)),\"Konto findes ikke!\",VLOOKUP(F532,Kontoplan!A:D,2,0)))","v":"Bank konto"}]
["2021-09-14",262,null,null,null,1040,null,20000,{"$f":"IF(F533=\"\",\"\",IF(ISERROR(VLOOKUP(F533,Kontoplan!A:D,2,0)),\"Konto findes ikke!\",VLOOKUP(F533,Kontoplan!A:D,2,0)))","v":"Fonde/Gaver"}]
["2021-09-15",263,null,null,null,12310,3812,null,{"$f":"IF(F534=\"\",\"\",IF(ISERROR(VLOOKUP(F534,Kontoplan!A:D,2,0)),\"Konto findes ikke!\",VLOOKUP(F534,Kontoplan!A:D,2,0)))","v":"Bank konto"}]
["2021-09-15",263,null,null,null,12320,null,3812,{"$f":"IF(F535=\"\",\"\",IF(ISERROR(VLOOKUP(F535,Kontoplan!A:D,2,0)),\"Konto findes ikke!\",VLOOKUP(F535,Kontoplan!A:D,2,0)))","v":"Kasse"}]
["2021-09-15",264,null,null,null,2190,60,null,{"$f":"IF(F536=\"\",\"\",IF(ISERROR(VLOOKUP(F536,Kontoplan!A:D,2,0)),\"Konto findes ikke!\",VLOOKUP(F536,Kontoplan!A:D,2,0)))","v":"Diverse Udgifter"}]
["2021-09-15",264,null,null,null,12310,null,60,{"$f":"IF(F537=\"\",\"\",IF(ISERROR(VLOOKUP(F537,Kontoplan!A:D,2,0)),\"Konto findes ikke!\",VLOOKUP(F537,Kontoplan!A:D,2,0)))","v":"Bank konto"}]
["2021-09-15",265,null,null,null,2190,2000,null,{"$f":"IF(F538=\"\",\"\",IF(ISERROR(VLOOKUP(F538,Kontoplan!A:D,2,0)),\"Konto findes ikke!\",VLOOKUP(F538,Kontoplan!A:D,2,0)))","v":"Diverse Udgifter"}]
["2021-09-15",265,null,null,null,12310,null,2000,{"$f":"IF(F539=\"\",\"\",IF(ISERROR(VLOOKUP(F539,Kontoplan!A:D,2,0)),\"Konto findes ikke!\",VLOOKUP(F539,Kontoplan!A:D,2,0)))","v":"Bank konto"}]
["2021-09-15",266,null,null,null,2190,72.5,null,{"$f":"IF(F540=\"\",\"\",IF(ISERROR(VLOOKUP(F540,Kontoplan!A:D,2,0)),\"Konto findes ikke!\",VLOOKUP(F540,Kontoplan!A:D,2,0)))","v":"Diverse Udgifter"}]
["2021-09-15",266,null,null,null,12310,null,72.5,{"$f":"IF(F541=\"\",\"\",IF(ISERROR(VLOOKUP(F541,Kontoplan!A:D,2,0)),\"Konto findes ikke!\",VLOOKUP(F541,Kontoplan!A:D,2,0)))","v":"Bank konto"}]
["2021-09-15",267,null,null,null,3100,750,null,{"$f":"IF(F542=\"\",\"\",IF(ISERROR(VLOOKUP(F542,Kontoplan!A:D,2,0)),\"Konto findes ikke!\",VLOOKUP(F542,Kontoplan!A:D,2,0)))","v":"Lønomkostninger"}]
["2021-09-15",267,null,null,null,12310,null,750,{"$f":"IF(F543=\"\",\"\",IF(ISERROR(VLOOKUP(F543,Kontoplan!A:D,2,0)),\"Konto findes ikke!\",VLOOKUP(F543,Kontoplan!A:D,2,0)))","v":"Bank konto"}]
["2021-09-15",268,null,null,null,12320,800,null,{"$f":"IF(F544=\"\",\"\",IF(ISERROR(VLOOKUP(F544,Kontoplan!A:D,2,0)),\"Konto findes ikke!\",VLOOKUP(F544,Kontoplan!A:D,2,0)))","v":"Kasse"}]
["2021-09-15",268,null,null,null,1010,null,800,{"$f":"IF(F545=\"\",\"\",IF(ISERROR(VLOOKUP(F545,Kontoplan!A:D,2,0)),\"Konto findes ikke!\",VLOOKUP(F545,Kontoplan!A:D,2,0)))","v":"Kiosk salg"}]
["2021-09-16",269,null,null,null,12310,null,50,{"$f":"IF(F546=\"\",\"\",IF(ISERROR(VLOOKUP(F546,Kontoplan!A:D,2,0)),\"Konto findes ikke!\",VLOOKUP(F546,Kontoplan!A:D,2,0)))","v":"Bank konto"}]
["2021-09-16",269,null,null,null,2060,50,null,{"$f":"IF(F547=\"\",\"\",IF(ISERROR(VLOOKUP(F547,Kontoplan!A:D,2,0)),\"Konto findes ikke!\",VLOOKUP(F547,Kontoplan!A:D,2,0)))","v":"Internet, mobiltelefon, Forsik."}]
["2021-09-16",270,null,null,null,12320,240,null,{"$f":"IF(F548=\"\",\"\",IF(ISERROR(VLOOKUP(F548,Kontoplan!A:D,2,0)),\"Konto findes ikke!\",VLOOKUP(F548,Kontoplan!A:D,2,0)))","v":"Kasse"}]
["2021-09-16",270,null,null,null,1010,null,240,{"$f":"IF(F549=\"\",\"\",IF(ISERROR(VLOOKUP(F549,Kontoplan!A:D,2,0)),\"Konto findes ikke!\",VLOOKUP(F549,Kontoplan!A:D,2,0)))","v":"Kiosk salg"}]
["2021-09-16",271,null,null,null,12310,140,null,{"$f":"IF(F550=\"\",\"\",IF(ISERROR(VLOOKUP(F550,Kontoplan!A:D,2,0)),\"Konto findes ikke!\",VLOOKUP(F550,Kontoplan!A:D,2,0)))","v":"Bank konto"}]
["2021-09-16",271,null,null,null,1000,null,140,{"$f":"IF(F551=\"\",\"\",IF(ISERROR(VLOOKUP(F551,Kontoplan!A:D,2,0)),\"Konto findes ikke!\",VLOOKUP(F551,Kontoplan!A:D,2,0)))","v":"Entre"}]
["2021-09-17",272,null,null,null,12310,null,94.1,{"$f":"IF(F552=\"\",\"\",IF(ISERROR(VLOOKUP(F552,Kontoplan!A:D,2,0)),\"Konto findes ikke!\",VLOOKUP(F552,Kontoplan!A:D,2,0)))","v":"Bank konto"}]
["2021-09-17",272,null,null,null,2100,94.1,null,{"$f":"IF(F553=\"\",\"\",IF(ISERROR(VLOOKUP(F553,Kontoplan!A:D,2,0)),\"Konto findes ikke!\",VLOOKUP(F553,Kontoplan!A:D,2,0)))","v":"Forplejning til møder/Rejser"}]
["2021-09-17",273,null,null,null,12320,135,null,{"$f":"IF(F554=\"\",\"\",IF(ISERROR(VLOOKUP(F554,Kontoplan!A:D,2,0)),\"Konto findes ikke!\",VLOOKUP(F554,Kontoplan!A:D,2,0)))","v":"Kasse"}]
["2021-09-17",273,null,null,null,1010,null,135,{"$f":"IF(F555=\"\",\"\",IF(ISERROR(VLOOKUP(F555,Kontoplan!A:D,2,0)),\"Konto findes ikke!\",VLOOKUP(F555,Kontoplan!A:D,2,0)))","v":"Kiosk salg"}]
["2021-09-18",274,null,null,null,12320,105,null,{"$f":"IF(F556=\"\",\"\",IF(ISERROR(VLOOKUP(F556,Kontoplan!A:D,2,0)),\"Konto findes ikke!\",VLOOKUP(F556,Kontoplan!A:D,2,0)))","v":"Kasse"}]
["2021-09-18",274,null,null,null,1010,null,105,{"$f":"IF(F557=\"\",\"\",IF(ISERROR(VLOOKUP(F557,Kontoplan!A:D,2,0)),\"Konto findes ikke!\",VLOOKUP(F557,Kontoplan!A:D,2,0)))","v":"Kiosk salg"}]
["2021-09-21",275,null,null,null,12310,3181.67,null,{"$f":"IF(F558=\"\",\"\",IF(ISERROR(VLOOKUP(F558,Kontoplan!A:D,2,0)),\"Konto findes ikke!\",VLOOKUP(F558,Kontoplan!A:D,2,0)))","v":"Bank konto"}]
["2021-09-21",275,null,null,null,1000,null,3181.67,{"$f":"IF(F559=\"\",\"\",IF(ISERROR(VLOOKUP(F559,Kontoplan!A:D,2,0)),\"Konto findes ikke!\",VLOOKUP(F559,Kontoplan!A:D,2,0)))","v":"Entre"}]
["2021-09-22",276,null,null,null,12320,420,null,{"$f":"IF(F560=\"\",\"\",IF(ISERROR(VLOOKUP(F560,Kontoplan!A:D,2,0)),\"Konto findes ikke!\",VLOOKUP(F560,Kontoplan!A:D,2,0)))","v":"Kasse"}]
["2021-09-22",276,null,null,null,1010,null,420,{"$f":"IF(F561=\"\",\"\",IF(ISERROR(VLOOKUP(F561,Kontoplan!A:D,2,0)),\"Konto findes ikke!\",VLOOKUP(F561,Kontoplan!A:D,2,0)))","v":"Kiosk salg"}]
["2021-09-23",277,null,null,null,12320,1310,null,{"$f":"IF(F562=\"\",\"\",IF(ISERROR(VLOOKUP(F562,Kontoplan!A:D,2,0)),\"Konto findes ikke!\",VLOOKUP(F562,Kontoplan!A:D,2,0)))","v":"Kasse"}]
["2021-09-23",277,null,null,null,1010,null,1310,{"$f":"IF(F563=\"\",\"\",IF(ISERROR(VLOOKUP(F563,Kontoplan!A:D,2,0)),\"Konto findes ikke!\",VLOOKUP(F563,Kontoplan!A:D,2,0)))","v":"Kiosk salg"}]
["2021-09-24",278,null,null,null,12320,65,null,{"$f":"IF(F564=\"\",\"\",IF(ISERROR(VLOOKUP(F564,Kontoplan!A:D,2,0)),\"Konto findes ikke!\",VLOOKUP(F564,Kontoplan!A:D,2,0)))","v":"Kasse"}]
["2021-09-24",278,null,null,null,1010,null,65,{"$f":"IF(F565=\"\",\"\",IF(ISERROR(VLOOKUP(F565,Kontoplan!A:D,2,0)),\"Konto findes ikke!\",VLOOKUP(F565,Kontoplan!A:D,2,0)))","v":"Kiosk salg"}]
["2021-09-24",279,null,null,null,12310,3730,null,{"$f":"IF(F566=\"\",\"\",IF(ISERROR(VLOOKUP(F566,Kontoplan!A:D,2,0)),\"Konto findes ikke!\",VLOOKUP(F566,Kontoplan!A:D,2,0)))","v":"Bank konto"}]
["2021-09-24",279,null,null,null,12320,null,3730,{"$f":"IF(F567=\"\",\"\",IF(ISERROR(VLOOKUP(F567,Kontoplan!A:D,2,0)),\"Konto findes ikke!\",VLOOKUP(F567,Kontoplan!A:D,2,0)))","v":"Kasse"}]
["2021-09-24",280,null,null,null,12310,2000,null,{"$f":"IF(F568=\"\",\"\",IF(ISERROR(VLOOKUP(F568,Kontoplan!A:D,2,0)),\"Konto findes ikke!\",VLOOKUP(F568,Kontoplan!A:D,2,0)))","v":"Bank konto"}]
["2021-09-24",280,null,null,null,1000,null,2000,{"$f":"IF(F569=\"\",\"\",IF(ISERROR(VLOOKUP(F569,Kontoplan!A:D,2,0)),\"Konto findes ikke!\",VLOOKUP(F569,Kontoplan!A:D,2,0)))","v":"Entre"}]
["2021-09-28",281,null,null,null,12310,4319.0600000000004,null,{"$f":"IF(F570=\"\",\"\",IF(ISERROR(VLOOKUP(F570,Kontoplan!A:D,2,0)),\"Konto findes ikke!\",VLOOKUP(F570,Kontoplan!A:D,2,0)))","v":"Bank konto"}]
["2021-09-28",281,null,null,null,1000,null,4319.0600000000004,{"$f":"IF(F571=\"\",\"\",IF(ISERROR(VLOOKUP(F571,Kontoplan!A:D,2,0)),\"Konto findes ikke!\",VLOOKUP(F571,Kontoplan!A:D,2,0)))","v":"Entre"}]
["2021-09-28",282,null,null,null,12310,1200,null,{"$f":"IF(F572=\"\",\"\",IF(ISERROR(VLOOKUP(F572,Kontoplan!A:D,2,0)),\"Konto findes ikke!\",VLOOKUP(F572,Kontoplan!A:D,2,0)))","v":"Bank konto"}]
["2021-09-28",282,null,null,null,1000,null,1200,{"$f":"IF(F573=\"\",\"\",IF(ISERROR(VLOOKUP(F573,Kontoplan!A:D,2,0)),\"Konto findes ikke!\",VLOOKUP(F573,Kontoplan!A:D,2,0)))","v":"Entre"}]
["2021-09-29",283,null,null,null,3110,6743.45,null,{"$f":"IF(F574=\"\",\"\",IF(ISERROR(VLOOKUP(F574,Kontoplan!A:D,2,0)),\"Konto findes ikke!\",VLOOKUP(F574,Kontoplan!A:D,2,0)))","v":"Lønninger incl ATP -AM"}]
["2021-09-29",283,null,null,null,12310,null,6743.45,{"$f":"IF(F575=\"\",\"\",IF(ISERROR(VLOOKUP(F575,Kontoplan!A:D,2,0)),\"Konto findes ikke!\",VLOOKUP(F575,Kontoplan!A:D,2,0)))","v":"Bank konto"}]
["2021-09-29",284,null,null,null,12320,200,null,{"$f":"IF(F576=\"\",\"\",IF(ISERROR(VLOOKUP(F576,Kontoplan!A:D,2,0)),\"Konto findes ikke!\",VLOOKUP(F576,Kontoplan!A:D,2,0)))","v":"Kasse"}]
["2021-09-29",284,null,null,null,1010,null,200,{"$f":"IF(F577=\"\",\"\",IF(ISERROR(VLOOKUP(F577,Kontoplan!A:D,2,0)),\"Konto findes ikke!\",VLOOKUP(F577,Kontoplan!A:D,2,0)))","v":"Kiosk salg"}]
["2021-09-30",285,null,null,null,2000,107,null,{"$f":"IF(F578=\"\",\"\",IF(ISERROR(VLOOKUP(F578,Kontoplan!A:D,2,0)),\"Konto findes ikke!\",VLOOKUP(F578,Kontoplan!A:D,2,0)))","v":"Bankgebyr"}]
["2021-09-30",285,null,null,null,12310,null,107,{"$f":"IF(F579=\"\",\"\",IF(ISERROR(VLOOKUP(F579,Kontoplan!A:D,2,0)),\"Konto findes ikke!\",VLOOKUP(F579,Kontoplan!A:D,2,0)))","v":"Bank konto"}]
["2021-09-30",286,null,null,null,12320,200,null,{"$f":"IF(F580=\"\",\"\",IF(ISERROR(VLOOKUP(F580,Kontoplan!A:D,2,0)),\"Konto findes ikke!\",VLOOKUP(F580,Kontoplan!A:D,2,0)))","v":"Kasse"}]
["2021-09-30",286,null,null,null,1010,null,200,{"$f":"IF(F581=\"\",\"\",IF(ISERROR(VLOOKUP(F581,Kontoplan!A:D,2,0)),\"Konto findes ikke!\",VLOOKUP(F581,Kontoplan!A:D,2,0)))","v":"Kiosk salg"}]
["2021-10-01",287,null,null,null,2060,377.75,null,{"$f":"IF(F582=\"\",\"\",IF(ISERROR(VLOOKUP(F582,Kontoplan!A:D,2,0)),\"Konto findes ikke!\",VLOOKUP(F582,Kontoplan!A:D,2,0)))","v":"Internet, mobiltelefon, Forsik."}]
["2021-10-01",287,null,null,null,12310,null,377.75,{"$f":"IF(F583=\"\",\"\",IF(ISERROR(VLOOKUP(F583,Kontoplan!A:D,2,0)),\"Konto findes ikke!\",VLOOKUP(F583,Kontoplan!A:D,2,0)))","v":"Bank konto"}]
["2021-10-01",288,null,null,null,2190,324.38,null,{"$f":"IF(F584=\"\",\"\",IF(ISERROR(VLOOKUP(F584,Kontoplan!A:D,2,0)),\"Konto findes ikke!\",VLOOKUP(F584,Kontoplan!A:D,2,0)))","v":"Diverse Udgifter"}]
["2021-10-01",288,null,null,null,12310,null,324.38,{"$f":"IF(F585=\"\",\"\",IF(ISERROR(VLOOKUP(F585,Kontoplan!A:D,2,0)),\"Konto findes ikke!\",VLOOKUP(F585,Kontoplan!A:D,2,0)))","v":"Bank konto"}]
["2021-10-01",289,null,null,null,2110,1288.83,null,{"$f":"IF(F586=\"\",\"\",IF(ISERROR(VLOOKUP(F586,Kontoplan!A:D,2,0)),\"Konto findes ikke!\",VLOOKUP(F586,Kontoplan!A:D,2,0)))","v":"Kontorhold - Porto - IT"}]
["2021-10-01",289,null,null,null,12310,null,1288.83,{"$f":"IF(F587=\"\",\"\",IF(ISERROR(VLOOKUP(F587,Kontoplan!A:D,2,0)),\"Konto findes ikke!\",VLOOKUP(F587,Kontoplan!A:D,2,0)))","v":"Bank konto"}]
["2021-10-01",290,null,null,null,2030,3444.23,null,{"$f":"IF(F588=\"\",\"\",IF(ISERROR(VLOOKUP(F588,Kontoplan!A:D,2,0)),\"Konto findes ikke!\",VLOOKUP(F588,Kontoplan!A:D,2,0)))","v":"Bygnings vedligehold"}]
["2021-10-01",290,null,null,null,12310,null,3444.23,{"$f":"IF(F589=\"\",\"\",IF(ISERROR(VLOOKUP(F589,Kontoplan!A:D,2,0)),\"Konto findes ikke!\",VLOOKUP(F589,Kontoplan!A:D,2,0)))","v":"Bank konto"}]
["2021-10-01",291,null,null,null,12320,50,null,{"$f":"IF(F590=\"\",\"\",IF(ISERROR(VLOOKUP(F590,Kontoplan!A:D,2,0)),\"Konto findes ikke!\",VLOOKUP(F590,Kontoplan!A:D,2,0)))","v":"Kasse"}]
["2021-10-01",291,null,null,null,1010,null,50,{"$f":"IF(F591=\"\",\"\",IF(ISERROR(VLOOKUP(F591,Kontoplan!A:D,2,0)),\"Konto findes ikke!\",VLOOKUP(F591,Kontoplan!A:D,2,0)))","v":"Kiosk salg"}]
["2021-10-02",292,null,null,null,12320,243,null,{"$f":"IF(F592=\"\",\"\",IF(ISERROR(VLOOKUP(F592,Kontoplan!A:D,2,0)),\"Konto findes ikke!\",VLOOKUP(F592,Kontoplan!A:D,2,0)))","v":"Kasse"}]
["2021-10-02",292,null,null,null,1010,null,243,{"$f":"IF(F593=\"\",\"\",IF(ISERROR(VLOOKUP(F593,Kontoplan!A:D,2,0)),\"Konto findes ikke!\",VLOOKUP(F593,Kontoplan!A:D,2,0)))","v":"Kiosk salg"}]
["2021-10-04",293,null,null,null,3135,79826.42,null,{"$f":"IF(F594=\"\",\"\",IF(ISERROR(VLOOKUP(F594,Kontoplan!A:D,2,0)),\"Konto findes ikke!\",VLOOKUP(F594,Kontoplan!A:D,2,0)))","v":"Gl. Skat og Gebyr"}]
["2021-10-04",293,null,null,null,12310,null,79826.42,{"$f":"IF(F595=\"\",\"\",IF(ISERROR(VLOOKUP(F595,Kontoplan!A:D,2,0)),\"Konto findes ikke!\",VLOOKUP(F595,Kontoplan!A:D,2,0)))","v":"Bank konto"}]
["2021-10-05",294,null,null,null,2060,19,null,{"$f":"IF(F596=\"\",\"\",IF(ISERROR(VLOOKUP(F596,Kontoplan!A:D,2,0)),\"Konto findes ikke!\",VLOOKUP(F596,Kontoplan!A:D,2,0)))","v":"Internet, mobiltelefon, Forsik."}]
["2021-10-05",294,null,null,null,12310,null,19,{"$f":"IF(F597=\"\",\"\",IF(ISERROR(VLOOKUP(F597,Kontoplan!A:D,2,0)),\"Konto findes ikke!\",VLOOKUP(F597,Kontoplan!A:D,2,0)))","v":"Bank konto"}]
["2021-10-05",295,null,null,null,1125,null,250,{"$f":"IF(F598=\"\",\"\",IF(ISERROR(VLOOKUP(F598,Kontoplan!A:D,2,0)),\"Konto findes ikke!\",VLOOKUP(F598,Kontoplan!A:D,2,0)))","v":"Salg af inventar"}]
["2021-10-05",295,null,null,null,12310,250,null,{"$f":"IF(F599=\"\",\"\",IF(ISERROR(VLOOKUP(F599,Kontoplan!A:D,2,0)),\"Konto findes ikke!\",VLOOKUP(F599,Kontoplan!A:D,2,0)))","v":"Bank konto"}]
["2021-10-05",296,null,null,null,12310,2843.39,null,{"$f":"IF(F600=\"\",\"\",IF(ISERROR(VLOOKUP(F600,Kontoplan!A:D,2,0)),\"Konto findes ikke!\",VLOOKUP(F600,Kontoplan!A:D,2,0)))","v":"Bank konto"}]
["2021-10-05",296,null,null,null,1000,null,2843.39,{"$f":"IF(F601=\"\",\"\",IF(ISERROR(VLOOKUP(F601,Kontoplan!A:D,2,0)),\"Konto findes ikke!\",VLOOKUP(F601,Kontoplan!A:D,2,0)))","v":"Entre"}]
["2021-10-05",297,null,null,null,2010,125,null,{"$f":"IF(F602=\"\",\"\",IF(ISERROR(VLOOKUP(F602,Kontoplan!A:D,2,0)),\"Konto findes ikke!\",VLOOKUP(F602,Kontoplan!A:D,2,0)))","v":"Danløn"}]
["2021-10-05",297,null,null,null,12310,null,125,{"$f":"IF(F603=\"\",\"\",IF(ISERROR(VLOOKUP(F603,Kontoplan!A:D,2,0)),\"Konto findes ikke!\",VLOOKUP(F603,Kontoplan!A:D,2,0)))","v":"Bank konto"}]
["2021-10-05",298,null,null,null,2060,472.82,null,{"$f":"IF(F604=\"\",\"\",IF(ISERROR(VLOOKUP(F604,Kontoplan!A:D,2,0)),\"Konto findes ikke!\",VLOOKUP(F604,Kontoplan!A:D,2,0)))","v":"Internet, mobiltelefon, Forsik."}]
["2021-10-05",298,null,null,null,12310,null,472.82,{"$f":"IF(F605=\"\",\"\",IF(ISERROR(VLOOKUP(F605,Kontoplan!A:D,2,0)),\"Konto findes ikke!\",VLOOKUP(F605,Kontoplan!A:D,2,0)))","v":"Bank konto"}]
["2021-10-05",299,null,null,null,2025,120.31,null,{"$f":"IF(F606=\"\",\"\",IF(ISERROR(VLOOKUP(F606,Kontoplan!A:D,2,0)),\"Konto findes ikke!\",VLOOKUP(F606,Kontoplan!A:D,2,0)))","v":"Regnskabsservice"}]
["2021-10-05",299,null,null,null,12310,null,120.31,{"$f":"IF(F607=\"\",\"\",IF(ISERROR(VLOOKUP(F607,Kontoplan!A:D,2,0)),\"Konto findes ikke!\",VLOOKUP(F607,Kontoplan!A:D,2,0)))","v":"Bank konto"}]
["2021-10-07",300,null,null,null,2035,62.57,null,{"$f":"IF(F608=\"\",\"\",IF(ISERROR(VLOOKUP(F608,Kontoplan!A:D,2,0)),\"Konto findes ikke!\",VLOOKUP(F608,Kontoplan!A:D,2,0)))","v":"Grønne områder"}]
["2021-10-07",300,null,null,null,12310,null,62.57,{"$f":"IF(F609=\"\",\"\",IF(ISERROR(VLOOKUP(F609,Kontoplan!A:D,2,0)),\"Konto findes ikke!\",VLOOKUP(F609,Kontoplan!A:D,2,0)))","v":"Bank konto"}]
["2021-10-08",301,null,null,null,2165,124.44,null,{"$f":"IF(F610=\"\",\"\",IF(ISERROR(VLOOKUP(F610,Kontoplan!A:D,2,0)),\"Konto findes ikke!\",VLOOKUP(F610,Kontoplan!A:D,2,0)))","v":"G4S tyverialarm"}]
["2021-10-08",301,null,null,null,12310,null,124.44,{"$f":"IF(F611=\"\",\"\",IF(ISERROR(VLOOKUP(F611,Kontoplan!A:D,2,0)),\"Konto findes ikke!\",VLOOKUP(F611,Kontoplan!A:D,2,0)))","v":"Bank konto"}]
["2021-10-10",302,null,null,null,12320,295,null,{"$f":"IF(F612=\"\",\"\",IF(ISERROR(VLOOKUP(F612,Kontoplan!A:D,2,0)),\"Konto findes ikke!\",VLOOKUP(F612,Kontoplan!A:D,2,0)))","v":"Kasse"}]
["2021-10-10",302,null,null,null,1010,null,295,{"$f":"IF(F613=\"\",\"\",IF(ISERROR(VLOOKUP(F613,Kontoplan!A:D,2,0)),\"Konto findes ikke!\",VLOOKUP(F613,Kontoplan!A:D,2,0)))","v":"Kiosk salg"}]
["2021-10-10",303,null,null,null,12320,830,null,{"$f":"IF(F614=\"\",\"\",IF(ISERROR(VLOOKUP(F614,Kontoplan!A:D,2,0)),\"Konto findes ikke!\",VLOOKUP(F614,Kontoplan!A:D,2,0)))","v":"Kasse"}]
["2021-10-10",303,null,null,null,1010,null,830,{"$f":"IF(F615=\"\",\"\",IF(ISERROR(VLOOKUP(F615,Kontoplan!A:D,2,0)),\"Konto findes ikke!\",VLOOKUP(F615,Kontoplan!A:D,2,0)))","v":"Kiosk salg"}]
["2021-10-10",304,null,null,null,12320,65,null,{"$f":"IF(F616=\"\",\"\",IF(ISERROR(VLOOKUP(F616,Kontoplan!A:D,2,0)),\"Konto findes ikke!\",VLOOKUP(F616,Kontoplan!A:D,2,0)))","v":"Kasse"}]
["2021-10-10",304,null,null,null,1010,null,65,{"$f":"IF(F617=\"\",\"\",IF(ISERROR(VLOOKUP(F617,Kontoplan!A:D,2,0)),\"Konto findes ikke!\",VLOOKUP(F617,Kontoplan!A:D,2,0)))","v":"Kiosk salg"}]
["2021-10-10",305,null,null,null,3100,100,null,{"$f":"IF(F618=\"\",\"\",IF(ISERROR(VLOOKUP(F618,Kontoplan!A:D,2,0)),\"Konto findes ikke!\",VLOOKUP(F618,Kontoplan!A:D,2,0)))","v":"Lønomkostninger"}]
["2021-10-10",305,null,null,null,12310,null,100,{"$f":"IF(F619=\"\",\"\",IF(ISERROR(VLOOKUP(F619,Kontoplan!A:D,2,0)),\"Konto findes ikke!\",VLOOKUP(F619,Kontoplan!A:D,2,0)))","v":"Bank konto"}]
["2021-10-11",306,null,null,null,3110,3225,null,{"$f":"IF(F620=\"\",\"\",IF(ISERROR(VLOOKUP(F620,Kontoplan!A:D,2,0)),\"Konto findes ikke!\",VLOOKUP(F620,Kontoplan!A:D,2,0)))","v":"Lønninger incl ATP -AM"}]
["2021-10-11",306,null,null,null,12310,null,3225,{"$f":"IF(F621=\"\",\"\",IF(ISERROR(VLOOKUP(F621,Kontoplan!A:D,2,0)),\"Konto findes ikke!\",VLOOKUP(F621,Kontoplan!A:D,2,0)))","v":"Bank konto"}]
["2021-10-12",307,null,null,null,12310,705.95,null,{"$f":"IF(F622=\"\",\"\",IF(ISERROR(VLOOKUP(F622,Kontoplan!A:D,2,0)),\"Konto findes ikke!\",VLOOKUP(F622,Kontoplan!A:D,2,0)))","v":"Bank konto"}]
["2021-10-12",307,null,null,null,1000,null,705.95,{"$f":"IF(F623=\"\",\"\",IF(ISERROR(VLOOKUP(F623,Kontoplan!A:D,2,0)),\"Konto findes ikke!\",VLOOKUP(F623,Kontoplan!A:D,2,0)))","v":"Entre"}]
["2021-10-14",308,null,null,null,2010,246.46,null,{"$f":"IF(F624=\"\",\"\",IF(ISERROR(VLOOKUP(F624,Kontoplan!A:D,2,0)),\"Konto findes ikke!\",VLOOKUP(F624,Kontoplan!A:D,2,0)))","v":"Danløn"}]
["2021-10-14",308,null,null,null,12310,null,246.46,{"$f":"IF(F625=\"\",\"\",IF(ISERROR(VLOOKUP(F625,Kontoplan!A:D,2,0)),\"Konto findes ikke!\",VLOOKUP(F625,Kontoplan!A:D,2,0)))","v":"Bank konto"}]
["2021-10-15",309,null,null,null,2065,29150,null,{"$f":"IF(F626=\"\",\"\",IF(ISERROR(VLOOKUP(F626,Kontoplan!A:D,2,0)),\"Konto findes ikke!\",VLOOKUP(F626,Kontoplan!A:D,2,0)))","v":"Udstilling"}]
["2021-10-15",309,null,null,null,12310,null,29150,{"$f":"IF(F627=\"\",\"\",IF(ISERROR(VLOOKUP(F627,Kontoplan!A:D,2,0)),\"Konto findes ikke!\",VLOOKUP(F627,Kontoplan!A:D,2,0)))","v":"Bank konto"}]
["2021-10-17",310,null,null,null,12310,30000,null,{"$f":"IF(F628=\"\",\"\",IF(ISERROR(VLOOKUP(F628,Kontoplan!A:D,2,0)),\"Konto findes ikke!\",VLOOKUP(F628,Kontoplan!A:D,2,0)))","v":"Bank konto"}]
["2021-10-17",310,null,null,null,1030,null,30000,{"$f":"IF(F629=\"\",\"\",IF(ISERROR(VLOOKUP(F629,Kontoplan!A:D,2,0)),\"Konto findes ikke!\",VLOOKUP(F629,Kontoplan!A:D,2,0)))","v":"Tilskud fra KVB"}]
["2021-10-18",311,null,null,null,12320,220,null,{"$f":"IF(F630=\"\",\"\",IF(ISERROR(VLOOKUP(F630,Kontoplan!A:D,2,0)),\"Konto findes ikke!\",VLOOKUP(F630,Kontoplan!A:D,2,0)))","v":"Kasse"}]
["2021-10-18",311,null,null,null,1010,null,220,{"$f":"IF(F631=\"\",\"\",IF(ISERROR(VLOOKUP(F631,Kontoplan!A:D,2,0)),\"Konto findes ikke!\",VLOOKUP(F631,Kontoplan!A:D,2,0)))","v":"Kiosk salg"}]
["2021-10-18",312,null,null,null,12320,100,null,{"$f":"IF(F632=\"\",\"\",IF(ISERROR(VLOOKUP(F632,Kontoplan!A:D,2,0)),\"Konto findes ikke!\",VLOOKUP(F632,Kontoplan!A:D,2,0)))","v":"Kasse"}]
["2021-10-18",312,null,null,null,1010,null,100,{"$f":"IF(F633=\"\",\"\",IF(ISERROR(VLOOKUP(F633,Kontoplan!A:D,2,0)),\"Konto findes ikke!\",VLOOKUP(F633,Kontoplan!A:D,2,0)))","v":"Kiosk salg"}]
["2021-10-18",313,null,null,null,12320,100,null,{"$f":"IF(F634=\"\",\"\",IF(ISERROR(VLOOKUP(F634,Kontoplan!A:D,2,0)),\"Konto findes ikke!\",VLOOKUP(F634,Kontoplan!A:D,2,0)))","v":"Kasse"}]
["2021-10-18",313,null,null,null,1010,null,100,{"$f":"IF(F635=\"\",\"\",IF(ISERROR(VLOOKUP(F635,Kontoplan!A:D,2,0)),\"Konto findes ikke!\",VLOOKUP(F635,Kontoplan!A:D,2,0)))","v":"Kiosk salg"}]
["2021-10-18",314,null,null,null,12320,490,null,{"$f":"IF(F636=\"\",\"\",IF(ISERROR(VLOOKUP(F636,Kontoplan!A:D,2,0)),\"Konto findes ikke!\",VLOOKUP(F636,Kontoplan!A:D,2,0)))","v":"Kasse"}]
["2021-10-18",314,null,null,null,1010,null,490,{"$f":"IF(F637=\"\",\"\",IF(ISERROR(VLOOKUP(F637,Kontoplan!A:D,2,0)),\"Konto findes ikke!\",VLOOKUP(F637,Kontoplan!A:D,2,0)))","v":"Kiosk salg"}]
["2021-10-18",315,null,null,null,2075,200,null,{"$f":"IF(F638=\"\",\"\",IF(ISERROR(VLOOKUP(F638,Kontoplan!A:D,2,0)),\"Konto findes ikke!\",VLOOKUP(F638,Kontoplan!A:D,2,0)))","v":"Gaver"}]
["2021-10-18",315,null,null,null,12310,null,200,{"$f":"IF(F639=\"\",\"\",IF(ISERROR(VLOOKUP(F639,Kontoplan!A:D,2,0)),\"Konto findes ikke!\",VLOOKUP(F639,Kontoplan!A:D,2,0)))","v":"Bank konto"}]
["2021-10-18",316,null,null,null,2060,375,null,{"$f":"IF(F640=\"\",\"\",IF(ISERROR(VLOOKUP(F640,Kontoplan!A:D,2,0)),\"Konto findes ikke!\",VLOOKUP(F640,Kontoplan!A:D,2,0)))","v":"Internet, mobiltelefon, Forsik."}]
["2021-10-18",316,null,null,null,12310,null,375,{"$f":"IF(F641=\"\",\"\",IF(ISERROR(VLOOKUP(F641,Kontoplan!A:D,2,0)),\"Konto findes ikke!\",VLOOKUP(F641,Kontoplan!A:D,2,0)))","v":"Bank konto"}]
["2021-10-18",317,null,null,null,2020,12500,null,{"$f":"IF(F642=\"\",\"\",IF(ISERROR(VLOOKUP(F642,Kontoplan!A:D,2,0)),\"Konto findes ikke!\",VLOOKUP(F642,Kontoplan!A:D,2,0)))","v":"Revision"}]
["2021-10-18",317,null,null,null,12310,null,12500,{"$f":"IF(F643=\"\",\"\",IF(ISERROR(VLOOKUP(F643,Kontoplan!A:D,2,0)),\"Konto findes ikke!\",VLOOKUP(F643,Kontoplan!A:D,2,0)))","v":"Bank konto"}]
["2021-10-19",318,null,null,null,12310,4083.73,null,{"$f":"IF(F644=\"\",\"\",IF(ISERROR(VLOOKUP(F644,Kontoplan!A:D,2,0)),\"Konto findes ikke!\",VLOOKUP(F644,Kontoplan!A:D,2,0)))","v":"Bank konto"}]
["2021-10-19",318,null,null,null,1000,null,4083.73,{"$f":"IF(F645=\"\",\"\",IF(ISERROR(VLOOKUP(F645,Kontoplan!A:D,2,0)),\"Konto findes ikke!\",VLOOKUP(F645,Kontoplan!A:D,2,0)))","v":"Entre"}]
["2021-10-24",319,null,null,null,12320,276,null,{"$f":"IF(F646=\"\",\"\",IF(ISERROR(VLOOKUP(F646,Kontoplan!A:D,2,0)),\"Konto findes ikke!\",VLOOKUP(F646,Kontoplan!A:D,2,0)))","v":"Kasse"}]
["2021-10-24",319,null,null,null,1010,null,276,{"$f":"IF(F647=\"\",\"\",IF(ISERROR(VLOOKUP(F647,Kontoplan!A:D,2,0)),\"Konto findes ikke!\",VLOOKUP(F647,Kontoplan!A:D,2,0)))","v":"Kiosk salg"}]
["2021-10-24",320,null,null,null,12320,564,null,{"$f":"IF(F648=\"\",\"\",IF(ISERROR(VLOOKUP(F648,Kontoplan!A:D,2,0)),\"Konto findes ikke!\",VLOOKUP(F648,Kontoplan!A:D,2,0)))","v":"Kasse"}]
["2021-10-24",320,null,null,null,1010,null,564,{"$f":"IF(F649=\"\",\"\",IF(ISERROR(VLOOKUP(F649,Kontoplan!A:D,2,0)),\"Konto findes ikke!\",VLOOKUP(F649,Kontoplan!A:D,2,0)))","v":"Kiosk salg"}]
["2021-10-24",321,null,null,null,12320,725,null,{"$f":"IF(F650=\"\",\"\",IF(ISERROR(VLOOKUP(F650,Kontoplan!A:D,2,0)),\"Konto findes ikke!\",VLOOKUP(F650,Kontoplan!A:D,2,0)))","v":"Kasse"}]
["2021-10-24",321,null,null,null,1010,null,725,{"$f":"IF(F651=\"\",\"\",IF(ISERROR(VLOOKUP(F651,Kontoplan!A:D,2,0)),\"Konto findes ikke!\",VLOOKUP(F651,Kontoplan!A:D,2,0)))","v":"Kiosk salg"}]
["2021-10-24",322,null,null,null,12320,70,null,{"$f":"IF(F652=\"\",\"\",IF(ISERROR(VLOOKUP(F652,Kontoplan!A:D,2,0)),\"Konto findes ikke!\",VLOOKUP(F652,Kontoplan!A:D,2,0)))","v":"Kasse"}]
["2021-10-24",322,null,null,null,1010,null,70,{"$f":"IF(F653=\"\",\"\",IF(ISERROR(VLOOKUP(F653,Kontoplan!A:D,2,0)),\"Konto findes ikke!\",VLOOKUP(F653,Kontoplan!A:D,2,0)))","v":"Kiosk salg"}]
["2021-10-24",323,null,null,null,2200,150,null,{"$f":"IF(F654=\"\",\"\",IF(ISERROR(VLOOKUP(F654,Kontoplan!A:D,2,0)),\"Konto findes ikke!\",VLOOKUP(F654,Kontoplan!A:D,2,0)))","v":"Kontingenter overført til KVB"}]
["2021-10-24",323,null,null,null,12310,null,150,{"$f":"IF(F655=\"\",\"\",IF(ISERROR(VLOOKUP(F655,Kontoplan!A:D,2,0)),\"Konto findes ikke!\",VLOOKUP(F655,Kontoplan!A:D,2,0)))","v":"Bank konto"}]
["2021-10-25",324,null,null,null,3135,4101.16,null,{"$f":"IF(F656=\"\",\"\",IF(ISERROR(VLOOKUP(F656,Kontoplan!A:D,2,0)),\"Konto findes ikke!\",VLOOKUP(F656,Kontoplan!A:D,2,0)))","v":"Gl. Skat og Gebyr"}]
["2021-10-25",324,null,null,null,12310,null,4101.16,{"$f":"IF(F657=\"\",\"\",IF(ISERROR(VLOOKUP(F657,Kontoplan!A:D,2,0)),\"Konto findes ikke!\",VLOOKUP(F657,Kontoplan!A:D,2,0)))","v":"Bank konto"}]
["2021-10-26",325,null,null,null,12310,13701.36,null,{"$f":"IF(F658=\"\",\"\",IF(ISERROR(VLOOKUP(F658,Kontoplan!A:D,2,0)),\"Konto findes ikke!\",VLOOKUP(F658,Kontoplan!A:D,2,0)))","v":"Bank konto"}]
["2021-10-26",325,null,null,null,1000,null,13701.36,{"$f":"IF(F659=\"\",\"\",IF(ISERROR(VLOOKUP(F659,Kontoplan!A:D,2,0)),\"Konto findes ikke!\",VLOOKUP(F659,Kontoplan!A:D,2,0)))","v":"Entre"}]
["2021-10-28",326,null,null,null,3110,6743.45,null,{"$f":"IF(F660=\"\",\"\",IF(ISERROR(VLOOKUP(F660,Kontoplan!A:D,2,0)),\"Konto findes ikke!\",VLOOKUP(F660,Kontoplan!A:D,2,0)))","v":"Lønninger incl ATP -AM"}]
["2021-10-28",326,null,null,null,12310,null,6743.45,{"$f":"IF(F661=\"\",\"\",IF(ISERROR(VLOOKUP(F661,Kontoplan!A:D,2,0)),\"Konto findes ikke!\",VLOOKUP(F661,Kontoplan!A:D,2,0)))","v":"Bank konto"}]
["2021-10-29",327,null,null,null,2000,2.5,null,{"$f":"IF(F662=\"\",\"\",IF(ISERROR(VLOOKUP(F662,Kontoplan!A:D,2,0)),\"Konto findes ikke!\",VLOOKUP(F662,Kontoplan!A:D,2,0)))","v":"Bankgebyr"}]
["2021-10-29",327,null,null,null,12310,null,2.5,{"$f":"IF(F663=\"\",\"\",IF(ISERROR(VLOOKUP(F663,Kontoplan!A:D,2,0)),\"Konto findes ikke!\",VLOOKUP(F663,Kontoplan!A:D,2,0)))","v":"Bank konto"}]
["2021-10-31",328,null,null,null,2100,585,null,{"$f":"IF(F664=\"\",\"\",IF(ISERROR(VLOOKUP(F664,Kontoplan!A:D,2,0)),\"Konto findes ikke!\",VLOOKUP(F664,Kontoplan!A:D,2,0)))","v":"Forplejning til møder/Rejser"}]
["2021-10-31",328,null,null,null,12310,null,585,{"$f":"IF(F665=\"\",\"\",IF(ISERROR(VLOOKUP(F665,Kontoplan!A:D,2,0)),\"Konto findes ikke!\",VLOOKUP(F665,Kontoplan!A:D,2,0)))","v":"Bank konto"}]
["2021-11-01",329,null,null,null,2040,2951.94,null,{"$f":"IF(F666=\"\",\"\",IF(ISERROR(VLOOKUP(F666,Kontoplan!A:D,2,0)),\"Konto findes ikke!\",VLOOKUP(F666,Kontoplan!A:D,2,0)))","v":"El, Vand og Varme"}]
["2021-11-01",329,null,null,null,12310,null,2951.94,{"$f":"IF(F667=\"\",\"\",IF(ISERROR(VLOOKUP(F667,Kontoplan!A:D,2,0)),\"Konto findes ikke!\",VLOOKUP(F667,Kontoplan!A:D,2,0)))","v":"Bank konto"}]
["2021-11-01",330,null,null,null,2040,1521.3,null,{"$f":"IF(F668=\"\",\"\",IF(ISERROR(VLOOKUP(F668,Kontoplan!A:D,2,0)),\"Konto findes ikke!\",VLOOKUP(F668,Kontoplan!A:D,2,0)))","v":"El, Vand og Varme"}]
["2021-11-01",330,null,null,null,12310,null,1521.3,{"$f":"IF(F669=\"\",\"\",IF(ISERROR(VLOOKUP(F669,Kontoplan!A:D,2,0)),\"Konto findes ikke!\",VLOOKUP(F669,Kontoplan!A:D,2,0)))","v":"Bank konto"}]
["2021-11-01",331,null,null,null,2060,377.75,null,{"$f":"IF(F670=\"\",\"\",IF(ISERROR(VLOOKUP(F670,Kontoplan!A:D,2,0)),\"Konto findes ikke!\",VLOOKUP(F670,Kontoplan!A:D,2,0)))","v":"Internet, mobiltelefon, Forsik."}]
["2021-11-01",331,null,null,null,12310,null,377.75,{"$f":"IF(F671=\"\",\"\",IF(ISERROR(VLOOKUP(F671,Kontoplan!A:D,2,0)),\"Konto findes ikke!\",VLOOKUP(F671,Kontoplan!A:D,2,0)))","v":"Bank konto"}]
["2021-11-01",332,null,null,null,2010,59.38,null,{"$f":"IF(F672=\"\",\"\",IF(ISERROR(VLOOKUP(F672,Kontoplan!A:D,2,0)),\"Konto findes ikke!\",VLOOKUP(F672,Kontoplan!A:D,2,0)))","v":"Danløn"}]
["2021-11-01",332,null,null,null,12310,null,59.38,{"$f":"IF(F673=\"\",\"\",IF(ISERROR(VLOOKUP(F673,Kontoplan!A:D,2,0)),\"Konto findes ikke!\",VLOOKUP(F673,Kontoplan!A:D,2,0)))","v":"Bank konto"}]
["2021-11-01",333,null,null,null,2110,647.65,null,{"$f":"IF(F674=\"\",\"\",IF(ISERROR(VLOOKUP(F674,Kontoplan!A:D,2,0)),\"Konto findes ikke!\",VLOOKUP(F674,Kontoplan!A:D,2,0)))","v":"Kontorhold - Porto - IT"}]
["2021-11-01",333,null,null,null,12310,null,647.65,{"$f":"IF(F675=\"\",\"\",IF(ISERROR(VLOOKUP(F675,Kontoplan!A:D,2,0)),\"Konto findes ikke!\",VLOOKUP(F675,Kontoplan!A:D,2,0)))","v":"Bank konto"}]
["2021-11-01",334,null,null,null,2025,120.31,null,{"$f":"IF(F676=\"\",\"\",IF(ISERROR(VLOOKUP(F676,Kontoplan!A:D,2,0)),\"Konto findes ikke!\",VLOOKUP(F676,Kontoplan!A:D,2,0)))","v":"Regnskabsservice"}]
["2021-11-01",334,null,null,null,12310,null,120.31,{"$f":"IF(F677=\"\",\"\",IF(ISERROR(VLOOKUP(F677,Kontoplan!A:D,2,0)),\"Konto findes ikke!\",VLOOKUP(F677,Kontoplan!A:D,2,0)))","v":"Bank konto"}]
["2021-11-04",335,null,null,null,2060,110.8,null,{"$f":"IF(F678=\"\",\"\",IF(ISERROR(VLOOKUP(F678,Kontoplan!A:D,2,0)),\"Konto findes ikke!\",VLOOKUP(F678,Kontoplan!A:D,2,0)))","v":"Internet, mobiltelefon, Forsik."}]
["2021-11-04",335,null,null,null,12310,null,110.8,{"$f":"IF(F679=\"\",\"\",IF(ISERROR(VLOOKUP(F679,Kontoplan!A:D,2,0)),\"Konto findes ikke!\",VLOOKUP(F679,Kontoplan!A:D,2,0)))","v":"Bank konto"}]
["2021-11-05",336,null,null,null,2060,19,null,{"$f":"IF(F680=\"\",\"\",IF(ISERROR(VLOOKUP(F680,Kontoplan!A:D,2,0)),\"Konto findes ikke!\",VLOOKUP(F680,Kontoplan!A:D,2,0)))","v":"Internet, mobiltelefon, Forsik."}]
["2021-11-05",336,null,null,null,12310,null,19,{"$f":"IF(F681=\"\",\"\",IF(ISERROR(VLOOKUP(F681,Kontoplan!A:D,2,0)),\"Konto findes ikke!\",VLOOKUP(F681,Kontoplan!A:D,2,0)))","v":"Bank konto"}]
["2021-11-06",337,null,null,null,12310,585,null,{"$f":"IF(F682=\"\",\"\",IF(ISERROR(VLOOKUP(F682,Kontoplan!A:D,2,0)),\"Konto findes ikke!\",VLOOKUP(F682,Kontoplan!A:D,2,0)))","v":"Bank konto"}]
["2021-11-06",337,null,null,null,1130,null,585,{"$f":"IF(F683=\"\",\"\",IF(ISERROR(VLOOKUP(F683,Kontoplan!A:D,2,0)),\"Konto findes ikke!\",VLOOKUP(F683,Kontoplan!A:D,2,0)))","v":"Diverse Indtægter"}]
["2021-11-08",338,null,null,null,3120,283.95,null,{"$f":"IF(F684=\"\",\"\",IF(ISERROR(VLOOKUP(F684,Kontoplan!A:D,2,0)),\"Konto findes ikke!\",VLOOKUP(F684,Kontoplan!A:D,2,0)))","v":"ATP"}]
["2021-11-08",338,null,null,null,12310,null,283.95,{"$f":"IF(F685=\"\",\"\",IF(ISERROR(VLOOKUP(F685,Kontoplan!A:D,2,0)),\"Konto findes ikke!\",VLOOKUP(F685,Kontoplan!A:D,2,0)))","v":"Bank konto"}]
["2021-11-09",339,null,null,null,12310,4728,null,{"$f":"IF(F686=\"\",\"\",IF(ISERROR(VLOOKUP(F686,Kontoplan!A:D,2,0)),\"Konto findes ikke!\",VLOOKUP(F686,Kontoplan!A:D,2,0)))","v":"Bank konto"}]
["2021-11-09",339,null,null,null,12320,null,4728,{"$f":"IF(F687=\"\",\"\",IF(ISERROR(VLOOKUP(F687,Kontoplan!A:D,2,0)),\"Konto findes ikke!\",VLOOKUP(F687,Kontoplan!A:D,2,0)))","v":"Kasse"}]
["2021-11-09",340,null,null,null,12310,3800,null,{"$f":"IF(F688=\"\",\"\",IF(ISERROR(VLOOKUP(F688,Kontoplan!A:D,2,0)),\"Konto findes ikke!\",VLOOKUP(F688,Kontoplan!A:D,2,0)))","v":"Bank konto"}]
["2021-11-09",340,null,null,null,1125,null,3800,{"$f":"IF(F689=\"\",\"\",IF(ISERROR(VLOOKUP(F689,Kontoplan!A:D,2,0)),\"Konto findes ikke!\",VLOOKUP(F689,Kontoplan!A:D,2,0)))","v":"Salg af inventar"}]
["2021-11-10",341,null,null,null,3110,3225,null,{"$f":"IF(F690=\"\",\"\",IF(ISERROR(VLOOKUP(F690,Kontoplan!A:D,2,0)),\"Konto findes ikke!\",VLOOKUP(F690,Kontoplan!A:D,2,0)))","v":"Lønninger incl ATP -AM"}]
["2021-11-10",341,null,null,null,12310,null,3225,{"$f":"IF(F691=\"\",\"\",IF(ISERROR(VLOOKUP(F691,Kontoplan!A:D,2,0)),\"Konto findes ikke!\",VLOOKUP(F691,Kontoplan!A:D,2,0)))","v":"Bank konto"}]
["2021-11-11",342,null,null,null,12310,853.71,null,{"$f":"IF(F692=\"\",\"\",IF(ISERROR(VLOOKUP(F692,Kontoplan!A:D,2,0)),\"Konto findes ikke!\",VLOOKUP(F692,Kontoplan!A:D,2,0)))","v":"Bank konto"}]
["2021-11-11",342,null,null,null,1110,null,853.71,{"$f":"IF(F693=\"\",\"\",IF(ISERROR(VLOOKUP(F693,Kontoplan!A:D,2,0)),\"Konto findes ikke!\",VLOOKUP(F693,Kontoplan!A:D,2,0)))","v":"A-skat Retur"}]
["2021-11-12",343,null,null,null,2030,15187.5,null,{"$f":"IF(F694=\"\",\"\",IF(ISERROR(VLOOKUP(F694,Kontoplan!A:D,2,0)),\"Konto findes ikke!\",VLOOKUP(F694,Kontoplan!A:D,2,0)))","v":"Bygnings vedligehold"}]
["2021-11-12",343,null,null,null,12310,null,15187.5,{"$f":"IF(F695=\"\",\"\",IF(ISERROR(VLOOKUP(F695,Kontoplan!A:D,2,0)),\"Konto findes ikke!\",VLOOKUP(F695,Kontoplan!A:D,2,0)))","v":"Bank konto"}]
["2021-11-18",344,null,null,null,2030,1577.5,null,{"$f":"IF(F696=\"\",\"\",IF(ISERROR(VLOOKUP(F696,Kontoplan!A:D,2,0)),\"Konto findes ikke!\",VLOOKUP(F696,Kontoplan!A:D,2,0)))","v":"Bygnings vedligehold"}]
["2021-11-18",344,null,null,null,12310,null,1577.5,{"$f":"IF(F697=\"\",\"\",IF(ISERROR(VLOOKUP(F697,Kontoplan!A:D,2,0)),\"Konto findes ikke!\",VLOOKUP(F697,Kontoplan!A:D,2,0)))","v":"Bank konto"}]
["2021-11-18",345,null,null,null,2015,12500,null,{"$f":"IF(F698=\"\",\"\",IF(ISERROR(VLOOKUP(F698,Kontoplan!A:D,2,0)),\"Konto findes ikke!\",VLOOKUP(F698,Kontoplan!A:D,2,0)))","v":"Advokat"}]
["2021-11-18",345,null,null,null,12310,null,12500,{"$f":"IF(F699=\"\",\"\",IF(ISERROR(VLOOKUP(F699,Kontoplan!A:D,2,0)),\"Konto findes ikke!\",VLOOKUP(F699,Kontoplan!A:D,2,0)))","v":"Bank konto"}]
["2021-11-19",346,null,null,null,1010,21702.22,null,{"$f":"IF(F700=\"\",\"\",IF(ISERROR(VLOOKUP(F700,Kontoplan!A:D,2,0)),\"Konto findes ikke!\",VLOOKUP(F700,Kontoplan!A:D,2,0)))","v":"Kiosk salg"},"formeget sat ind på kiosk salg"]
["2021-11-19",346,null,null,null,1000,null,21702.22,{"$f":"IF(F701=\"\",\"\",IF(ISERROR(VLOOKUP(F701,Kontoplan!A:D,2,0)),\"Konto findes ikke!\",VLOOKUP(F701,Kontoplan!A:D,2,0)))","v":"Entre"},"formeget sat ind på kiosk salg"]
["2021-11-26",347,null,null,null,2065,110,null,{"$f":"IF(F702=\"\",\"\",IF(ISERROR(VLOOKUP(F702,Kontoplan!A:D,2,0)),\"Konto findes ikke!\",VLOOKUP(F702,Kontoplan!A:D,2,0)))","v":"Udstilling"}]
["2021-11-26",347,null,null,null,12310,null,110,{"$f":"IF(F703=\"\",\"\",IF(ISERROR(VLOOKUP(F703,Kontoplan!A:D,2,0)),\"Konto findes ikke!\",VLOOKUP(F703,Kontoplan!A:D,2,0)))","v":"Bank konto"}]
["2021-11-26",348,null,null,null,3110,6743.45,null,{"$f":"IF(F704=\"\",\"\",IF(ISERROR(VLOOKUP(F704,Kontoplan!A:D,2,0)),\"Konto findes ikke!\",VLOOKUP(F704,Kontoplan!A:D,2,0)))","v":"Lønninger incl ATP -AM"}]
["2021-11-26",348,null,null,null,12310,null,6743.45,{"$f":"IF(F705=\"\",\"\",IF(ISERROR(VLOOKUP(F705,Kontoplan!A:D,2,0)),\"Konto findes ikke!\",VLOOKUP(F705,Kontoplan!A:D,2,0)))","v":"Bank konto"}]
["2021-12-01",349,null,null,null,2000,1.5,null,{"$f":"IF(F706=\"\",\"\",IF(ISERROR(VLOOKUP(F706,Kontoplan!A:D,2,0)),\"Konto findes ikke!\",VLOOKUP(F706,Kontoplan!A:D,2,0)))","v":"Bankgebyr"}]
["2021-12-01",349,null,null,null,12310,null,1.5,{"$f":"IF(F707=\"\",\"\",IF(ISERROR(VLOOKUP(F707,Kontoplan!A:D,2,0)),\"Konto findes ikke!\",VLOOKUP(F707,Kontoplan!A:D,2,0)))","v":"Bank konto"}]
["2021-12-01",350,null,null,null,2060,377.75,null,{"$f":"IF(F708=\"\",\"\",IF(ISERROR(VLOOKUP(F708,Kontoplan!A:D,2,0)),\"Konto findes ikke!\",VLOOKUP(F708,Kontoplan!A:D,2,0)))","v":"Internet, mobiltelefon, Forsik."}]
["2021-12-01",350,null,null,null,12310,null,377.75,{"$f":"IF(F709=\"\",\"\",IF(ISERROR(VLOOKUP(F709,Kontoplan!A:D,2,0)),\"Konto findes ikke!\",VLOOKUP(F709,Kontoplan!A:D,2,0)))","v":"Bank konto"}]
["2021-12-02",351,null,null,null,2090,550,null,{"$f":"IF(F710=\"\",\"\",IF(ISERROR(VLOOKUP(F710,Kontoplan!A:D,2,0)),\"Konto findes ikke!\",VLOOKUP(F710,Kontoplan!A:D,2,0)))","v":"Kontingent til andre Foreninger"}]
["2021-12-02",351,null,null,null,12310,null,550,{"$f":"IF(F711=\"\",\"\",IF(ISERROR(VLOOKUP(F711,Kontoplan!A:D,2,0)),\"Konto findes ikke!\",VLOOKUP(F711,Kontoplan!A:D,2,0)))","v":"Bank konto"}]
["2021-12-02",352,null,null,null,2025,120.31,null,{"$f":"IF(F712=\"\",\"\",IF(ISERROR(VLOOKUP(F712,Kontoplan!A:D,2,0)),\"Konto findes ikke!\",VLOOKUP(F712,Kontoplan!A:D,2,0)))","v":"Regnskabsservice"}]
["2021-12-02",352,null,null,null,12310,null,120.31,{"$f":"IF(F713=\"\",\"\",IF(ISERROR(VLOOKUP(F713,Kontoplan!A:D,2,0)),\"Konto findes ikke!\",VLOOKUP(F713,Kontoplan!A:D,2,0)))","v":"Bank konto"}]
["2021-12-02",353,null,null,null,2025,120.31,null,{"$f":"IF(F714=\"\",\"\",IF(ISERROR(VLOOKUP(F714,Kontoplan!A:D,2,0)),\"Konto findes ikke!\",VLOOKUP(F714,Kontoplan!A:D,2,0)))","v":"Regnskabsservice"},"Betalt 2 gange"]
["2021-12-02",353,null,null,null,12310,null,120.31,{"$f":"IF(F715=\"\",\"\",IF(ISERROR(VLOOKUP(F715,Kontoplan!A:D,2,0)),\"Konto findes ikke!\",VLOOKUP(F715,Kontoplan!A:D,2,0)))","v":"Bank konto"}]
["2021-12-06",354,null,null,null,2060,19,null,{"$f":"IF(F716=\"\",\"\",IF(ISERROR(VLOOKUP(F716,Kontoplan!A:D,2,0)),\"Konto findes ikke!\",VLOOKUP(F716,Kontoplan!A:D,2,0)))","v":"Internet, mobiltelefon, Forsik."}]
["2021-12-06",354,null,null,null,12310,null,19,{"$f":"IF(F717=\"\",\"\",IF(ISERROR(VLOOKUP(F717,Kontoplan!A:D,2,0)),\"Konto findes ikke!\",VLOOKUP(F717,Kontoplan!A:D,2,0)))","v":"Bank konto"}]
["2021-12-09",355,null,null,null,12310,2514.85,null,{"$f":"IF(F718=\"\",\"\",IF(ISERROR(VLOOKUP(F718,Kontoplan!A:D,2,0)),\"Konto findes ikke!\",VLOOKUP(F718,Kontoplan!A:D,2,0)))","v":"Bank konto"}]
["2021-12-09",355,null,null,null,1120,null,2514.85,{"$f":"IF(F719=\"\",\"\",IF(ISERROR(VLOOKUP(F719,Kontoplan!A:D,2,0)),\"Konto findes ikke!\",VLOOKUP(F719,Kontoplan!A:D,2,0)))","v":"Lønsum retur"}]
["2021-12-10",356,null,null,null,2040,532,null,{"$f":"IF(F720=\"\",\"\",IF(ISERROR(VLOOKUP(F720,Kontoplan!A:D,2,0)),\"Konto findes ikke!\",VLOOKUP(F720,Kontoplan!A:D,2,0)))","v":"El, Vand og Varme"}]
["2021-12-10",356,null,null,null,12310,null,532,{"$f":"IF(F721=\"\",\"\",IF(ISERROR(VLOOKUP(F721,Kontoplan!A:D,2,0)),\"Konto findes ikke!\",VLOOKUP(F721,Kontoplan!A:D,2,0)))","v":"Bank konto"}]
["2021-12-10",357,null,null,null,3110,3225,null,{"$f":"IF(F722=\"\",\"\",IF(ISERROR(VLOOKUP(F722,Kontoplan!A:D,2,0)),\"Konto findes ikke!\",VLOOKUP(F722,Kontoplan!A:D,2,0)))","v":"Lønninger incl ATP -AM"}]
["2021-12-10",357,null,null,null,12310,null,3225,{"$f":"IF(F723=\"\",\"\",IF(ISERROR(VLOOKUP(F723,Kontoplan!A:D,2,0)),\"Konto findes ikke!\",VLOOKUP(F723,Kontoplan!A:D,2,0)))","v":"Bank konto"}]
["2021-12-14",358,null,null,null,12310,67,null,{"$f":"IF(F724=\"\",\"\",IF(ISERROR(VLOOKUP(F724,Kontoplan!A:D,2,0)),\"Konto findes ikke!\",VLOOKUP(F724,Kontoplan!A:D,2,0)))","v":"Bank konto"}]
["2021-12-14",358,null,null,null,1060,null,67,{"$f":"IF(F725=\"\",\"\",IF(ISERROR(VLOOKUP(F725,Kontoplan!A:D,2,0)),\"Konto findes ikke!\",VLOOKUP(F725,Kontoplan!A:D,2,0)))","v":"Bog salg"}]
["2021-12-15",359,null,null,null,2110,22,null,{"$f":"IF(F726=\"\",\"\",IF(ISERROR(VLOOKUP(F726,Kontoplan!A:D,2,0)),\"Konto findes ikke!\",VLOOKUP(F726,Kontoplan!A:D,2,0)))","v":"Kontorhold - Porto - IT"}]
["2021-12-15",359,null,null,null,12310,null,22,{"$f":"IF(F727=\"\",\"\",IF(ISERROR(VLOOKUP(F727,Kontoplan!A:D,2,0)),\"Konto findes ikke!\",VLOOKUP(F727,Kontoplan!A:D,2,0)))","v":"Bank konto"}]
["2021-12-16",360,null,null,null,12310,120.31,null,{"$f":"IF(F728=\"\",\"\",IF(ISERROR(VLOOKUP(F728,Kontoplan!A:D,2,0)),\"Konto findes ikke!\",VLOOKUP(F728,Kontoplan!A:D,2,0)))","v":"Bank konto"}]
["2021-12-16",360,null,null,null,2025,null,120.31,{"$f":"IF(F729=\"\",\"\",IF(ISERROR(VLOOKUP(F729,Kontoplan!A:D,2,0)),\"Konto findes ikke!\",VLOOKUP(F729,Kontoplan!A:D,2,0)))","v":"Regnskabsservice"}]
["2021-12-18",361,null,null,null,2190,239.1,null,{"$f":"IF(F730=\"\",\"\",IF(ISERROR(VLOOKUP(F730,Kontoplan!A:D,2,0)),\"Konto findes ikke!\",VLOOKUP(F730,Kontoplan!A:D,2,0)))","v":"Diverse Udgifter"}]
["2021-12-18",361,null,null,null,12310,null,239.1,{"$f":"IF(F731=\"\",\"\",IF(ISERROR(VLOOKUP(F731,Kontoplan!A:D,2,0)),\"Konto findes ikke!\",VLOOKUP(F731,Kontoplan!A:D,2,0)))","v":"Bank konto"}]
["2021-12-21",362,null,null,null,2030,1110.94,null,{"$f":"IF(F732=\"\",\"\",IF(ISERROR(VLOOKUP(F732,Kontoplan!A:D,2,0)),\"Konto findes ikke!\",VLOOKUP(F732,Kontoplan!A:D,2,0)))","v":"Bygnings vedligehold"}]
["2021-12-21",362,null,null,null,12310,null,1110.94,{"$f":"IF(F733=\"\",\"\",IF(ISERROR(VLOOKUP(F733,Kontoplan!A:D,2,0)),\"Konto findes ikke!\",VLOOKUP(F733,Kontoplan!A:D,2,0)))","v":"Bank konto"}]
["2021-12-21",363,null,null,null,2030,28.95,null,{"$f":"IF(F734=\"\",\"\",IF(ISERROR(VLOOKUP(F734,Kontoplan!A:D,2,0)),\"Konto findes ikke!\",VLOOKUP(F734,Kontoplan!A:D,2,0)))","v":"Bygnings vedligehold"}]
["2021-12-21",363,null,null,null,12310,null,28.95,{"$f":"IF(F735=\"\",\"\",IF(ISERROR(VLOOKUP(F735,Kontoplan!A:D,2,0)),\"Konto findes ikke!\",VLOOKUP(F735,Kontoplan!A:D,2,0)))","v":"Bank konto"}]
["2021-12-22",364,null,null,null,12310,800,null,{"$f":"IF(F736=\"\",\"\",IF(ISERROR(VLOOKUP(F736,Kontoplan!A:D,2,0)),\"Konto findes ikke!\",VLOOKUP(F736,Kontoplan!A:D,2,0)))","v":"Bank konto"}]
["2021-12-22",364,null,null,null,1110,null,800,{"$f":"IF(F737=\"\",\"\",IF(ISERROR(VLOOKUP(F737,Kontoplan!A:D,2,0)),\"Konto findes ikke!\",VLOOKUP(F737,Kontoplan!A:D,2,0)))","v":"A-skat Retur"}]
["2021-12-29",365,null,null,null,3110,7304.45,null,{"$f":"IF(F738=\"\",\"\",IF(ISERROR(VLOOKUP(F738,Kontoplan!A:D,2,0)),\"Konto findes ikke!\",VLOOKUP(F738,Kontoplan!A:D,2,0)))","v":"Lønninger incl ATP -AM"}]
["2021-12-29",365,null,null,null,12310,null,7304.45,{"$f":"IF(F739=\"\",\"\",IF(ISERROR(VLOOKUP(F739,Kontoplan!A:D,2,0)),\"Konto findes ikke!\",VLOOKUP(F739,Kontoplan!A:D,2,0)))","v":"Bank konto"}]
["2021-12-31",366,null,null,null,2000,106,null,{"$f":"IF(F740=\"\",\"\",IF(ISERROR(VLOOKUP(F740,Kontoplan!A:D,2,0)),\"Konto findes ikke!\",VLOOKUP(F740,Kontoplan!A:D,2,0)))","v":"Bankgebyr"}]
["2021-12-31",366,null,null,null,12310,null,106,{"$f":"IF(F741=\"\",\"\",IF(ISERROR(VLOOKUP(F741,Kontoplan!A:D,2,0)),\"Konto findes ikke!\",VLOOKUP(F741,Kontoplan!A:D,2,0)))","v":"Bank konto"}]
["2022-01-01",null,"Åbningsbalance, Overført Saldi",null,null,12310,1158.8399999999999,null,{"$f":"IF(F742=\"\",\"\",IF(ISERROR(VLOOKUP(F742,Kontoplan!A:D,2,0)),\"Konto findes ikke!\",VLOOKUP(F742,Kontoplan!A:D,2,0)))","v":"Bank konto"}]
["2022-01-01",null,"Åbningsbalance, Overført Saldi",null,null,12320,851,null,{"$f":"IF(F743=\"\",\"\",IF(ISERROR(VLOOKUP(F743,Kontoplan!A:D,2,0)),\"Konto findes ikke!\",VLOOKUP(F743,Kontoplan!A:D,2,0)))","v":"Kasse"}]
["2022-01-01",null,"Åbningsbalance, Overført Saldi",null,null,12330,null,2009.84,{"$f":"IF(F744=\"\",\"\",IF(ISERROR(VLOOKUP(F744,Kontoplan!A:D,2,0)),\"Konto findes ikke!\",VLOOKUP(F744,Kontoplan!A:D,2,0)))","v":"Egenkapital"}]
["2022-01-03",1,null,null,null,2060,377.75,null,{"$f":"IF(F745=\"\",\"\",IF(ISERROR(VLOOKUP(F745,Kontoplan!A:D,2,0)),\"Konto findes ikke!\",VLOOKUP(F745,Kontoplan!A:D,2,0)))","v":"Internet, mobiltelefon, Forsik."}]
["2022-01-03",1,null,null,null,12310,null,377.75,{"$f":"IF(F746=\"\",\"\",IF(ISERROR(VLOOKUP(F746,Kontoplan!A:D,2,0)),\"Konto findes ikke!\",VLOOKUP(F746,Kontoplan!A:D,2,0)))","v":"Bank konto"}]
["2022-01-04",2,null,null,null,12310,74021,null,{"$f":"IF(F747=\"\",\"\",IF(ISERROR(VLOOKUP(F747,Kontoplan!A:D,2,0)),\"Konto findes ikke!\",VLOOKUP(F747,Kontoplan!A:D,2,0)))","v":"Bank konto"}]
["2022-01-04",2,null,null,null,1020,null,74021,{"$f":"IF(F748=\"\",\"\",IF(ISERROR(VLOOKUP(F748,Kontoplan!A:D,2,0)),\"Konto findes ikke!\",VLOOKUP(F748,Kontoplan!A:D,2,0)))","v":"Tilskud fra BRK/ drifttilskud"}]
["2022-01-04",3,null,null,null,2060,60,null,{"$f":"IF(F749=\"\",\"\",IF(ISERROR(VLOOKUP(F749,Kontoplan!A:D,2,0)),\"Konto findes ikke!\",VLOOKUP(F749,Kontoplan!A:D,2,0)))","v":"Internet, mobiltelefon, Forsik."}]
["2022-01-04",3,null,null,null,12310,null,60,{"$f":"IF(F750=\"\",\"\",IF(ISERROR(VLOOKUP(F750,Kontoplan!A:D,2,0)),\"Konto findes ikke!\",VLOOKUP(F750,Kontoplan!A:D,2,0)))","v":"Bank konto"}]
["2022-01-04",4,null,null,null,2060,450,null,{"$f":"IF(F751=\"\",\"\",IF(ISERROR(VLOOKUP(F751,Kontoplan!A:D,2,0)),\"Konto findes ikke!\",VLOOKUP(F751,Kontoplan!A:D,2,0)))","v":"Internet, mobiltelefon, Forsik."}]
["2022-01-04",4,null,null,null,12310,null,450,{"$f":"IF(F752=\"\",\"\",IF(ISERROR(VLOOKUP(F752,Kontoplan!A:D,2,0)),\"Konto findes ikke!\",VLOOKUP(F752,Kontoplan!A:D,2,0)))","v":"Bank konto"}]
["2022-01-05",5,null,null,null,2060,19,null,{"$f":"IF(F753=\"\",\"\",IF(ISERROR(VLOOKUP(F753,Kontoplan!A:D,2,0)),\"Konto findes ikke!\",VLOOKUP(F753,Kontoplan!A:D,2,0)))","v":"Internet, mobiltelefon, Forsik."}]
["2022-01-05",5,null,null,null,12310,null,19,{"$f":"IF(F754=\"\",\"\",IF(ISERROR(VLOOKUP(F754,Kontoplan!A:D,2,0)),\"Konto findes ikke!\",VLOOKUP(F754,Kontoplan!A:D,2,0)))","v":"Bank konto"}]
["2022-01-05",6,null,null,null,12310,15000,null,{"$f":"IF(F755=\"\",\"\",IF(ISERROR(VLOOKUP(F755,Kontoplan!A:D,2,0)),\"Konto findes ikke!\",VLOOKUP(F755,Kontoplan!A:D,2,0)))","v":"Bank konto"}]
["2022-01-05",6,null,null,null,1025,null,15000,{"$f":"IF(F756=\"\",\"\",IF(ISERROR(VLOOKUP(F756,Kontoplan!A:D,2,0)),\"Konto findes ikke!\",VLOOKUP(F756,Kontoplan!A:D,2,0)))","v":"Tilskud fra BRK "}]
["2022-01-05",7,null,null,null,2025,120.31,null,{"$f":"IF(F757=\"\",\"\",IF(ISERROR(VLOOKUP(F757,Kontoplan!A:D,2,0)),\"Konto findes ikke!\",VLOOKUP(F757,Kontoplan!A:D,2,0)))","v":"Regnskabsservice"}]
["2022-01-05",7,null,null,null,12310,null,120.31,{"$f":"IF(F758=\"\",\"\",IF(ISERROR(VLOOKUP(F758,Kontoplan!A:D,2,0)),\"Konto findes ikke!\",VLOOKUP(F758,Kontoplan!A:D,2,0)))","v":"Bank konto"}]
["2022-01-05",8,null,null,null,3125,246.46,null,{"$f":"IF(F759=\"\",\"\",IF(ISERROR(VLOOKUP(F759,Kontoplan!A:D,2,0)),\"Konto findes ikke!\",VLOOKUP(F759,Kontoplan!A:D,2,0)))","v":"Samlet betaling"}]
["2022-01-05",8,null,null,null,12310,null,246.46,{"$f":"IF(F760=\"\",\"\",IF(ISERROR(VLOOKUP(F760,Kontoplan!A:D,2,0)),\"Konto findes ikke!\",VLOOKUP(F760,Kontoplan!A:D,2,0)))","v":"Bank konto"}]
["2022-01-05",9,null,null,null,2060,114.96,null,{"$f":"IF(F761=\"\",\"\",IF(ISERROR(VLOOKUP(F761,Kontoplan!A:D,2,0)),\"Konto findes ikke!\",VLOOKUP(F761,Kontoplan!A:D,2,0)))","v":"Internet, mobiltelefon, Forsik."}]
["2022-01-05",9,null,null,null,12310,null,114.96,{"$f":"IF(F762=\"\",\"\",IF(ISERROR(VLOOKUP(F762,Kontoplan!A:D,2,0)),\"Konto findes ikke!\",VLOOKUP(F762,Kontoplan!A:D,2,0)))","v":"Bank konto"}]
["2022-01-10",10,null,null,null,2165,1401.19,null,{"$f":"IF(F763=\"\",\"\",IF(ISERROR(VLOOKUP(F763,Kontoplan!A:D,2,0)),\"Konto findes ikke!\",VLOOKUP(F763,Kontoplan!A:D,2,0)))","v":"G4S tyverialarm"}]
["2022-01-10",10,null,null,null,12310,null,1401.19,{"$f":"IF(F764=\"\",\"\",IF(ISERROR(VLOOKUP(F764,Kontoplan!A:D,2,0)),\"Konto findes ikke!\",VLOOKUP(F764,Kontoplan!A:D,2,0)))","v":"Bank konto"}]
["2022-01-17",11,null,null,null,3130,3664,null,{"$f":"IF(F765=\"\",\"\",IF(ISERROR(VLOOKUP(F765,Kontoplan!A:D,2,0)),\"Konto findes ikke!\",VLOOKUP(F765,Kontoplan!A:D,2,0)))","v":"A-skat & Am-bidrag"}]
["2022-01-17",11,null,null,null,12310,null,3664,{"$f":"IF(F766=\"\",\"\",IF(ISERROR(VLOOKUP(F766,Kontoplan!A:D,2,0)),\"Konto findes ikke!\",VLOOKUP(F766,Kontoplan!A:D,2,0)))","v":"Bank konto"}]
["2022-01-19",12,null,null,null,2165,2384.75,null,{"$f":"IF(F767=\"\",\"\",IF(ISERROR(VLOOKUP(F767,Kontoplan!A:D,2,0)),\"Konto findes ikke!\",VLOOKUP(F767,Kontoplan!A:D,2,0)))","v":"G4S tyverialarm"}]
["2022-01-19",12,null,null,null,12310,null,2384.75,{"$f":"IF(F768=\"\",\"\",IF(ISERROR(VLOOKUP(F768,Kontoplan!A:D,2,0)),\"Konto findes ikke!\",VLOOKUP(F768,Kontoplan!A:D,2,0)))","v":"Bank konto"}]
["2022-01-23",13,null,null,null,12320,1425,null,{"$f":"IF(F769=\"\",\"\",IF(ISERROR(VLOOKUP(F769,Kontoplan!A:D,2,0)),\"Konto findes ikke!\",VLOOKUP(F769,Kontoplan!A:D,2,0)))","v":"Kasse"}]
["2022-01-23",13,null,null,null,1000,null,1425,{"$f":"IF(F770=\"\",\"\",IF(ISERROR(VLOOKUP(F770,Kontoplan!A:D,2,0)),\"Konto findes ikke!\",VLOOKUP(F770,Kontoplan!A:D,2,0)))","v":"Entre"}]
["2022-01-24",14,null,null,null,12310,11493.46,null,{"$f":"IF(F771=\"\",\"\",IF(ISERROR(VLOOKUP(F771,Kontoplan!A:D,2,0)),\"Konto findes ikke!\",VLOOKUP(F771,Kontoplan!A:D,2,0)))","v":"Bank konto"}]
["2022-01-24",14,null,null,null,1120,null,11493.46,{"$f":"IF(F772=\"\",\"\",IF(ISERROR(VLOOKUP(F772,Kontoplan!A:D,2,0)),\"Konto findes ikke!\",VLOOKUP(F772,Kontoplan!A:D,2,0)))","v":"Lønsum retur"}]
["2022-01-28",15,null,null,null,3110,10000,null,{"$f":"IF(F773=\"\",\"\",IF(ISERROR(VLOOKUP(F773,Kontoplan!A:D,2,0)),\"Konto findes ikke!\",VLOOKUP(F773,Kontoplan!A:D,2,0)))","v":"Lønninger incl ATP -AM"}]
["2022-01-28",15,null,null,null,12310,null,4769.45,{"$f":"IF(F774=\"\",\"\",IF(ISERROR(VLOOKUP(F774,Kontoplan!A:D,2,0)),\"Konto findes ikke!\",VLOOKUP(F774,Kontoplan!A:D,2,0)))","v":"Bank konto"}]
["2022-01-28",15,null,null,null,12360,null,4402,{"$f":"IF(F775=\"\",\"\",IF(ISERROR(VLOOKUP(F775,Kontoplan!A:D,2,0)),\"Konto findes ikke!\",VLOOKUP(F775,Kontoplan!A:D,2,0)))","v":"Skyldig A-skat"}]
["2022-01-28",15,null,null,null,12361,null,797,{"$f":"IF(F776=\"\",\"\",IF(ISERROR(VLOOKUP(F776,Kontoplan!A:D,2,0)),\"Konto findes ikke!\",VLOOKUP(F776,Kontoplan!A:D,2,0)))","v":"Skyldig AM "}]
["2022-01-28",15,null,null,null,12362,null,31.55,{"$f":"IF(F777=\"\",\"\",IF(ISERROR(VLOOKUP(F777,Kontoplan!A:D,2,0)),\"Konto findes ikke!\",VLOOKUP(F777,Kontoplan!A:D,2,0)))","v":"Skyldig ATP"}]
["2022-01-28",15,null,null,null,3120,63.1,null,{"$f":"IF(F778=\"\",\"\",IF(ISERROR(VLOOKUP(F778,Kontoplan!A:D,2,0)),\"Konto findes ikke!\",VLOOKUP(F778,Kontoplan!A:D,2,0)))","v":"ATP"}]
["2022-01-28",15,null,null,null,12362,null,63.1,{"$f":"IF(F779=\"\",\"\",IF(ISERROR(VLOOKUP(F779,Kontoplan!A:D,2,0)),\"Konto findes ikke!\",VLOOKUP(F779,Kontoplan!A:D,2,0)))","v":"Skyldig ATP"}]
["2022-01-28",15,null,null,null,3110,200,null,{"$f":"IF(F780=\"\",\"\",IF(ISERROR(VLOOKUP(F780,Kontoplan!A:D,2,0)),\"Konto findes ikke!\",VLOOKUP(F780,Kontoplan!A:D,2,0)))","v":"Lønninger incl ATP -AM"}]
["2022-01-28",15,null,null,null,12364,null,200,{"$f":"IF(F781=\"\",\"\",IF(ISERROR(VLOOKUP(F781,Kontoplan!A:D,2,0)),\"Konto findes ikke!\",VLOOKUP(F781,Kontoplan!A:D,2,0)))","v":"Skyldig feriepenge"}]
["2022-01-31",16,null,null,null,2000,1,null,{"$f":"IF(F782=\"\",\"\",IF(ISERROR(VLOOKUP(F782,Kontoplan!A:D,2,0)),\"Konto findes ikke!\",VLOOKUP(F782,Kontoplan!A:D,2,0)))","v":"Bankgebyr"}]
["2022-01-31",16,null,null,null,12310,null,1,{"$f":"IF(F783=\"\",\"\",IF(ISERROR(VLOOKUP(F783,Kontoplan!A:D,2,0)),\"Konto findes ikke!\",VLOOKUP(F783,Kontoplan!A:D,2,0)))","v":"Bank konto"}]
["2022-02-01",17,null,null,null,2110,377.75,null,{"$f":"IF(F784=\"\",\"\",IF(ISERROR(VLOOKUP(F784,Kontoplan!A:D,2,0)),\"Konto findes ikke!\",VLOOKUP(F784,Kontoplan!A:D,2,0)))","v":"Kontorhold - Porto - IT"}]
["2022-02-01",17,null,null,null,12310,null,377.75,{"$f":"IF(F785=\"\",\"\",IF(ISERROR(VLOOKUP(F785,Kontoplan!A:D,2,0)),\"Konto findes ikke!\",VLOOKUP(F785,Kontoplan!A:D,2,0)))","v":"Bank konto"}]
["2022-02-01",18,null,null,null,2040,11364.64,null,{"$f":"IF(F786=\"\",\"\",IF(ISERROR(VLOOKUP(F786,Kontoplan!A:D,2,0)),\"Konto findes ikke!\",VLOOKUP(F786,Kontoplan!A:D,2,0)))","v":"El, Vand og Varme"}]
["2022-02-01",18,null,null,null,12310,null,11364.64,{"$f":"IF(F787=\"\",\"\",IF(ISERROR(VLOOKUP(F787,Kontoplan!A:D,2,0)),\"Konto findes ikke!\",VLOOKUP(F787,Kontoplan!A:D,2,0)))","v":"Bank konto"}]
["2022-02-01",19,null,null,null,2040,3604.07,null,{"$f":"IF(F788=\"\",\"\",IF(ISERROR(VLOOKUP(F788,Kontoplan!A:D,2,0)),\"Konto findes ikke!\",VLOOKUP(F788,Kontoplan!A:D,2,0)))","v":"El, Vand og Varme"}]
["2022-02-01",19,null,null,null,12310,null,3604.07,{"$f":"IF(F789=\"\",\"\",IF(ISERROR(VLOOKUP(F789,Kontoplan!A:D,2,0)),\"Konto findes ikke!\",VLOOKUP(F789,Kontoplan!A:D,2,0)))","v":"Bank konto"}]
["2022-02-05",20,null,null,null,2025,123.44,null,{"$f":"IF(F790=\"\",\"\",IF(ISERROR(VLOOKUP(F790,Kontoplan!A:D,2,0)),\"Konto findes ikke!\",VLOOKUP(F790,Kontoplan!A:D,2,0)))","v":"Regnskabsservice"}]
["2022-02-05",20,null,null,null,12310,null,123.44,{"$f":"IF(F791=\"\",\"\",IF(ISERROR(VLOOKUP(F791,Kontoplan!A:D,2,0)),\"Konto findes ikke!\",VLOOKUP(F791,Kontoplan!A:D,2,0)))","v":"Bank konto"}]
["2022-02-07",21,null,null,null,2060,19,null,{"$f":"IF(F792=\"\",\"\",IF(ISERROR(VLOOKUP(F792,Kontoplan!A:D,2,0)),\"Konto findes ikke!\",VLOOKUP(F792,Kontoplan!A:D,2,0)))","v":"Internet, mobiltelefon, Forsik."}]
["2022-02-07",21,null,null,null,12310,null,19,{"$f":"IF(F793=\"\",\"\",IF(ISERROR(VLOOKUP(F793,Kontoplan!A:D,2,0)),\"Konto findes ikke!\",VLOOKUP(F793,Kontoplan!A:D,2,0)))","v":"Bank konto"}]
["2022-02-07",22,null,null,null,3120,283.95,null,{"$f":"IF(F794=\"\",\"\",IF(ISERROR(VLOOKUP(F794,Kontoplan!A:D,2,0)),\"Konto findes ikke!\",VLOOKUP(F794,Kontoplan!A:D,2,0)))","v":"ATP"}]
["2022-02-07",22,null,null,null,12310,null,283.95,{"$f":"IF(F795=\"\",\"\",IF(ISERROR(VLOOKUP(F795,Kontoplan!A:D,2,0)),\"Konto findes ikke!\",VLOOKUP(F795,Kontoplan!A:D,2,0)))","v":"Bank konto"}]
["2022-02-07",23,null,null,null,3150,922.26,null,{"$f":"IF(F796=\"\",\"\",IF(ISERROR(VLOOKUP(F796,Kontoplan!A:D,2,0)),\"Konto findes ikke!\",VLOOKUP(F796,Kontoplan!A:D,2,0)))","v":"Indefrosne feriepenge"}]
["2022-02-07",23,null,null,null,12310,null,922.26,{"$f":"IF(F797=\"\",\"\",IF(ISERROR(VLOOKUP(F797,Kontoplan!A:D,2,0)),\"Konto findes ikke!\",VLOOKUP(F797,Kontoplan!A:D,2,0)))","v":"Bank konto"}]
["2022-02-10",24,null,null,null,12360,4402,null,{"$f":"IF(F798=\"\",\"\",IF(ISERROR(VLOOKUP(F798,Kontoplan!A:D,2,0)),\"Konto findes ikke!\",VLOOKUP(F798,Kontoplan!A:D,2,0)))","v":"Skyldig A-skat"}]
["2022-02-10",24,null,null,null,12361,797,null,{"$f":"IF(F799=\"\",\"\",IF(ISERROR(VLOOKUP(F799,Kontoplan!A:D,2,0)),\"Konto findes ikke!\",VLOOKUP(F799,Kontoplan!A:D,2,0)))","v":"Skyldig AM "}]
["2022-02-10",24,null,null,null,12310,null,5199,{"$f":"IF(F800=\"\",\"\",IF(ISERROR(VLOOKUP(F800,Kontoplan!A:D,2,0)),\"Konto findes ikke!\",VLOOKUP(F800,Kontoplan!A:D,2,0)))","v":"Bank konto"}]
["2022-02-14",25,null,null,null,12310,2.9,null,{"$f":"IF(F801=\"\",\"\",IF(ISERROR(VLOOKUP(F801,Kontoplan!A:D,2,0)),\"Konto findes ikke!\",VLOOKUP(F801,Kontoplan!A:D,2,0)))","v":"Bank konto"}]
["2022-02-14",25,null,null,null,1110,null,2.9,{"$f":"IF(F802=\"\",\"\",IF(ISERROR(VLOOKUP(F802,Kontoplan!A:D,2,0)),\"Konto findes ikke!\",VLOOKUP(F802,Kontoplan!A:D,2,0)))","v":"A-skat Retur"}]
["2022-02-17",26,null,null,null,2065,134.75,null,{"$f":"IF(F803=\"\",\"\",IF(ISERROR(VLOOKUP(F803,Kontoplan!A:D,2,0)),\"Konto findes ikke!\",VLOOKUP(F803,Kontoplan!A:D,2,0)))","v":"Udstilling"}]
["2022-02-17",26,null,null,null,12310,null,134.75,{"$f":"IF(F804=\"\",\"\",IF(ISERROR(VLOOKUP(F804,Kontoplan!A:D,2,0)),\"Konto findes ikke!\",VLOOKUP(F804,Kontoplan!A:D,2,0)))","v":"Bank konto"}]
["2022-02-25",27,null,null,null,3110,10000,null,{"$f":"IF(F805=\"\",\"\",IF(ISERROR(VLOOKUP(F805,Kontoplan!A:D,2,0)),\"Konto findes ikke!\",VLOOKUP(F805,Kontoplan!A:D,2,0)))","v":"Lønninger incl ATP -AM"}]
["2022-02-25",27,null,null,null,12310,null,4952.45,{"$f":"IF(F806=\"\",\"\",IF(ISERROR(VLOOKUP(F806,Kontoplan!A:D,2,0)),\"Konto findes ikke!\",VLOOKUP(F806,Kontoplan!A:D,2,0)))","v":"Bank konto"}]
["2022-02-25",27,null,null,null,12360,null,4219,{"$f":"IF(F807=\"\",\"\",IF(ISERROR(VLOOKUP(F807,Kontoplan!A:D,2,0)),\"Konto findes ikke!\",VLOOKUP(F807,Kontoplan!A:D,2,0)))","v":"Skyldig A-skat"}]
["2022-02-25",27,null,null,null,12361,null,797,{"$f":"IF(F808=\"\",\"\",IF(ISERROR(VLOOKUP(F808,Kontoplan!A:D,2,0)),\"Konto findes ikke!\",VLOOKUP(F808,Kontoplan!A:D,2,0)))","v":"Skyldig AM "}]
["2022-02-25",27,null,null,null,12362,null,31.55,{"$f":"IF(F809=\"\",\"\",IF(ISERROR(VLOOKUP(F809,Kontoplan!A:D,2,0)),\"Konto findes ikke!\",VLOOKUP(F809,Kontoplan!A:D,2,0)))","v":"Skyldig ATP"}]
["2022-02-25",27,null,null,null,3120,63.1,null,{"$f":"IF(F810=\"\",\"\",IF(ISERROR(VLOOKUP(F810,Kontoplan!A:D,2,0)),\"Konto findes ikke!\",VLOOKUP(F810,Kontoplan!A:D,2,0)))","v":"ATP"}]
["2022-02-25",27,null,null,null,12362,null,63.1,{"$f":"IF(F811=\"\",\"\",IF(ISERROR(VLOOKUP(F811,Kontoplan!A:D,2,0)),\"Konto findes ikke!\",VLOOKUP(F811,Kontoplan!A:D,2,0)))","v":"Skyldig ATP"}]
["2022-02-25",27,null,null,null,3110,200,null,{"$f":"IF(F812=\"\",\"\",IF(ISERROR(VLOOKUP(F812,Kontoplan!A:D,2,0)),\"Konto findes ikke!\",VLOOKUP(F812,Kontoplan!A:D,2,0)))","v":"Lønninger incl ATP -AM"}]
["2022-02-25",27,null,null,null,12364,null,200,{"$f":"IF(F813=\"\",\"\",IF(ISERROR(VLOOKUP(F813,Kontoplan!A:D,2,0)),\"Konto findes ikke!\",VLOOKUP(F813,Kontoplan!A:D,2,0)))","v":"Skyldig feriepenge"}]
["2022-02-28",28,null,null,null,12310,3700,null,{"$f":"IF(F814=\"\",\"\",IF(ISERROR(VLOOKUP(F814,Kontoplan!A:D,2,0)),\"Konto findes ikke!\",VLOOKUP(F814,Kontoplan!A:D,2,0)))","v":"Bank konto"}]
["2022-02-28",28,null,null,null,1000,null,3700,{"$f":"IF(F815=\"\",\"\",IF(ISERROR(VLOOKUP(F815,Kontoplan!A:D,2,0)),\"Konto findes ikke!\",VLOOKUP(F815,Kontoplan!A:D,2,0)))","v":"Entre"}]
["2022-02-28",29,null,null,null,2000,1,null,{"$f":"IF(F816=\"\",\"\",IF(ISERROR(VLOOKUP(F816,Kontoplan!A:D,2,0)),\"Konto findes ikke!\",VLOOKUP(F816,Kontoplan!A:D,2,0)))","v":"Bankgebyr"}]
["2022-02-28",29,null,null,null,12310,null,1,{"$f":"IF(F817=\"\",\"\",IF(ISERROR(VLOOKUP(F817,Kontoplan!A:D,2,0)),\"Konto findes ikke!\",VLOOKUP(F817,Kontoplan!A:D,2,0)))","v":"Bank konto"}]
["2022-03-01",30,null,null,null,2060,377.75,null,{"$f":"IF(F818=\"\",\"\",IF(ISERROR(VLOOKUP(F818,Kontoplan!A:D,2,0)),\"Konto findes ikke!\",VLOOKUP(F818,Kontoplan!A:D,2,0)))","v":"Internet, mobiltelefon, Forsik."}]
["2022-03-01",30,null,null,null,12310,null,377.75,{"$f":"IF(F819=\"\",\"\",IF(ISERROR(VLOOKUP(F819,Kontoplan!A:D,2,0)),\"Konto findes ikke!\",VLOOKUP(F819,Kontoplan!A:D,2,0)))","v":"Bank konto"}]
["2022-03-04",31,null,null,null,2130,2318.75,null,{"$f":"IF(F820=\"\",\"\",IF(ISERROR(VLOOKUP(F820,Kontoplan!A:D,2,0)),\"Konto findes ikke!\",VLOOKUP(F820,Kontoplan!A:D,2,0)))","v":"Annoncer"}]
["2022-03-04",31,null,null,null,12310,null,2318.75,{"$f":"IF(F821=\"\",\"\",IF(ISERROR(VLOOKUP(F821,Kontoplan!A:D,2,0)),\"Konto findes ikke!\",VLOOKUP(F821,Kontoplan!A:D,2,0)))","v":"Bank konto"}]
["2022-03-06",32,null,null,null,2195,2500,null,{"$f":"IF(F822=\"\",\"\",IF(ISERROR(VLOOKUP(F822,Kontoplan!A:D,2,0)),\"Konto findes ikke!\",VLOOKUP(F822,Kontoplan!A:D,2,0)))","v":"Arkitekt"}]
["2022-03-06",32,null,null,null,12310,null,2500,{"$f":"IF(F823=\"\",\"\",IF(ISERROR(VLOOKUP(F823,Kontoplan!A:D,2,0)),\"Konto findes ikke!\",VLOOKUP(F823,Kontoplan!A:D,2,0)))","v":"Bank konto"}]
["2022-03-07",33,null,null,null,2060,19,null,{"$f":"IF(F824=\"\",\"\",IF(ISERROR(VLOOKUP(F824,Kontoplan!A:D,2,0)),\"Konto findes ikke!\",VLOOKUP(F824,Kontoplan!A:D,2,0)))","v":"Internet, mobiltelefon, Forsik."}]
["2022-03-07",33,null,null,null,12310,null,19,{"$f":"IF(F825=\"\",\"\",IF(ISERROR(VLOOKUP(F825,Kontoplan!A:D,2,0)),\"Konto findes ikke!\",VLOOKUP(F825,Kontoplan!A:D,2,0)))","v":"Bank konto"}]
["2022-03-10",34,null,null,null,2040,540.72,null,{"$f":"IF(F826=\"\",\"\",IF(ISERROR(VLOOKUP(F826,Kontoplan!A:D,2,0)),\"Konto findes ikke!\",VLOOKUP(F826,Kontoplan!A:D,2,0)))","v":"El, Vand og Varme"}]
["2022-03-10",34,null,null,null,12310,null,540.72,{"$f":"IF(F827=\"\",\"\",IF(ISERROR(VLOOKUP(F827,Kontoplan!A:D,2,0)),\"Konto findes ikke!\",VLOOKUP(F827,Kontoplan!A:D,2,0)))","v":"Bank konto"}]
["2022-03-10",35,null,null,null,12360,4219,null,{"$f":"IF(F828=\"\",\"\",IF(ISERROR(VLOOKUP(F828,Kontoplan!A:D,2,0)),\"Konto findes ikke!\",VLOOKUP(F828,Kontoplan!A:D,2,0)))","v":"Skyldig A-skat"}]
["2022-03-10",35,null,null,null,12361,797,null,{"$f":"IF(F829=\"\",\"\",IF(ISERROR(VLOOKUP(F829,Kontoplan!A:D,2,0)),\"Konto findes ikke!\",VLOOKUP(F829,Kontoplan!A:D,2,0)))","v":"Skyldig AM "}]
["2022-03-10",35,null,null,null,12310,null,5016,{"$f":"IF(F830=\"\",\"\",IF(ISERROR(VLOOKUP(F830,Kontoplan!A:D,2,0)),\"Konto findes ikke!\",VLOOKUP(F830,Kontoplan!A:D,2,0)))","v":"Bank konto"}]
["2022-03-11",36,null,null,null,2110,647.65,null,{"$f":"IF(F831=\"\",\"\",IF(ISERROR(VLOOKUP(F831,Kontoplan!A:D,2,0)),\"Konto findes ikke!\",VLOOKUP(F831,Kontoplan!A:D,2,0)))","v":"Kontorhold - Porto - IT"}]
["2022-03-11",36,null,null,null,12310,null,647.65,{"$f":"IF(F832=\"\",\"\",IF(ISERROR(VLOOKUP(F832,Kontoplan!A:D,2,0)),\"Konto findes ikke!\",VLOOKUP(F832,Kontoplan!A:D,2,0)))","v":"Bank konto"}]
["2022-03-11",37,null,null,null,2025,123.44,null,{"$f":"IF(F833=\"\",\"\",IF(ISERROR(VLOOKUP(F833,Kontoplan!A:D,2,0)),\"Konto findes ikke!\",VLOOKUP(F833,Kontoplan!A:D,2,0)))","v":"Regnskabsservice"}]
["2022-03-11",37,null,null,null,12310,null,123.44,{"$f":"IF(F834=\"\",\"\",IF(ISERROR(VLOOKUP(F834,Kontoplan!A:D,2,0)),\"Konto findes ikke!\",VLOOKUP(F834,Kontoplan!A:D,2,0)))","v":"Bank konto"}]
["2022-03-21",38,null,null,null,2110,108,null,{"$f":"IF(F835=\"\",\"\",IF(ISERROR(VLOOKUP(F835,Kontoplan!A:D,2,0)),\"Konto findes ikke!\",VLOOKUP(F835,Kontoplan!A:D,2,0)))","v":"Kontorhold - Porto - IT"}]
["2022-03-21",38,null,null,null,12310,null,108,{"$f":"IF(F836=\"\",\"\",IF(ISERROR(VLOOKUP(F836,Kontoplan!A:D,2,0)),\"Konto findes ikke!\",VLOOKUP(F836,Kontoplan!A:D,2,0)))","v":"Bank konto"}]
["2022-03-21",39,null,null,null,2065,770.63,null,{"$f":"IF(F837=\"\",\"\",IF(ISERROR(VLOOKUP(F837,Kontoplan!A:D,2,0)),\"Konto findes ikke!\",VLOOKUP(F837,Kontoplan!A:D,2,0)))","v":"Udstilling"}]
["2022-03-21",39,null,null,null,12310,null,770.63,{"$f":"IF(F838=\"\",\"\",IF(ISERROR(VLOOKUP(F838,Kontoplan!A:D,2,0)),\"Konto findes ikke!\",VLOOKUP(F838,Kontoplan!A:D,2,0)))","v":"Bank konto"}]
["2022-03-30",40,null,null,null,3110,10000,null,{"$f":"IF(F839=\"\",\"\",IF(ISERROR(VLOOKUP(F839,Kontoplan!A:D,2,0)),\"Konto findes ikke!\",VLOOKUP(F839,Kontoplan!A:D,2,0)))","v":"Lønninger incl ATP -AM"}]
["2022-03-30",40,null,null,null,12310,null,4952.45,{"$f":"IF(F840=\"\",\"\",IF(ISERROR(VLOOKUP(F840,Kontoplan!A:D,2,0)),\"Konto findes ikke!\",VLOOKUP(F840,Kontoplan!A:D,2,0)))","v":"Bank konto"}]
["2022-03-30",40,null,null,null,12360,null,4219,{"$f":"IF(F841=\"\",\"\",IF(ISERROR(VLOOKUP(F841,Kontoplan!A:D,2,0)),\"Konto findes ikke!\",VLOOKUP(F841,Kontoplan!A:D,2,0)))","v":"Skyldig A-skat"}]
["2022-03-30",40,null,null,null,12361,null,797,{"$f":"IF(F842=\"\",\"\",IF(ISERROR(VLOOKUP(F842,Kontoplan!A:D,2,0)),\"Konto findes ikke!\",VLOOKUP(F842,Kontoplan!A:D,2,0)))","v":"Skyldig AM "}]
["2022-03-30",40,null,null,null,12362,null,31.55,{"$f":"IF(F843=\"\",\"\",IF(ISERROR(VLOOKUP(F843,Kontoplan!A:D,2,0)),\"Konto findes ikke!\",VLOOKUP(F843,Kontoplan!A:D,2,0)))","v":"Skyldig ATP"}]
["2022-03-30",40,null,null,null,3120,63.1,null,{"$f":"IF(F844=\"\",\"\",IF(ISERROR(VLOOKUP(F844,Kontoplan!A:D,2,0)),\"Konto findes ikke!\",VLOOKUP(F844,Kontoplan!A:D,2,0)))","v":"ATP"}]
["2022-03-30",40,null,null,null,12362,null,63.1,{"$f":"IF(F845=\"\",\"\",IF(ISERROR(VLOOKUP(F845,Kontoplan!A:D,2,0)),\"Konto findes ikke!\",VLOOKUP(F845,Kontoplan!A:D,2,0)))","v":"Skyldig ATP"}]
["2022-03-30",40,null,null,null,3110,200,null,{"$f":"IF(F846=\"\",\"\",IF(ISERROR(VLOOKUP(F846,Kontoplan!A:D,2,0)),\"Konto findes ikke!\",VLOOKUP(F846,Kontoplan!A:D,2,0)))","v":"Lønninger incl ATP -AM"}]
["2022-03-30",40,null,null,null,12364,null,200,{"$f":"IF(F847=\"\",\"\",IF(ISERROR(VLOOKUP(F847,Kontoplan!A:D,2,0)),\"Konto findes ikke!\",VLOOKUP(F847,Kontoplan!A:D,2,0)))","v":"Skyldig feriepenge"}]
["2022-04-01",41,null,null,null,2000,106,null,{"$f":"IF(F848=\"\",\"\",IF(ISERROR(VLOOKUP(F848,Kontoplan!A:D,2,0)),\"Konto findes ikke!\",VLOOKUP(F848,Kontoplan!A:D,2,0)))","v":"Bankgebyr"}]
["2022-04-01",41,null,null,null,12310,null,106,{"$f":"IF(F849=\"\",\"\",IF(ISERROR(VLOOKUP(F849,Kontoplan!A:D,2,0)),\"Konto findes ikke!\",VLOOKUP(F849,Kontoplan!A:D,2,0)))","v":"Bank konto"}]
["2022-04-01",42,null,null,null,2060,377.75,null,{"$f":"IF(F850=\"\",\"\",IF(ISERROR(VLOOKUP(F850,Kontoplan!A:D,2,0)),\"Konto findes ikke!\",VLOOKUP(F850,Kontoplan!A:D,2,0)))","v":"Internet, mobiltelefon, Forsik."}]
["2022-04-01",42,null,null,null,12310,null,377.75,{"$f":"IF(F851=\"\",\"\",IF(ISERROR(VLOOKUP(F851,Kontoplan!A:D,2,0)),\"Konto findes ikke!\",VLOOKUP(F851,Kontoplan!A:D,2,0)))","v":"Bank konto"}]
["2022-04-02",43,null,null,null,2090,100,null,{"$f":"IF(F852=\"\",\"\",IF(ISERROR(VLOOKUP(F852,Kontoplan!A:D,2,0)),\"Konto findes ikke!\",VLOOKUP(F852,Kontoplan!A:D,2,0)))","v":"Kontingent til andre Foreninger"}]
["2022-04-02",43,null,null,null,12310,null,100,{"$f":"IF(F853=\"\",\"\",IF(ISERROR(VLOOKUP(F853,Kontoplan!A:D,2,0)),\"Konto findes ikke!\",VLOOKUP(F853,Kontoplan!A:D,2,0)))","v":"Bank konto"}]
["2022-04-05",44,null,null,null,2060,19,null,{"$f":"IF(F854=\"\",\"\",IF(ISERROR(VLOOKUP(F854,Kontoplan!A:D,2,0)),\"Konto findes ikke!\",VLOOKUP(F854,Kontoplan!A:D,2,0)))","v":"Internet, mobiltelefon, Forsik."}]
["2022-04-05",44,null,null,null,12310,null,19,{"$f":"IF(F855=\"\",\"\",IF(ISERROR(VLOOKUP(F855,Kontoplan!A:D,2,0)),\"Konto findes ikke!\",VLOOKUP(F855,Kontoplan!A:D,2,0)))","v":"Bank konto"}]
["2022-04-05",45,null,null,null,2166,7598.9,null,{"$f":"IF(F856=\"\",\"\",IF(ISERROR(VLOOKUP(F856,Kontoplan!A:D,2,0)),\"Konto findes ikke!\",VLOOKUP(F856,Kontoplan!A:D,2,0)))","v":"Forsikringer"}]
["2022-04-05",45,null,null,null,12310,null,7598.9,{"$f":"IF(F857=\"\",\"\",IF(ISERROR(VLOOKUP(F857,Kontoplan!A:D,2,0)),\"Konto findes ikke!\",VLOOKUP(F857,Kontoplan!A:D,2,0)))","v":"Bank konto"}]
["2022-04-07",46,null,null,null,2065,50,null,{"$f":"IF(F858=\"\",\"\",IF(ISERROR(VLOOKUP(F858,Kontoplan!A:D,2,0)),\"Konto findes ikke!\",VLOOKUP(F858,Kontoplan!A:D,2,0)))","v":"Udstilling"}]
["2022-04-07",46,null,null,null,12310,null,50,{"$f":"IF(F859=\"\",\"\",IF(ISERROR(VLOOKUP(F859,Kontoplan!A:D,2,0)),\"Konto findes ikke!\",VLOOKUP(F859,Kontoplan!A:D,2,0)))","v":"Bank konto"}]
["2022-04-11",47,null,null,null,12360,4219,null,{"$f":"IF(F860=\"\",\"\",IF(ISERROR(VLOOKUP(F860,Kontoplan!A:D,2,0)),\"Konto findes ikke!\",VLOOKUP(F860,Kontoplan!A:D,2,0)))","v":"Skyldig A-skat"}]
["2022-04-11",47,null,null,null,12361,797,null,{"$f":"IF(F861=\"\",\"\",IF(ISERROR(VLOOKUP(F861,Kontoplan!A:D,2,0)),\"Konto findes ikke!\",VLOOKUP(F861,Kontoplan!A:D,2,0)))","v":"Skyldig AM "}]
["2022-04-11",47,null,null,null,12310,null,5016,{"$f":"IF(F862=\"\",\"\",IF(ISERROR(VLOOKUP(F862,Kontoplan!A:D,2,0)),\"Konto findes ikke!\",VLOOKUP(F862,Kontoplan!A:D,2,0)))","v":"Bank konto"}]
["2022-04-19",48,null,null,null,3125,246.46,null,{"$f":"IF(F863=\"\",\"\",IF(ISERROR(VLOOKUP(F863,Kontoplan!A:D,2,0)),\"Konto findes ikke!\",VLOOKUP(F863,Kontoplan!A:D,2,0)))","v":"Samlet betaling"}]
["2022-04-19",48,null,null,null,12310,null,246.46,{"$f":"IF(F864=\"\",\"\",IF(ISERROR(VLOOKUP(F864,Kontoplan!A:D,2,0)),\"Konto findes ikke!\",VLOOKUP(F864,Kontoplan!A:D,2,0)))","v":"Bank konto"}]
["2022-04-19",49,null,null,null,2025,123.44,null,{"$f":"IF(F865=\"\",\"\",IF(ISERROR(VLOOKUP(F865,Kontoplan!A:D,2,0)),\"Konto findes ikke!\",VLOOKUP(F865,Kontoplan!A:D,2,0)))","v":"Regnskabsservice"}]
["2022-04-19",49,null,null,null,12310,null,123.44,{"$f":"IF(F866=\"\",\"\",IF(ISERROR(VLOOKUP(F866,Kontoplan!A:D,2,0)),\"Konto findes ikke!\",VLOOKUP(F866,Kontoplan!A:D,2,0)))","v":"Bank konto"}]
["2022-04-26",50,null,null,null,2010,27.5,null,{"$f":"IF(F867=\"\",\"\",IF(ISERROR(VLOOKUP(F867,Kontoplan!A:D,2,0)),\"Konto findes ikke!\",VLOOKUP(F867,Kontoplan!A:D,2,0)))","v":"Danløn"}]
["2022-04-26",50,null,null,null,12310,null,27.5,{"$f":"IF(F868=\"\",\"\",IF(ISERROR(VLOOKUP(F868,Kontoplan!A:D,2,0)),\"Konto findes ikke!\",VLOOKUP(F868,Kontoplan!A:D,2,0)))","v":"Bank konto"}]
["2022-04-26",51,null,null,null,2065,7393.75,null,{"$f":"IF(F869=\"\",\"\",IF(ISERROR(VLOOKUP(F869,Kontoplan!A:D,2,0)),\"Konto findes ikke!\",VLOOKUP(F869,Kontoplan!A:D,2,0)))","v":"Udstilling"}]
["2022-04-26",51,null,null,null,12310,null,7393.75,{"$f":"IF(F870=\"\",\"\",IF(ISERROR(VLOOKUP(F870,Kontoplan!A:D,2,0)),\"Konto findes ikke!\",VLOOKUP(F870,Kontoplan!A:D,2,0)))","v":"Bank konto"}]
["2022-04-27",52,null,null,null,2030,329.7,null,{"$f":"IF(F871=\"\",\"\",IF(ISERROR(VLOOKUP(F871,Kontoplan!A:D,2,0)),\"Konto findes ikke!\",VLOOKUP(F871,Kontoplan!A:D,2,0)))","v":"Bygnings vedligehold"}]
["2022-04-27",52,null,null,null,12310,null,329.7,{"$f":"IF(F872=\"\",\"\",IF(ISERROR(VLOOKUP(F872,Kontoplan!A:D,2,0)),\"Konto findes ikke!\",VLOOKUP(F872,Kontoplan!A:D,2,0)))","v":"Bank konto"}]
["2022-04-27",53,null,null,null,2110,350,null,{"$f":"IF(F873=\"\",\"\",IF(ISERROR(VLOOKUP(F873,Kontoplan!A:D,2,0)),\"Konto findes ikke!\",VLOOKUP(F873,Kontoplan!A:D,2,0)))","v":"Kontorhold - Porto - IT"}]
["2022-04-27",53,null,null,null,12310,null,350,{"$f":"IF(F874=\"\",\"\",IF(ISERROR(VLOOKUP(F874,Kontoplan!A:D,2,0)),\"Konto findes ikke!\",VLOOKUP(F874,Kontoplan!A:D,2,0)))","v":"Bank konto"}]
["2022-04-27",54,null,null,null,2065,2981.5,null,{"$f":"IF(F875=\"\",\"\",IF(ISERROR(VLOOKUP(F875,Kontoplan!A:D,2,0)),\"Konto findes ikke!\",VLOOKUP(F875,Kontoplan!A:D,2,0)))","v":"Udstilling"}]
["2022-04-27",54,null,null,null,12310,null,2981.5,{"$f":"IF(F876=\"\",\"\",IF(ISERROR(VLOOKUP(F876,Kontoplan!A:D,2,0)),\"Konto findes ikke!\",VLOOKUP(F876,Kontoplan!A:D,2,0)))","v":"Bank konto"}]
["2022-04-28",55,null,null,null,3110,10000,null,{"$f":"IF(F877=\"\",\"\",IF(ISERROR(VLOOKUP(F877,Kontoplan!A:D,2,0)),\"Konto findes ikke!\",VLOOKUP(F877,Kontoplan!A:D,2,0)))","v":"Lønninger incl ATP -AM"}]
["2022-04-28",55,null,null,null,12310,null,4952.45,{"$f":"IF(F878=\"\",\"\",IF(ISERROR(VLOOKUP(F878,Kontoplan!A:D,2,0)),\"Konto findes ikke!\",VLOOKUP(F878,Kontoplan!A:D,2,0)))","v":"Bank konto"}]
["2022-04-28",55,null,null,null,12360,null,4219,{"$f":"IF(F879=\"\",\"\",IF(ISERROR(VLOOKUP(F879,Kontoplan!A:D,2,0)),\"Konto findes ikke!\",VLOOKUP(F879,Kontoplan!A:D,2,0)))","v":"Skyldig A-skat"}]
["2022-04-28",55,null,null,null,12361,null,797,{"$f":"IF(F880=\"\",\"\",IF(ISERROR(VLOOKUP(F880,Kontoplan!A:D,2,0)),\"Konto findes ikke!\",VLOOKUP(F880,Kontoplan!A:D,2,0)))","v":"Skyldig AM "}]
["2022-04-28",55,null,null,null,12362,null,31.55,{"$f":"IF(F881=\"\",\"\",IF(ISERROR(VLOOKUP(F881,Kontoplan!A:D,2,0)),\"Konto findes ikke!\",VLOOKUP(F881,Kontoplan!A:D,2,0)))","v":"Skyldig ATP"}]
["2022-04-28",55,null,null,null,3120,63.1,null,{"$f":"IF(F882=\"\",\"\",IF(ISERROR(VLOOKUP(F882,Kontoplan!A:D,2,0)),\"Konto findes ikke!\",VLOOKUP(F882,Kontoplan!A:D,2,0)))","v":"ATP"}]
["2022-04-28",55,null,null,null,12362,null,63.1,{"$f":"IF(F883=\"\",\"\",IF(ISERROR(VLOOKUP(F883,Kontoplan!A:D,2,0)),\"Konto findes ikke!\",VLOOKUP(F883,Kontoplan!A:D,2,0)))","v":"Skyldig ATP"}]
["2022-04-28",55,null,null,null,3110,200,null,{"$f":"IF(F884=\"\",\"\",IF(ISERROR(VLOOKUP(F884,Kontoplan!A:D,2,0)),\"Konto findes ikke!\",VLOOKUP(F884,Kontoplan!A:D,2,0)))","v":"Lønninger incl ATP -AM"}]
["2022-04-28",55,null,null,null,12364,null,200,{"$f":"IF(F885=\"\",\"\",IF(ISERROR(VLOOKUP(F885,Kontoplan!A:D,2,0)),\"Konto findes ikke!\",VLOOKUP(F885,Kontoplan!A:D,2,0)))","v":"Skyldig feriepenge"}]
["2022-04-29",56,null,null,null,2000,1.5,null,{"$f":"IF(F886=\"\",\"\",IF(ISERROR(VLOOKUP(F886,Kontoplan!A:D,2,0)),\"Konto findes ikke!\",VLOOKUP(F886,Kontoplan!A:D,2,0)))","v":"Bankgebyr"}]
["2022-04-29",56,null,null,null,12310,null,1.5,{"$f":"IF(F887=\"\",\"\",IF(ISERROR(VLOOKUP(F887,Kontoplan!A:D,2,0)),\"Konto findes ikke!\",VLOOKUP(F887,Kontoplan!A:D,2,0)))","v":"Bank konto"}]
["2022-05-02",57,null,null,null,2040,8712.0499999999993,null,{"$f":"IF(F888=\"\",\"\",IF(ISERROR(VLOOKUP(F888,Kontoplan!A:D,2,0)),\"Konto findes ikke!\",VLOOKUP(F888,Kontoplan!A:D,2,0)))","v":"El, Vand og Varme"}]
["2022-05-02",57,null,null,null,12310,null,8712.0499999999993,{"$f":"IF(F889=\"\",\"\",IF(ISERROR(VLOOKUP(F889,Kontoplan!A:D,2,0)),\"Konto findes ikke!\",VLOOKUP(F889,Kontoplan!A:D,2,0)))","v":"Bank konto"}]
["2022-05-02",58,null,null,null,2040,3733.54,null,{"$f":"IF(F890=\"\",\"\",IF(ISERROR(VLOOKUP(F890,Kontoplan!A:D,2,0)),\"Konto findes ikke!\",VLOOKUP(F890,Kontoplan!A:D,2,0)))","v":"El, Vand og Varme"}]
["2022-05-02",58,null,null,null,12310,null,3733.54,{"$f":"IF(F891=\"\",\"\",IF(ISERROR(VLOOKUP(F891,Kontoplan!A:D,2,0)),\"Konto findes ikke!\",VLOOKUP(F891,Kontoplan!A:D,2,0)))","v":"Bank konto"}]
["2022-05-02",59,null,null,null,2060,377.75,null,{"$f":"IF(F892=\"\",\"\",IF(ISERROR(VLOOKUP(F892,Kontoplan!A:D,2,0)),\"Konto findes ikke!\",VLOOKUP(F892,Kontoplan!A:D,2,0)))","v":"Internet, mobiltelefon, Forsik."}]
["2022-05-02",59,null,null,null,12310,null,377.75,{"$f":"IF(F893=\"\",\"\",IF(ISERROR(VLOOKUP(F893,Kontoplan!A:D,2,0)),\"Konto findes ikke!\",VLOOKUP(F893,Kontoplan!A:D,2,0)))","v":"Bank konto"}]
["2022-05-03",60,null,null,null,2075,170,null,{"$f":"IF(F894=\"\",\"\",IF(ISERROR(VLOOKUP(F894,Kontoplan!A:D,2,0)),\"Konto findes ikke!\",VLOOKUP(F894,Kontoplan!A:D,2,0)))","v":"Gaver"}]
["2022-05-03",60,null,null,null,12310,null,170,{"$f":"IF(F895=\"\",\"\",IF(ISERROR(VLOOKUP(F895,Kontoplan!A:D,2,0)),\"Konto findes ikke!\",VLOOKUP(F895,Kontoplan!A:D,2,0)))","v":"Bank konto"}]
["2022-05-03",61,null,null,null,2170,306.10000000000002,null,{"$f":"IF(F896=\"\",\"\",IF(ISERROR(VLOOKUP(F896,Kontoplan!A:D,2,0)),\"Konto findes ikke!\",VLOOKUP(F896,Kontoplan!A:D,2,0)))","v":"Afholdelse af GF"}]
["2022-05-03",61,null,null,null,12310,null,306.10000000000002,{"$f":"IF(F897=\"\",\"\",IF(ISERROR(VLOOKUP(F897,Kontoplan!A:D,2,0)),\"Konto findes ikke!\",VLOOKUP(F897,Kontoplan!A:D,2,0)))","v":"Bank konto"}]
["2022-05-03",62,null,null,null,2035,713.64,null,{"$f":"IF(F898=\"\",\"\",IF(ISERROR(VLOOKUP(F898,Kontoplan!A:D,2,0)),\"Konto findes ikke!\",VLOOKUP(F898,Kontoplan!A:D,2,0)))","v":"Grønne områder"}]
["2022-05-03",62,null,null,null,12310,null,713.64,{"$f":"IF(F899=\"\",\"\",IF(ISERROR(VLOOKUP(F899,Kontoplan!A:D,2,0)),\"Konto findes ikke!\",VLOOKUP(F899,Kontoplan!A:D,2,0)))","v":"Bank konto"}]
["2022-05-03",63,null,null,null,12310,476.1,null,{"$f":"IF(F900=\"\",\"\",IF(ISERROR(VLOOKUP(F900,Kontoplan!A:D,2,0)),\"Konto findes ikke!\",VLOOKUP(F900,Kontoplan!A:D,2,0)))","v":"Bank konto"}]
["2022-05-03",63,null,null,null,1130,null,476.1,{"$f":"IF(F901=\"\",\"\",IF(ISERROR(VLOOKUP(F901,Kontoplan!A:D,2,0)),\"Konto findes ikke!\",VLOOKUP(F901,Kontoplan!A:D,2,0)))","v":"Diverse Indtægter"}]
["2022-05-04",64,null,null,null,2100,242,null,{"$f":"IF(F902=\"\",\"\",IF(ISERROR(VLOOKUP(F902,Kontoplan!A:D,2,0)),\"Konto findes ikke!\",VLOOKUP(F902,Kontoplan!A:D,2,0)))","v":"Forplejning til møder/Rejser"}]
["2022-05-04",64,null,null,null,12310,null,242,{"$f":"IF(F903=\"\",\"\",IF(ISERROR(VLOOKUP(F903,Kontoplan!A:D,2,0)),\"Konto findes ikke!\",VLOOKUP(F903,Kontoplan!A:D,2,0)))","v":"Bank konto"}]
["2022-05-04",65,null,null,null,12310,20000,null,{"$f":"IF(F904=\"\",\"\",IF(ISERROR(VLOOKUP(F904,Kontoplan!A:D,2,0)),\"Konto findes ikke!\",VLOOKUP(F904,Kontoplan!A:D,2,0)))","v":"Bank konto"}]
["2022-05-04",65,null,null,null,1030,null,20000,{"$f":"IF(F905=\"\",\"\",IF(ISERROR(VLOOKUP(F905,Kontoplan!A:D,2,0)),\"Konto findes ikke!\",VLOOKUP(F905,Kontoplan!A:D,2,0)))","v":"Tilskud fra KVB"}]
["2022-05-04",66,null,null,null,12320,605,null,{"$f":"IF(F906=\"\",\"\",IF(ISERROR(VLOOKUP(F906,Kontoplan!A:D,2,0)),\"Konto findes ikke!\",VLOOKUP(F906,Kontoplan!A:D,2,0)))","v":"Kasse"}]
["2022-05-04",66,null,null,null,1000,null,550,{"$f":"IF(F907=\"\",\"\",IF(ISERROR(VLOOKUP(F907,Kontoplan!A:D,2,0)),\"Konto findes ikke!\",VLOOKUP(F907,Kontoplan!A:D,2,0)))","v":"Entre"}]
["2022-05-04",66,null,null,null,1010,null,55,{"$f":"IF(F908=\"\",\"\",IF(ISERROR(VLOOKUP(F908,Kontoplan!A:D,2,0)),\"Konto findes ikke!\",VLOOKUP(F908,Kontoplan!A:D,2,0)))","v":"Kiosk salg"}]
["2022-05-05",67,null,null,null,12320,1265,null,{"$f":"IF(F909=\"\",\"\",IF(ISERROR(VLOOKUP(F909,Kontoplan!A:D,2,0)),\"Konto findes ikke!\",VLOOKUP(F909,Kontoplan!A:D,2,0)))","v":"Kasse"}]
["2022-05-05",67,null,null,null,1000,null,1255,{"$f":"IF(F910=\"\",\"\",IF(ISERROR(VLOOKUP(F910,Kontoplan!A:D,2,0)),\"Konto findes ikke!\",VLOOKUP(F910,Kontoplan!A:D,2,0)))","v":"Entre"}]
["2022-05-05",67,null,null,null,1010,null,10,{"$f":"IF(F911=\"\",\"\",IF(ISERROR(VLOOKUP(F911,Kontoplan!A:D,2,0)),\"Konto findes ikke!\",VLOOKUP(F911,Kontoplan!A:D,2,0)))","v":"Kiosk salg"}]
["2022-05-05",67,null,null,null,12430,120,null,{"$f":"IF(F912=\"\",\"\",IF(ISERROR(VLOOKUP(F912,Kontoplan!A:D,2,0)),\"Konto findes ikke!\",VLOOKUP(F912,Kontoplan!A:D,2,0)))","v":"Tilgode PayPal"}]
["2022-05-05",67,null,null,null,1000,null,120,{"$f":"IF(F913=\"\",\"\",IF(ISERROR(VLOOKUP(F913,Kontoplan!A:D,2,0)),\"Konto findes ikke!\",VLOOKUP(F913,Kontoplan!A:D,2,0)))","v":"Entre"}]
["2022-05-05",67,null,null,null,2005,2.34,null,{"$f":"IF(F914=\"\",\"\",IF(ISERROR(VLOOKUP(F914,Kontoplan!A:D,2,0)),\"Konto findes ikke!\",VLOOKUP(F914,Kontoplan!A:D,2,0)))","v":"Gebyr Izettle"}]
["2022-05-05",67,null,null,null,12430,null,2.34,{"$f":"IF(F915=\"\",\"\",IF(ISERROR(VLOOKUP(F915,Kontoplan!A:D,2,0)),\"Konto findes ikke!\",VLOOKUP(F915,Kontoplan!A:D,2,0)))","v":"Tilgode PayPal"}]
["2022-05-04",68,null,null,null,12310,56,null,{"$f":"IF(F916=\"\",\"\",IF(ISERROR(VLOOKUP(F916,Kontoplan!A:D,2,0)),\"Konto findes ikke!\",VLOOKUP(F916,Kontoplan!A:D,2,0)))","v":"Bank konto"}]
["2022-05-04",68,null,null,null,1130,null,56,{"$f":"IF(F917=\"\",\"\",IF(ISERROR(VLOOKUP(F917,Kontoplan!A:D,2,0)),\"Konto findes ikke!\",VLOOKUP(F917,Kontoplan!A:D,2,0)))","v":"Diverse Indtægter"}]
["2022-05-05",69,null,null,null,2060,19,null,{"$f":"IF(F918=\"\",\"\",IF(ISERROR(VLOOKUP(F918,Kontoplan!A:D,2,0)),\"Konto findes ikke!\",VLOOKUP(F918,Kontoplan!A:D,2,0)))","v":"Internet, mobiltelefon, Forsik."}]
["2022-05-05",69,null,null,null,12310,null,19,{"$f":"IF(F919=\"\",\"\",IF(ISERROR(VLOOKUP(F919,Kontoplan!A:D,2,0)),\"Konto findes ikke!\",VLOOKUP(F919,Kontoplan!A:D,2,0)))","v":"Bank konto"}]
["2022-05-06",70,null,null,null,2080,1200,null,{"$f":"IF(F920=\"\",\"\",IF(ISERROR(VLOOKUP(F920,Kontoplan!A:D,2,0)),\"Konto findes ikke!\",VLOOKUP(F920,Kontoplan!A:D,2,0)))","v":"Indkøb af bøger"}]
["2022-05-06",70,null,null,null,12310,null,1200,{"$f":"IF(F921=\"\",\"\",IF(ISERROR(VLOOKUP(F921,Kontoplan!A:D,2,0)),\"Konto findes ikke!\",VLOOKUP(F921,Kontoplan!A:D,2,0)))","v":"Bank konto"}]
["2022-05-06",71,null,null,null,2065,56,null,{"$f":"IF(F922=\"\",\"\",IF(ISERROR(VLOOKUP(F922,Kontoplan!A:D,2,0)),\"Konto findes ikke!\",VLOOKUP(F922,Kontoplan!A:D,2,0)))","v":"Udstilling"}]
["2022-05-06",71,null,null,null,12310,null,56,{"$f":"IF(F923=\"\",\"\",IF(ISERROR(VLOOKUP(F923,Kontoplan!A:D,2,0)),\"Konto findes ikke!\",VLOOKUP(F923,Kontoplan!A:D,2,0)))","v":"Bank konto"}]
["2022-05-06",72,null,null,null,12320,530,null,{"$f":"IF(F924=\"\",\"\",IF(ISERROR(VLOOKUP(F924,Kontoplan!A:D,2,0)),\"Konto findes ikke!\",VLOOKUP(F924,Kontoplan!A:D,2,0)))","v":"Kasse"}]
["2022-05-06",72,null,null,null,1000,null,520,{"$f":"IF(F925=\"\",\"\",IF(ISERROR(VLOOKUP(F925,Kontoplan!A:D,2,0)),\"Konto findes ikke!\",VLOOKUP(F925,Kontoplan!A:D,2,0)))","v":"Entre"}]
["2022-05-06",72,null,null,null,1010,null,10,{"$f":"IF(F926=\"\",\"\",IF(ISERROR(VLOOKUP(F926,Kontoplan!A:D,2,0)),\"Konto findes ikke!\",VLOOKUP(F926,Kontoplan!A:D,2,0)))","v":"Kiosk salg"}]
["2022-05-06",72,null,null,null,12430,765,null,{"$f":"IF(F927=\"\",\"\",IF(ISERROR(VLOOKUP(F927,Kontoplan!A:D,2,0)),\"Konto findes ikke!\",VLOOKUP(F927,Kontoplan!A:D,2,0)))","v":"Tilgode PayPal"}]
["2022-05-06",72,null,null,null,1000,null,765,{"$f":"IF(F928=\"\",\"\",IF(ISERROR(VLOOKUP(F928,Kontoplan!A:D,2,0)),\"Konto findes ikke!\",VLOOKUP(F928,Kontoplan!A:D,2,0)))","v":"Entre"}]
["2022-05-06",72,null,null,null,2005,14.92,null,{"$f":"IF(F929=\"\",\"\",IF(ISERROR(VLOOKUP(F929,Kontoplan!A:D,2,0)),\"Konto findes ikke!\",VLOOKUP(F929,Kontoplan!A:D,2,0)))","v":"Gebyr Izettle"}]
["2022-05-06",72,null,null,null,12430,null,14.92,{"$f":"IF(F930=\"\",\"\",IF(ISERROR(VLOOKUP(F930,Kontoplan!A:D,2,0)),\"Konto findes ikke!\",VLOOKUP(F930,Kontoplan!A:D,2,0)))","v":"Tilgode PayPal"}]
["2022-05-07",73,null,null,null,12320,60,null,{"$f":"IF(F931=\"\",\"\",IF(ISERROR(VLOOKUP(F931,Kontoplan!A:D,2,0)),\"Konto findes ikke!\",VLOOKUP(F931,Kontoplan!A:D,2,0)))","v":"Kasse"}]
["2022-05-07",73,null,null,null,1000,null,60,{"$f":"IF(F932=\"\",\"\",IF(ISERROR(VLOOKUP(F932,Kontoplan!A:D,2,0)),\"Konto findes ikke!\",VLOOKUP(F932,Kontoplan!A:D,2,0)))","v":"Entre"}]
["2022-05-07",73,null,null,null,12430,345,null,{"$f":"IF(F933=\"\",\"\",IF(ISERROR(VLOOKUP(F933,Kontoplan!A:D,2,0)),\"Konto findes ikke!\",VLOOKUP(F933,Kontoplan!A:D,2,0)))","v":"Tilgode PayPal"}]
["2022-05-07",73,null,null,null,1000,null,345,{"$f":"IF(F934=\"\",\"\",IF(ISERROR(VLOOKUP(F934,Kontoplan!A:D,2,0)),\"Konto findes ikke!\",VLOOKUP(F934,Kontoplan!A:D,2,0)))","v":"Entre"}]
["2022-05-07",73,null,null,null,2005,6.73,null,{"$f":"IF(F935=\"\",\"\",IF(ISERROR(VLOOKUP(F935,Kontoplan!A:D,2,0)),\"Konto findes ikke!\",VLOOKUP(F935,Kontoplan!A:D,2,0)))","v":"Gebyr Izettle"}]
["2022-05-07",73,null,null,null,12430,null,6.73,{"$f":"IF(F936=\"\",\"\",IF(ISERROR(VLOOKUP(F936,Kontoplan!A:D,2,0)),\"Konto findes ikke!\",VLOOKUP(F936,Kontoplan!A:D,2,0)))","v":"Tilgode PayPal"}]
["2022-05-09",74,null,null,null,3120,283.95,null,{"$f":"IF(F937=\"\",\"\",IF(ISERROR(VLOOKUP(F937,Kontoplan!A:D,2,0)),\"Konto findes ikke!\",VLOOKUP(F937,Kontoplan!A:D,2,0)))","v":"ATP"}]
["2022-05-09",74,null,null,null,12310,null,283.95,{"$f":"IF(F938=\"\",\"\",IF(ISERROR(VLOOKUP(F938,Kontoplan!A:D,2,0)),\"Konto findes ikke!\",VLOOKUP(F938,Kontoplan!A:D,2,0)))","v":"Bank konto"}]
["2022-05-09",75,null,null,null,12310,35,null,{"$f":"IF(F939=\"\",\"\",IF(ISERROR(VLOOKUP(F939,Kontoplan!A:D,2,0)),\"Konto findes ikke!\",VLOOKUP(F939,Kontoplan!A:D,2,0)))","v":"Bank konto"}]
["2022-05-09",75,null,null,null,1000,null,35,{"$f":"IF(F940=\"\",\"\",IF(ISERROR(VLOOKUP(F940,Kontoplan!A:D,2,0)),\"Konto findes ikke!\",VLOOKUP(F940,Kontoplan!A:D,2,0)))","v":"Entre"}]
["2022-05-09",76,null,null,null,1000,35,null,{"$f":"IF(F941=\"\",\"\",IF(ISERROR(VLOOKUP(F941,Kontoplan!A:D,2,0)),\"Konto findes ikke!\",VLOOKUP(F941,Kontoplan!A:D,2,0)))","v":"Entre"}]
["2022-05-09",76,null,null,null,12310,null,35,{"$f":"IF(F942=\"\",\"\",IF(ISERROR(VLOOKUP(F942,Kontoplan!A:D,2,0)),\"Konto findes ikke!\",VLOOKUP(F942,Kontoplan!A:D,2,0)))","v":"Bank konto"}]
["2022-05-09",77,null,null,null,2100,344.35,null,{"$f":"IF(F943=\"\",\"\",IF(ISERROR(VLOOKUP(F943,Kontoplan!A:D,2,0)),\"Konto findes ikke!\",VLOOKUP(F943,Kontoplan!A:D,2,0)))","v":"Forplejning til møder/Rejser"}]
["2022-05-09",77,null,null,null,12310,null,344.35,{"$f":"IF(F944=\"\",\"\",IF(ISERROR(VLOOKUP(F944,Kontoplan!A:D,2,0)),\"Konto findes ikke!\",VLOOKUP(F944,Kontoplan!A:D,2,0)))","v":"Bank konto"}]
["2022-05-09",78,null,null,null,2100,672,null,{"$f":"IF(F945=\"\",\"\",IF(ISERROR(VLOOKUP(F945,Kontoplan!A:D,2,0)),\"Konto findes ikke!\",VLOOKUP(F945,Kontoplan!A:D,2,0)))","v":"Forplejning til møder/Rejser"}]
["2022-05-09",78,null,null,null,12310,null,672,{"$f":"IF(F946=\"\",\"\",IF(ISERROR(VLOOKUP(F946,Kontoplan!A:D,2,0)),\"Konto findes ikke!\",VLOOKUP(F946,Kontoplan!A:D,2,0)))","v":"Bank konto"}]
["2022-05-09",79,null,null,null,2100,129.65,null,{"$f":"IF(F947=\"\",\"\",IF(ISERROR(VLOOKUP(F947,Kontoplan!A:D,2,0)),\"Konto findes ikke!\",VLOOKUP(F947,Kontoplan!A:D,2,0)))","v":"Forplejning til møder/Rejser"}]
["2022-05-09",79,null,null,null,12310,null,129.65,{"$f":"IF(F948=\"\",\"\",IF(ISERROR(VLOOKUP(F948,Kontoplan!A:D,2,0)),\"Konto findes ikke!\",VLOOKUP(F948,Kontoplan!A:D,2,0)))","v":"Bank konto"}]
["2022-05-09",80,null,null,null,2100,17.25,null,{"$f":"IF(F949=\"\",\"\",IF(ISERROR(VLOOKUP(F949,Kontoplan!A:D,2,0)),\"Konto findes ikke!\",VLOOKUP(F949,Kontoplan!A:D,2,0)))","v":"Forplejning til møder/Rejser"}]
["2022-05-09",80,null,null,null,12310,null,17.25,{"$f":"IF(F950=\"\",\"\",IF(ISERROR(VLOOKUP(F950,Kontoplan!A:D,2,0)),\"Konto findes ikke!\",VLOOKUP(F950,Kontoplan!A:D,2,0)))","v":"Bank konto"}]
[]
[]
[]
[]
[]
[]
[]
[]
[]
[]
[]
[]
[]
[]
[]
[]
[]
[]
[]
[]
[]
[]
[]
[]
[]
[]
[]
[]
[]
[]
[]
[]
[]
[]
[]
[]
[]
[]
[]
[]
[]
[]
[]
[]
[]
[]
[]
[]
[]
[]
[]
[]
[]
[]
[]
[]
[]
[]
[]
[]
[]
[]
[]
[]
[]
[]
[]
[]
[]
[]
[]
[]
[]
[]
[]
[]
[]
[]
[]
[]
[]
[]
[]
[]
[]
[]
[]
[]
[]
[]
[]
[]
[]
[]
[]
[]
[]
[]
[]
[]
[]
[]
[]
[]
[]
[]
[]
[]
[]
[]
[]
[]
[]
[]
[]
[]
[]
[]
[]
[]
[]
[]
[]
[]
[]
[]
[]
[]
[]
[]
[]
[]
[]
[]
[]
[]
[]
[]
[]
[]
[]
[]
[]
[]
[]
[]
[]
[]
[]
[]
[]
[]
[]
[]
[]
[]
[]
[]
[]
[]
[]
[]
[]
[]
[]
[]
[]
[]
[]
[]
[]
[]
[]
[]
[]
[]
[]
[]
[]
[]
[]
[]
[]
[]
[]
[]
[]
[]
[]
[]
[]
[]
[]
[]
[]
[]
[]
[]
[]
[]
[]
[]
[]
[]
[]
[]
[]
[]
[]
[]
[]
[]
[]
[]
[]
[]
[]
[]
[]
[]
[]
[]
[]
[]
[]
[]
[]
[]
[]
[]
[]
[]
[]
[]
[]
[]
[]
[]
[]
[]
[]
[]
[]
[]
[]
[]
[]
[]
[]
[]
[]
[]
[]
[]
[]
[]
[]
[]
[]
[]
[]
[]
[]
[]
[]
[]
[]
[]
[]
[]
[]
[]
[]
[]
[]
[]
[]
[]
[]
[]
[]
[]
[]
[]
[]
[]
[]
[]
[]
[]
[]
[]
[]
[]
[]
[]
[]
[]
[]
[]
[]
[]
[]
[]
[]
[]
[]
[]
[]
[]
[]
[]
[]
[]
[]
[]
[]
[]
[]
[]
[]
[]
[]
[]
[]
[]
[]
[]
[]
[]
[]
[]
[]
[]
[]
[]
[]
[]
[]
[]
[]
[]
[]
[]
[]
[]
[]
[]
[]
[]
[]
[]
[]
[]
[]
[]
[]
[]
[]
[]
[]
[]
[]
[]
[]
[]
[]
[]
[]
[]
[]
[]
[]
[]
[]
[]
[]
[]
[]
[]
[]
[]
[]
[]
[]
[]
[]
[]
[]
[]
[]
[]
[]
[]
[]
[]
[]
[]
[]
[]
[]
[]
[]
[]
[]
[]
[]
[]
[]
[]
[]
[]
[]
[]
[]
[]
[]
[]
[]
[]
[]
[]
[]
[]
[]
[]
[]
[]
[]
[]
[]
[]
[]
[]
[]
[]
[]
[]
[]
[]
[]
[]
[]
[]
[]
[]
[]
[]
[]
[]
[]
[]
[]
[]
[]
[]
[]
[]
[]
[]
[]
[]
[]
[]
[]
[]
[]
[]
[]
[]
[]
[]
[]
[]
[]
[]
[]
[]
[]
[]
[]
[]
[]
[]
[]
[]
[]
[]
[]
[]
[]
[]
[]
[]
[]
[]
[]
[]
[]
[]
[]
[]
[]
[]
[]
[]
[]
[]
[]
[]
[]
[]
[]
[]
[]
[]
[]
[]
[]
[]
[]
[]
[]
[]
[]
[]
[]
[]
[]
[]
[]
[]
[]
[]
[]
[]
[]
[]
[]
[]
[]
[]
[]
[]
[]
[]
[]
[]
[]
[]
[]
[]
[]
[]
[]
[]
[]
[]
[]
[]
[]
[]
[]
[]
[]
[]
[]
[]
[]
[]
[]
[]
[]
[]
[]
[]
[]
[]
[]
[]
[]
[]
[]
[]
[]
[]
[]
[]
[]
[]
[]
[]
[]
[]
[]
[]
[]
[]
[]
[]
[]
[]
[]
[]
[]
[]
[]
[]
[]
[]
[]
[]
[]
[]
[]
[]
[]
[]
[]
[]
[]
[]
[]
[]
[]
[]
[]
[]
[]
[]
[]
[]
[]
[]
[]
[]
[]
[]
[]
[]
[]
[]
[]
[]
[]
[]
[]
[]
[]
[]
[]
[]
[]
[]
[]
[]
[]
[]
[]
[]
[]
[]
[]
[]
[]
[]
[]
[]
[]
[]
[]
[]
[]
[]
[]
[]
[]
[]
[]
[]
[]
[]
[]
[]
[]
[]
[]
[]
[]
[]
[]
[]
[]
[]
[]
[]
[]
[]
[]
[]
[]
[]
[]
[]
[]
[]
[]
[]
[]
[]
[]
[]
[]
[]
[]
[]
[]
[]
[]
[]
[]
[]
[]
[]
[]
[]
[]
[]
[]
[]
[]
[]
[]
[]
[]
[]
[]
[]
[]
[]
[]
[]
[]
[]
[]
[]
[]
[]
[]
[]
[]
[]
[]
[]
[]
[]
[]
[]
[]
[]
[]
[]
[]
[]
[]
[]
[]
[]
[]
[]
[]
[]
[]
[]
[]
[]
[]
[]
[]
[]
[]
[]
[]
[]
[]
[]
[]
[]
[]
[]
[]
[]
[]
[]
[]
[]
[]
[]
[]
[]
[]
[]
[]
[]
[]
[]
[]
[]
[]
[]
[]
[]
[]
[]
[]
[]
[]
[]
[]
[]
[]
[]
[]
[]
[]
[]
[]
[]
[]
[]
[]
[]
[]
[]
[]
[]
[]
[]
[]
[]
[]
[]
[]
[]
[]
[]
[]
[]
[]
[]
[]
[]
[]
[]
[]
[]
[]
[]
[]
[]
[]
[]
[]
[]
[]
[]
[]
[]
[]
[]
[]
[]
[]
[]
[]
[]
[]
[]
[]
[]
[]
[]
[]
[]
[]
[]
[]
[]
[]
[]
[]
[]
[]
[]
[]
[]
[]
[]
[]
[]
[]
[]
[]
[]
[]
[]
[]
[]
[]
[]
[]
[]
[]
[]
[]
[]
[]
[]
[]
[]
[]
[]
[]
[]
[]
[]
[]
[]
[]
[]
[]
[]
[]
[]
[]
[]
[]
[]
[]
[]
[]
[]
[]
[]
[]
[]
[]
[]
[]
[]
[]
[]
[]
[]
[]
[]
[]
[]
[]
[]
[]
[]
[]
[]
[]
[]
[]
[]
[]
[]
[]
[]
[]
[]
[]
[]
[]
[]
[]
[]
[]
[]
[]
[]
[]
[]
[]
[]
[]
[]
[]
[]
[]
[]
[]
[]
[]
[]
[]
[]
[]
[]
[]
[]
[]
[]
[]
[]
[]
[]
[]
[]
[]
[]
[]
[]
[]
[]
[]
[]
[]
[]
[]
[]
[]
[]
[]
[]
[]
[]
[]
[]
[]
[]
[]
[]
[]
[]
[]
[]
[]
[]
[]
[]
[]
[]
[]
[]
[]
[]
[]
[]
[]
[]
[]
[]
[]
[]
[]
[]
[]
[]
[]
[]
[]
[]
[]
[]
[]
[]
[]
[]
[]
[]
[]
[]
[]
[]
[]
[]
[]
[]
[]
[]
[]
[]
[]
[]
[]
[]
[]
[]
[]
[]
[]
[]
[]
[]
[]
[]
[]
[]
[]
[]
[]
[]
[]
[]
[]
[]
[]
[]
[]
[]
[]
[]
[]
[]
[]
[]
[]
[]
[]
[]
[]
[]
[]
[]
[]
[]
[]
[]
[]
[]
[]
[]
[]
[]
[]
[]
[]
[]
[]
[]
[]
[]
[]
[]
[]
[]
[]
[]
[]
[]
[]
[]
[]
[]
[]
[]
[]
[]
[]
[]
[]
[]
[]
[]
[]
[]
[]
[]
[]
[]
[]
[]
[]
[]
[]
[]
[]
[]
[]
[]
[]
[]
[]
[]
[]
[]
[]
[]
[]
[]
[]
[]
[]
[]
[]
[]
[]
[]
[]
[]
[]
[]
[]
[]
[]
[]
[]
[]
[]
[]
[]
[]
[]
[]
[]
[]
[]
[]
[]
[]
[]
[]
[]
[]
[]
[]
[]
[]
[]
[]
[]
[]
[]
[]
[]
[]
[]
[]
[]
[]
[]
[]
[]
[]
[]
[]
[]
[]
[]
[]
[]
[]
[]
[]
[]
[]
[]
[]
[]
[]
[]
[]
[]
[]
[]
[]
[]
[]
[]
[]
[]
[]
[]
[]
[]
[]
[]
[]
[]
[]
[]
[]
[]
[]
[]
[]
[]
[]
[]
[]
[]
[]
[]
[]
[]
[]
[]
[]
[]
[]
[]
[]
[]
[]
[]
[]
[]
[]
[]
[]
[]
[]
[]
[]
[]
[]
[]
[]
[]
[]
[]
[]
[]
[]
[]
[]
[]
[]
[]
[]
[]
[]
[]
[]
[]
[]
[]
[]
[]
[]
[]
[]
[]
[]
[]
[]
[]
[]
[]
[]
[]
[]
[]
[]
[]
[]
[]
[]
[]
[]
[]
[]
[]
[]
[]
[]
[]
[]
[]
[]
[]
[]
[]
[]
[]
[]
[]
[]
[]
[]
[]
[]
[]
[]
[]
[]
[]
[]
[]
[]
[]
[]
[]
[]
[]
[]
[]
[]
[]
[]
[]
[]
[]
[]
[]
[]
[]
[]
[]
[]
[]
[]
[]
[]
[]
[]
[]
[]
[]
[]
[]
[]
[]
[]
[]
[]
[]
[]
[]
[]
[]
[]
[]
[]
[]
[]
[]
[]
[]
[]
[]
[]
[]
[]
[]
[]
[]
[]
[]
[]
[]
[]
[]
[]
[]
[]
[]
[]
[]
[]
[]
[]
[]
[]
[]
[]
[]
[]
[]
[]
[]
[]
[]
[]
[]
[]
[]
[]
[]
[]
[]
[]
[]
[]
[]
[]
[]
[]
[]
[]
[]
[]
[]
[]
[]
[]
[]
[]
[]
[]
[]
[]
[]
[]
[]
[]
[]
[]
[]
[]
[]
[]
[]
[]
[]
[]
[]
[]
[]
[]
[]
[]
[]
[]
[]
[]
[]
[]
[]
[]
[]
[]
[]
[]
[]
[]
[]
[]
[]
[]
[]
[]
[]
[]
[]
[]
[]
[]
[]
[]
[]
[]
[]
[]
[]
[]
[]
[]
[]
[]
[]
[]
[]
[]
[]
[]
[]
[]
[]
[]
[]
[]
[]
[]
[]
[]
[]
[]
[]
[]
[]
[]
[]
[]
[]
[]
[]
[]
[]
[]
[]
[]
[]
[]
[]
[]
[]
[]
[]
[]
[]
[]
[]
[]
[]
[]
[]
[]
[]
[]
[]
[]
[]
[]
[]
[]
[]
[]
[]
[]
[]
[]
[]
[]
[]
[]
[]
[]
[]
[]
[]
[]
[]
[]
[]
[]
[]
[]
[]
[]
[]
[]
[]
[]
[]
[]
[]
[]
[]
[]
[]
[]
[]
[]
[]
[]
[]
[]
[]
[]
[]
[]
[]
[]
[]
[]
[]
[]
[]
[null,null,null,null,null,null,null,null,{"$f":"IF(F2624=\"\",\"\",IF(ISERROR(VLOOKUP(F2624,[1]Kontoplan!A:D,2,0)),\"Konto findes ikke!\",VLOOKUP(F2624,[1]Kontoplan!A:D,2,0)))","v":""}]

{"sheet":"Kontoplan","index":1,"n_rows":93,"n_cols":10,"rows_kept":93,"cut":false,"hidden":true,"merged":[]}
["Konto","Kontobeskrivelse","Saldo","Kommentarer","Fra","Til"]
[1000,"Entre",{"$f":"SUMIFS(Bogføring!$H:$H,Bogføring!$A:$A,\">=\"&T!$C$4,Bogføring!$A:$A,\"<=\"&T!$C$5,Bogføring!$F:$F,A2)-SUMIFS(Bogføring!$G:$G,Bogføring!$A:$A,\">=\"&T!$C$4,Bogføring!$A:$A,\"<=\"&T!$C$5,Bogføring!$F:$F,A2)","v":8740},null,null,null,null,1000,null,"Entre"]
[1010,"Kiosk salg",{"$f":"SUMIFS(Bogføring!$H:$H,Bogføring!$A:$A,\">=\"&T!$C$4,Bogføring!$A:$A,\"<=\"&T!$C$5,Bogføring!$F:$F,A3)-SUMIFS(Bogføring!$G:$G,Bogføring!$A:$A,\">=\"&T!$C$4,Bogføring!$A:$A,\"<=\"&T!$C$5,Bogføring!$F:$F,A3)","v":75},null,null,null,null,1010,null,"Voksne"]
[1020,"Tilskud fra BRK/ drifttilskud",{"$f":"SUMIFS(Bogføring!$H:$H,Bogføring!$A:$A,\">=\"&T!$C$4,Bogføring!$A:$A,\"<=\"&T!$C$5,Bogføring!$F:$F,A4)-SUMIFS(Bogføring!$G:$G,Bogføring!$A:$A,\">=\"&T!$C$4,Bogføring!$A:$A,\"<=\"&T!$C$5,Bogføring!$F:$F,A4)","v":74021},null,null,null,null,1020,null,"Pensionister"]
[1025,"Tilskud fra BRK ",{"$f":"SUMIFS(Bogføring!$H:$H,Bogføring!$A:$A,\">=\"&T!$C$4,Bogføring!$A:$A,\"<=\"&T!$C$5,Bogføring!$F:$F,A5)-SUMIFS(Bogføring!$G:$G,Bogføring!$A:$A,\">=\"&T!$C$4,Bogføring!$A:$A,\"<=\"&T!$C$5,Bogføring!$F:$F,A5)","v":15000},null,null,null,null,1030,null,"Børn 6-16"]
[1030,"Tilskud fra KVB",{"$f":"SUMIFS(Bogføring!$H:$H,Bogføring!$A:$A,\">=\"&T!$C$4,Bogføring!$A:$A,\"<=\"&T!$C$5,Bogføring!$F:$F,A6)-SUMIFS(Bogføring!$G:$G,Bogføring!$A:$A,\">=\"&T!$C$4,Bogføring!$A:$A,\"<=\"&T!$C$5,Bogføring!$F:$F,A6)","v":20000},null,null,null,null,1040,null,"Soldater/veteraner"]
[1040,"Fonde/Gaver",{"$f":"SUMIFS(Bogføring!$H:$H,Bogføring!$A:$A,\">=\"&T!$C$4,Bogføring!$A:$A,\"<=\"&T!$C$5,Bogføring!$F:$F,A7)-SUMIFS(Bogføring!$G:$G,Bogføring!$A:$A,\">=\"&T!$C$4,Bogføring!$A:$A,\"<=\"&T!$C$5,Bogføring!$F:$F,A7)","v":0},null,null,null,null,1050,null,"Skoler"]
[1050,"Aktiviteter",{"$f":"SUMIFS(Bogføring!$H:$H,Bogføring!$A:$A,\">=\"&T!$C$4,Bogføring!$A:$A,\"<=\"&T!$C$5,Bogføring!$F:$F,A8)-SUMIFS(Bogføring!$G:$G,Bogføring!$A:$A,\">=\"&T!$C$4,Bogføring!$A:$A,\"<=\"&T!$C$5,Bogføring!$F:$F,A8)","v":0},null,null,null,null,1060,null,"Grupper"]
[1060,"Bog salg",{"$f":"SUMIFS(Bogføring!$H:$H,Bogføring!$A:$A,\">=\"&T!$C$4,Bogføring!$A:$A,\"<=\"&T!$C$5,Bogføring!$F:$F,A9)-SUMIFS(Bogføring!$G:$G,Bogføring!$A:$A,\">=\"&T!$C$4,Bogføring!$A:$A,\"<=\"&T!$C$5,Bogføring!$F:$F,A9)","v":0},null,null,null,null,1070,null,"Guide"]
[1070,"Pengegaver",{"$f":"SUMIFS(Bogføring!$H:$H,Bogføring!$A:$A,\">=\"&T!$C$4,Bogføring!$A:$A,\"<=\"&T!$C$5,Bogføring!$F:$F,A10)-SUMIFS(Bogføring!$G:$G,Bogføring!$A:$A,\">=\"&T!$C$4,Bogføring!$A:$A,\"<=\"&T!$C$5,Bogføring!$F:$F,A10)","v":0},null,null,null,null,1080,null,"Tilskud fra BRK/ drifttilskud"]
[1080,"Flaskepant retur",{"$f":"SUMIFS(Bogføring!$H:$H,Bogføring!$A:$A,\">=\"&T!$C$4,Bogføring!$A:$A,\"<=\"&T!$C$5,Bogføring!$F:$F,A11)-SUMIFS(Bogføring!$G:$G,Bogføring!$A:$A,\">=\"&T!$C$4,Bogføring!$A:$A,\"<=\"&T!$C$5,Bogføring!$F:$F,A11)","v":0},null,null,null,null,1090,null,"Tilskud fra BRK "]
[1090,"Kassedifferance",{"$f":"SUMIFS(Bogføring!$H:$H,Bogføring!$A:$A,\">=\"&T!$C$4,Bogføring!$A:$A,\"<=\"&T!$C$5,Bogføring!$F:$F,A12)-SUMIFS(Bogføring!$G:$G,Bogføring!$A:$A,\">=\"&T!$C$4,Bogføring!$A:$A,\"<=\"&T!$C$5,Bogføring!$F:$F,A12)","v":0},null,null,null,null,1100,null,"Tilskud fra KVB"]
[1100,null,{"$f":"SUMIFS(Bogføring!$H:$H,Bogføring!$A:$A,\">=\"&T!$C$4,Bogføring!$A:$A,\"<=\"&T!$C$5,Bogføring!$F:$F,A13)-SUMIFS(Bogføring!$G:$G,Bogføring!$A:$A,\">=\"&T!$C$4,Bogføring!$A:$A,\"<=\"&T!$C$5,Bogføring!$F:$F,A13)","v":0},null,null,null,null,1110,null,"Fonde/Gaver"]
[1110,"A-skat Retur",{"$f":"SUMIFS(Bogføring!$H:$H,Bogføring!$A:$A,\">=\"&T!$C$4,Bogføring!$A:$A,\"<=\"&T!$C$5,Bogføring!$F:$F,A14)-SUMIFS(Bogføring!$G:$G,Bogføring!$A:$A,\">=\"&T!$C$4,Bogføring!$A:$A,\"<=\"&T!$C$5,Bogføring!$F:$F,A14)","v":2.9},null,null,null,null,1120,null,"Pengegaver"]
[1115,"Løn Retur fra visma",{"$f":"SUMIFS(Bogføring!$H:$H,Bogføring!$A:$A,\">=\"&T!$C$4,Bogføring!$A:$A,\"<=\"&T!$C$5,Bogføring!$F:$F,A15)-SUMIFS(Bogføring!$G:$G,Bogføring!$A:$A,\">=\"&T!$C$4,Bogføring!$A:$A,\"<=\"&T!$C$5,Bogføring!$F:$F,A15)","v":0},null,null,null,null,1130,null,"Flaskepant retur"]
[1120,"Lønsum retur",{"$f":"SUMIFS(Bogføring!$H:$H,Bogføring!$A:$A,\">=\"&T!$C$4,Bogføring!$A:$A,\"<=\"&T!$C$5,Bogføring!$F:$F,A16)-SUMIFS(Bogføring!$G:$G,Bogføring!$A:$A,\">=\"&T!$C$4,Bogføring!$A:$A,\"<=\"&T!$C$5,Bogføring!$F:$F,A16)","v":11493.46},null,null,null,null,1140,null,"Kassedifferance"]
[1125,"Salg af inventar",{"$f":"SUMIFS(Bogføring!$H:$H,Bogføring!$A:$A,\">=\"&T!$C$4,Bogføring!$A:$A,\"<=\"&T!$C$5,Bogføring!$F:$F,A17)-SUMIFS(Bogføring!$G:$G,Bogføring!$A:$A,\">=\"&T!$C$4,Bogføring!$A:$A,\"<=\"&T!$C$5,Bogføring!$F:$F,A17)","v":0},null,null,null,null,1150,null,"A-skat Retur"]
[1130,"Diverse Indtægter",{"$f":"SUMIFS(Bogføring!$H:$H,Bogføring!$A:$A,\">=\"&T!$C$4,Bogføring!$A:$A,\"<=\"&T!$C$5,Bogføring!$F:$F,A18)-SUMIFS(Bogføring!$G:$G,Bogføring!$A:$A,\">=\"&T!$C$4,Bogføring!$A:$A,\"<=\"&T!$C$5,Bogføring!$F:$F,A18)","v":532.1},null,null,null,null,1160,null,"Løn Retur fra visma"]
[1200,null,null,null,null,null,null,1170,null,"Lønsum retur"]
[1210,"Bælter",{"$f":"SUMIFS(Bogføring!$H:$H,Bogføring!$A:$A,\">=\"&T!$C$4,Bogføring!$A:$A,\"<=\"&T!$C$5,Bogføring!$F:$F,A20)-SUMIFS(Bogføring!$G:$G,Bogføring!$A:$A,\">=\"&T!$C$4,Bogføring!$A:$A,\"<=\"&T!$C$5,Bogføring!$F:$F,A20)","v":0},null,null,null,null,1180,null,"Salg af inventar"]
[1220,"Bog salg",{"$f":"SUMIFS(Bogføring!$H:$H,Bogføring!$A:$A,\">=\"&T!$C$4,Bogføring!$A:$A,\"<=\"&T!$C$5,Bogføring!$F:$F,A21)-SUMIFS(Bogføring!$G:$G,Bogføring!$A:$A,\">=\"&T!$C$4,Bogføring!$A:$A,\"<=\"&T!$C$5,Bogføring!$F:$F,A21)","v":0},null,null,null,null,1190,null,"Diverse Indtægter"]
[1230,"Færdige Tinsoldater",{"$f":"SUMIFS(Bogføring!$H:$H,Bogføring!$A:$A,\">=\"&T!$C$4,Bogføring!$A:$A,\"<=\"&T!$C$5,Bogføring!$F:$F,A22)-SUMIFS(Bogføring!$G:$G,Bogføring!$A:$A,\">=\"&T!$C$4,Bogføring!$A:$A,\"<=\"&T!$C$5,Bogføring!$F:$F,A22)","v":0},null,null,null,null,1200,null,"Kiosksalg"]
[1240,"Landkort",{"$f":"SUMIFS(Bogføring!$H:$H,Bogføring!$A:$A,\">=\"&T!$C$4,Bogføring!$A:$A,\"<=\"&T!$C$5,Bogføring!$F:$F,A23)-SUMIFS(Bogføring!$G:$G,Bogføring!$A:$A,\">=\"&T!$C$4,Bogføring!$A:$A,\"<=\"&T!$C$5,Bogføring!$F:$F,A23)","v":0},null,null,null,null,1210,null,"Bælter"]
[1250,"Oplukker",{"$f":"SUMIFS(Bogføring!$H:$H,Bogføring!$A:$A,\">=\"&T!$C$4,Bogføring!$A:$A,\"<=\"&T!$C$5,Bogføring!$F:$F,A24)-SUMIFS(Bogføring!$G:$G,Bogføring!$A:$A,\">=\"&T!$C$4,Bogføring!$A:$A,\"<=\"&T!$C$5,Bogføring!$F:$F,A24)","v":0},null,null,null,null,1220,null,"Bogsalg"]
[1260,"Køleskabsmagneter",{"$f":"SUMIFS(Bogføring!$H:$H,Bogføring!$A:$A,\">=\"&T!$C$4,Bogføring!$A:$A,\"<=\"&T!$C$5,Bogføring!$F:$F,A25)-SUMIFS(Bogføring!$G:$G,Bogføring!$A:$A,\">=\"&T!$C$4,Bogføring!$A:$A,\"<=\"&T!$C$5,Bogføring!$F:$F,A25)","v":0},null,null,null,null,1230,null,"Færdige tinsoldater"]
[1270,"Postkort 3 stk.",{"$f":"SUMIFS(Bogføring!$H:$H,Bogføring!$A:$A,\">=\"&T!$C$4,Bogføring!$A:$A,\"<=\"&T!$C$5,Bogføring!$F:$F,A26)-SUMIFS(Bogføring!$G:$G,Bogføring!$A:$A,\">=\"&T!$C$4,Bogføring!$A:$A,\"<=\"&T!$C$5,Bogføring!$F:$F,A26)","v":0},null,null,null,null,1240,null,"Landkort og Plakater"]
[1280,"Postkort",{"$f":"SUMIFS(Bogføring!$H:$H,Bogføring!$A:$A,\">=\"&T!$C$4,Bogføring!$A:$A,\"<=\"&T!$C$5,Bogføring!$F:$F,A27)-SUMIFS(Bogføring!$G:$G,Bogføring!$A:$A,\">=\"&T!$C$4,Bogføring!$A:$A,\"<=\"&T!$C$5,Bogføring!$F:$F,A27)","v":0},null,null,null,null,1250,null,"Oplukker"]
[1290,"Sodavand",{"$f":"SUMIFS(Bogføring!$H:$H,Bogføring!$A:$A,\">=\"&T!$C$4,Bogføring!$A:$A,\"<=\"&T!$C$5,Bogføring!$F:$F,A28)-SUMIFS(Bogføring!$G:$G,Bogføring!$A:$A,\">=\"&T!$C$4,Bogføring!$A:$A,\"<=\"&T!$C$5,Bogføring!$F:$F,A28)","v":0},null,null,null,null,1260,null,"Køleskabsmagneter"]
[null,null,null,null,null,null,null,1270,null,"Postkort 3 stk."]
[null,null,null,null,null,null,null,1280,null,"Postkort 3 stk."]
[null,null,null,null,null,null,null,1290,null,"Sodavand"]
[1300,"Kage",{"$f":"SUMIFS(Bogføring!$H:$H,Bogføring!$A:$A,\">=\"&T!$C$4,Bogføring!$A:$A,\"<=\"&T!$C$5,Bogføring!$F:$F,A32)-SUMIFS(Bogføring!$G:$G,Bogføring!$A:$A,\">=\"&T!$C$4,Bogføring!$A:$A,\"<=\"&T!$C$5,Bogføring!$F:$F,A32)","v":0},null,null,null,{"$f":"SUM(C2:C18)","v":129864.45999999999},1300,null,"Kage"]
[2000,"Bankgebyr",{"$f":"SUMIFS(Bogføring!$G:$G,Bogføring!$A:$A,\">=\"&T!$C$4,Bogføring!$A:$A,\"<=\"&T!$C$5,Bogføring!$F:$F,A33)-SUMIFS(Bogføring!$H:$H,Bogføring!$A:$A,\">=\"&T!$C$4,Bogføring!$A:$A,\"<=\"&T!$C$5,Bogføring!$F:$F,A33)","v":109.5},null,null,null,null,2000]
[2005,"Gebyr Izettle",{"$f":"SUMIFS(Bogføring!$G:$G,Bogføring!$A:$A,\">=\"&T!$C$4,Bogføring!$A:$A,\"<=\"&T!$C$5,Bogføring!$F:$F,A34)-SUMIFS(Bogføring!$H:$H,Bogføring!$A:$A,\">=\"&T!$C$4,Bogføring!$A:$A,\"<=\"&T!$C$5,Bogføring!$F:$F,A34)","v":23.99},null,null,null,null,2010]
[2010,"Danløn",{"$f":"SUMIFS(Bogføring!$G:$G,Bogføring!$A:$A,\">=\"&T!$C$4,Bogføring!$A:$A,\"<=\"&T!$C$5,Bogføring!$F:$F,A35)-SUMIFS(Bogføring!$H:$H,Bogføring!$A:$A,\">=\"&T!$C$4,Bogføring!$A:$A,\"<=\"&T!$C$5,Bogføring!$F:$F,A35)","v":27.5},null,null,null,null,2020]
[2015,"Advokat",{"$f":"SUMIFS(Bogføring!$G:$G,Bogføring!$A:$A,\">=\"&T!$C$4,Bogføring!$A:$A,\"<=\"&T!$C$5,Bogføring!$F:$F,A36)-SUMIFS(Bogføring!$H:$H,Bogføring!$A:$A,\">=\"&T!$C$4,Bogføring!$A:$A,\"<=\"&T!$C$5,Bogføring!$F:$F,A36)","v":0},null,null,null,null,2030]
[2020,"Revision",{"$f":"SUMIFS(Bogføring!$G:$G,Bogføring!$A:$A,\">=\"&T!$C$4,Bogføring!$A:$A,\"<=\"&T!$C$5,Bogføring!$F:$F,A37)-SUMIFS(Bogføring!$H:$H,Bogføring!$A:$A,\">=\"&T!$C$4,Bogføring!$A:$A,\"<=\"&T!$C$5,Bogføring!$F:$F,A37)","v":0},null,null,null,null,2035,null,"Advokat"]
[2025,"Regnskabsservice",{"$f":"SUMIFS(Bogføring!$G:$G,Bogføring!$A:$A,\">=\"&T!$C$4,Bogføring!$A:$A,\"<=\"&T!$C$5,Bogføring!$F:$F,A38)-SUMIFS(Bogføring!$H:$H,Bogføring!$A:$A,\">=\"&T!$C$4,Bogføring!$A:$A,\"<=\"&T!$C$5,Bogføring!$F:$F,A38)","v":490.63},null,null,null,null,2040]
[2030,"Bygnings vedligehold",{"$f":"SUMIFS(Bogføring!$G:$G,Bogføring!$A:$A,\">=\"&T!$C$4,Bogføring!$A:$A,\"<=\"&T!$C$5,Bogføring!$F:$F,A39)-SUMIFS(Bogføring!$H:$H,Bogføring!$A:$A,\">=\"&T!$C$4,Bogføring!$A:$A,\"<=\"&T!$C$5,Bogføring!$F:$F,A39)","v":329.7},null,null,null,null,2050]
[2035,"Grønne områder",{"$f":"SUMIFS(Bogføring!$G:$G,Bogføring!$A:$A,\">=\"&T!$C$4,Bogføring!$A:$A,\"<=\"&T!$C$5,Bogføring!$F:$F,A40)-SUMIFS(Bogføring!$H:$H,Bogføring!$A:$A,\">=\"&T!$C$4,Bogføring!$A:$A,\"<=\"&T!$C$5,Bogføring!$F:$F,A40)","v":713.64},null,null,null,null,2060]
[2037,"Rengørringsartikler",{"$f":"SUMIFS(Bogføring!$G:$G,Bogføring!$A:$A,\">=\"&T!$C$4,Bogføring!$A:$A,\"<=\"&T!$C$5,Bogføring!$F:$F,A41)-SUMIFS(Bogføring!$H:$H,Bogføring!$A:$A,\">=\"&T!$C$4,Bogføring!$A:$A,\"<=\"&T!$C$5,Bogføring!$F:$F,A41)","v":0},null,null,null,null,2070]
[2040,"El, Vand og Varme",{"$f":"SUMIFS(Bogføring!$G:$G,Bogføring!$A:$A,\">=\"&T!$C$4,Bogføring!$A:$A,\"<=\"&T!$C$5,Bogføring!$F:$F,A42)-SUMIFS(Bogføring!$H:$H,Bogføring!$A:$A,\">=\"&T!$C$4,Bogføring!$A:$A,\"<=\"&T!$C$5,Bogføring!$F:$F,A42)","v":27955.019999999997},null,null,null,null,null,null,"Microsoft"]
[2050,"Deltagelse i GF i Andre Foren.",{"$f":"SUMIFS(Bogføring!$G:$G,Bogføring!$A:$A,\">=\"&T!$C$4,Bogføring!$A:$A,\"<=\"&T!$C$5,Bogføring!$F:$F,A43)-SUMIFS(Bogføring!$H:$H,Bogføring!$A:$A,\">=\"&T!$C$4,Bogføring!$A:$A,\"<=\"&T!$C$5,Bogføring!$F:$F,A43)","v":0},null,null,null,null,2080]
[2055,"Indkøb af øl + vand",{"$f":"SUMIFS(Bogføring!$G:$G,Bogføring!$A:$A,\">=\"&T!$C$4,Bogføring!$A:$A,\"<=\"&T!$C$5,Bogføring!$F:$F,A44)-SUMIFS(Bogføring!$H:$H,Bogføring!$A:$A,\">=\"&T!$C$4,Bogføring!$A:$A,\"<=\"&T!$C$5,Bogføring!$F:$F,A44)","v":0},null,null,null,null,2090]
[2060,"Internet, mobiltelefon, Forsik.",{"$f":"SUMIFS(Bogføring!$G:$G,Bogføring!$A:$A,\">=\"&T!$C$4,Bogføring!$A:$A,\"<=\"&T!$C$5,Bogføring!$F:$F,A45)-SUMIFS(Bogføring!$H:$H,Bogføring!$A:$A,\">=\"&T!$C$4,Bogføring!$A:$A,\"<=\"&T!$C$5,Bogføring!$F:$F,A45)","v":2230.96},null,null,null,null,2100,null,"havemaskiner"]
[2065,"Udstilling",{"$f":"SUMIFS(Bogføring!$G:$G,Bogføring!$A:$A,\">=\"&T!$C$4,Bogføring!$A:$A,\"<=\"&T!$C$5,Bogføring!$F:$F,A46)-SUMIFS(Bogføring!$H:$H,Bogføring!$A:$A,\">=\"&T!$C$4,Bogføring!$A:$A,\"<=\"&T!$C$5,Bogføring!$F:$F,A46)","v":11386.63},null,null,null,null,2110]
[2070,"Tin og sortkrudt",{"$f":"SUMIFS(Bogføring!$G:$G,Bogføring!$A:$A,\">=\"&T!$C$4,Bogføring!$A:$A,\"<=\"&T!$C$5,Bogføring!$F:$F,A47)-SUMIFS(Bogføring!$H:$H,Bogføring!$A:$A,\">=\"&T!$C$4,Bogføring!$A:$A,\"<=\"&T!$C$5,Bogføring!$F:$F,A47)","v":0}]
[2075,"Gaver",{"$f":"SUMIFS(Bogføring!$G:$G,Bogføring!$A:$A,\">=\"&T!$C$4,Bogføring!$A:$A,\"<=\"&T!$C$5,Bogføring!$F:$F,A48)-SUMIFS(Bogføring!$H:$H,Bogføring!$A:$A,\">=\"&T!$C$4,Bogføring!$A:$A,\"<=\"&T!$C$5,Bogføring!$F:$F,A48)","v":170},null,null,null,null,2120]
[2080,"Indkøb af bøger",{"$f":"SUMIFS(Bogføring!$G:$G,Bogføring!$A:$A,\">=\"&T!$C$4,Bogføring!$A:$A,\"<=\"&T!$C$5,Bogføring!$F:$F,A49)-SUMIFS(Bogføring!$H:$H,Bogføring!$A:$A,\">=\"&T!$C$4,Bogføring!$A:$A,\"<=\"&T!$C$5,Bogføring!$F:$F,A49)","v":1200},null,null,null,null,2130]
[2090,"Kontingent til andre Foreninger",{"$f":"SUMIFS(Bogføring!$G:$G,Bogføring!$A:$A,\">=\"&T!$C$4,Bogføring!$A:$A,\"<=\"&T!$C$5,Bogføring!$F:$F,A50)-SUMIFS(Bogføring!$H:$H,Bogføring!$A:$A,\">=\"&T!$C$4,Bogføring!$A:$A,\"<=\"&T!$C$5,Bogføring!$F:$F,A50)","v":100},null,null,null,null,2140]
[2100,"Forplejning til møder/Rejser",{"$f":"SUMIFS(Bogføring!$G:$G,Bogføring!$A:$A,\">=\"&T!$C$4,Bogføring!$A:$A,\"<=\"&T!$C$5,Bogføring!$F:$F,A51)-SUMIFS(Bogføring!$H:$H,Bogføring!$A:$A,\">=\"&T!$C$4,Bogføring!$A:$A,\"<=\"&T!$C$5,Bogføring!$F:$F,A51)","v":1405.25},null,null,null,null,2150]
[2110,"Kontorhold - Porto - IT",{"$f":"SUMIFS(Bogføring!$G:$G,Bogføring!$A:$A,\">=\"&T!$C$4,Bogføring!$A:$A,\"<=\"&T!$C$5,Bogføring!$F:$F,A52)-SUMIFS(Bogføring!$H:$H,Bogføring!$A:$A,\">=\"&T!$C$4,Bogføring!$A:$A,\"<=\"&T!$C$5,Bogføring!$F:$F,A52)","v":1483.4},null,null,null,null,2160]
[2120,"Hjemmeside",{"$f":"SUMIFS(Bogføring!$G:$G,Bogføring!$A:$A,\">=\"&T!$C$4,Bogføring!$A:$A,\"<=\"&T!$C$5,Bogføring!$F:$F,A53)-SUMIFS(Bogføring!$H:$H,Bogføring!$A:$A,\">=\"&T!$C$4,Bogføring!$A:$A,\"<=\"&T!$C$5,Bogføring!$F:$F,A53)","v":0},null,null,null,null,2170]
[2130,"Annoncer",{"$f":"SUMIFS(Bogføring!$G:$G,Bogføring!$A:$A,\">=\"&T!$C$4,Bogføring!$A:$A,\"<=\"&T!$C$5,Bogføring!$F:$F,A54)-SUMIFS(Bogføring!$H:$H,Bogføring!$A:$A,\">=\"&T!$C$4,Bogføring!$A:$A,\"<=\"&T!$C$5,Bogføring!$F:$F,A54)","v":2318.75},null,null,null,null,2180]
[2135,"Tryksager",{"$f":"SUMIFS(Bogføring!$G:$G,Bogføring!$A:$A,\">=\"&T!$C$4,Bogføring!$A:$A,\"<=\"&T!$C$5,Bogføring!$F:$F,A55)-SUMIFS(Bogføring!$H:$H,Bogføring!$A:$A,\">=\"&T!$C$4,Bogføring!$A:$A,\"<=\"&T!$C$5,Bogføring!$F:$F,A55)","v":0},null,null,null,null,2190]
[2140,"Kassedifferance",{"$f":"SUMIFS(Bogføring!$G:$G,Bogføring!$A:$A,\">=\"&T!$C$4,Bogføring!$A:$A,\"<=\"&T!$C$5,Bogføring!$F:$F,A56)-SUMIFS(Bogføring!$H:$H,Bogføring!$A:$A,\">=\"&T!$C$4,Bogføring!$A:$A,\"<=\"&T!$C$5,Bogføring!$F:$F,A56)","v":0},null,null,null,null,2200]
[2150,"Øreafrundning",{"$f":"SUMIFS(Bogføring!$G:$G,Bogføring!$A:$A,\">=\"&T!$C$4,Bogføring!$A:$A,\"<=\"&T!$C$5,Bogføring!$F:$F,A57)-SUMIFS(Bogføring!$H:$H,Bogføring!$A:$A,\">=\"&T!$C$4,Bogføring!$A:$A,\"<=\"&T!$C$5,Bogføring!$F:$F,A57)","v":0},null,null,null,null,2210]
[2160,"Rejser",{"$f":"SUMIFS(Bogføring!$G:$G,Bogføring!$A:$A,\">=\"&T!$C$4,Bogføring!$A:$A,\"<=\"&T!$C$5,Bogføring!$F:$F,A58)-SUMIFS(Bogføring!$H:$H,Bogføring!$A:$A,\">=\"&T!$C$4,Bogføring!$A:$A,\"<=\"&T!$C$5,Bogføring!$F:$F,A58)","v":0},null,null,null,null,2220]
[2165,"G4S tyverialarm",{"$f":"SUMIFS(Bogføring!$G:$G,Bogføring!$A:$A,\">=\"&T!$C$4,Bogføring!$A:$A,\"<=\"&T!$C$5,Bogføring!$F:$F,A59)-SUMIFS(Bogføring!$H:$H,Bogføring!$A:$A,\">=\"&T!$C$4,Bogføring!$A:$A,\"<=\"&T!$C$5,Bogføring!$F:$F,A59)","v":3785.94},null,null,null,null,2230]
[2166,"Forsikringer",{"$f":"SUMIFS(Bogføring!$G:$G,Bogføring!$A:$A,\">=\"&T!$C$4,Bogføring!$A:$A,\"<=\"&T!$C$5,Bogføring!$F:$F,A60)-SUMIFS(Bogføring!$H:$H,Bogføring!$A:$A,\">=\"&T!$C$4,Bogføring!$A:$A,\"<=\"&T!$C$5,Bogføring!$F:$F,A60)","v":7598.9},null,null,null,null,2240]
[2170,"Afholdelse af GF",{"$f":"SUMIFS(Bogføring!$G:$G,Bogføring!$A:$A,\">=\"&T!$C$4,Bogføring!$A:$A,\"<=\"&T!$C$5,Bogføring!$F:$F,A61)-SUMIFS(Bogføring!$H:$H,Bogføring!$A:$A,\">=\"&T!$C$4,Bogføring!$A:$A,\"<=\"&T!$C$5,Bogføring!$F:$F,A61)","v":306.10000000000002},null,null,null,null,2250]
[2180,"Bestyrelses møder",{"$f":"SUMIFS(Bogføring!$G:$G,Bogføring!$A:$A,\">=\"&T!$C$4,Bogføring!$A:$A,\"<=\"&T!$C$5,Bogføring!$F:$F,A62)-SUMIFS(Bogføring!$H:$H,Bogføring!$A:$A,\">=\"&T!$C$4,Bogføring!$A:$A,\"<=\"&T!$C$5,Bogføring!$F:$F,A62)","v":0},null,null,null,null,2260]
[2190,"Diverse Udgifter",{"$f":"SUMIFS(Bogføring!$G:$G,Bogføring!$A:$A,\">=\"&T!$C$4,Bogføring!$A:$A,\"<=\"&T!$C$5,Bogføring!$F:$F,A63)-SUMIFS(Bogføring!$H:$H,Bogføring!$A:$A,\">=\"&T!$C$4,Bogføring!$A:$A,\"<=\"&T!$C$5,Bogføring!$F:$F,A63)","v":0},null,null,null,null,2270]
[2195,"Arkitekt",{"$f":"SUMIFS(Bogføring!$G:$G,Bogføring!$A:$A,\">=\"&T!$C$4,Bogføring!$A:$A,\"<=\"&T!$C$5,Bogføring!$F:$F,A64)-SUMIFS(Bogføring!$H:$H,Bogføring!$A:$A,\">=\"&T!$C$4,Bogføring!$A:$A,\"<=\"&T!$C$5,Bogføring!$F:$F,A64)","v":2500},null,null,null,null,2280]
[2200,"Kontingenter overført til KVB",{"$f":"SUMIFS(Bogføring!$G:$G,Bogføring!$A:$A,\">=\"&T!$C$4,Bogføring!$A:$A,\"<=\"&T!$C$5,Bogføring!$F:$F,A65)-SUMIFS(Bogføring!$H:$H,Bogføring!$A:$A,\">=\"&T!$C$4,Bogføring!$A:$A,\"<=\"&T!$C$5,Bogføring!$F:$F,A65)","v":0},null,null,null,null,2290]
[3100,"Lønomkostninger",{"$f":"SUMIFS(Bogføring!$G:$G,Bogføring!$A:$A,\">=\"&T!$C$4,Bogføring!$A:$A,\"<=\"&T!$C$5,Bogføring!$F:$F,A66)-SUMIFS(Bogføring!$H:$H,Bogføring!$A:$A,\">=\"&T!$C$4,Bogføring!$A:$A,\"<=\"&T!$C$5,Bogføring!$F:$F,A66)","v":0},null,null,null,null,2295,null,"xxxxxxx"]
[3110,"Lønninger incl ATP -AM",{"$f":"SUMIFS(Bogføring!$G:$G,Bogføring!$A:$A,\">=\"&T!$C$4,Bogføring!$A:$A,\"<=\"&T!$C$5,Bogføring!$F:$F,A67)-SUMIFS(Bogføring!$H:$H,Bogføring!$A:$A,\">=\"&T!$C$4,Bogføring!$A:$A,\"<=\"&T!$C$5,Bogføring!$F:$F,A67)","v":40800},null,null,null,null,2300]
[3120,"ATP",{"$f":"SUMIFS(Bogføring!$G:$G,Bogføring!$A:$A,\">=\"&T!$C$4,Bogføring!$A:$A,\"<=\"&T!$C$5,Bogføring!$F:$F,A68)-SUMIFS(Bogføring!$H:$H,Bogføring!$A:$A,\">=\"&T!$C$4,Bogføring!$A:$A,\"<=\"&T!$C$5,Bogføring!$F:$F,A68)","v":820.3},null,null,null,null,2310]
[3125,"Samlet betaling",{"$f":"SUMIFS(Bogføring!$G:$G,Bogføring!$A:$A,\">=\"&T!$C$4,Bogføring!$A:$A,\"<=\"&T!$C$5,Bogføring!$F:$F,A69)-SUMIFS(Bogføring!$H:$H,Bogføring!$A:$A,\">=\"&T!$C$4,Bogføring!$A:$A,\"<=\"&T!$C$5,Bogføring!$F:$F,A69)","v":492.92},null,null,null,null,2320]
[3130,"A-skat & Am-bidrag",{"$f":"SUMIFS(Bogføring!$G:$G,Bogføring!$A:$A,\">=\"&T!$C$4,Bogføring!$A:$A,\"<=\"&T!$C$5,Bogføring!$F:$F,A70)-SUMIFS(Bogføring!$H:$H,Bogføring!$A:$A,\">=\"&T!$C$4,Bogføring!$A:$A,\"<=\"&T!$C$5,Bogføring!$F:$F,A70)","v":3664},null,null,null,null,2330]
[3135,"Gl. Skat og Gebyr",{"$f":"SUMIFS(Bogføring!$G:$G,Bogføring!$A:$A,\">=\"&T!$C$4,Bogføring!$A:$A,\"<=\"&T!$C$5,Bogføring!$F:$F,A71)-SUMIFS(Bogføring!$H:$H,Bogføring!$A:$A,\">=\"&T!$C$4,Bogføring!$A:$A,\"<=\"&T!$C$5,Bogføring!$F:$F,A71)","v":0},null,null,null,null,2340]
[3140,"Lønsum",{"$f":"SUMIFS(Bogføring!$G:$G,Bogføring!$A:$A,\">=\"&T!$C$4,Bogføring!$A:$A,\"<=\"&T!$C$5,Bogføring!$F:$F,A72)-SUMIFS(Bogføring!$H:$H,Bogføring!$A:$A,\">=\"&T!$C$4,Bogføring!$A:$A,\"<=\"&T!$C$5,Bogføring!$F:$F,A72)","v":0},null,null,null,null,3000]
[3150,"Indefrosne feriepenge",{"$f":"SUMIFS(Bogføring!$G:$G,Bogføring!$A:$A,\">=\"&T!$C$4,Bogføring!$A:$A,\"<=\"&T!$C$5,Bogføring!$F:$F,A73)-SUMIFS(Bogføring!$H:$H,Bogføring!$A:$A,\">=\"&T!$C$4,Bogføring!$A:$A,\"<=\"&T!$C$5,Bogføring!$F:$F,A73)","v":922.26},null,null,null,null,3010]
[null,null,{"$f":"SUMIFS(Bogføring!$G:$G,Bogføring!$A:$A,\">=\"&T!$C$4,Bogføring!$A:$A,\"<=\"&T!$C$5,Bogføring!$F:$F,A74)-SUMIFS(Bogføring!$H:$H,Bogføring!$A:$A,\">=\"&T!$C$4,Bogføring!$A:$A,\"<=\"&T!$C$5,Bogføring!$F:$F,A74)","v":0},null,null,null,{"$f":"SUM(C33:C72)","v":109913.13},3020]
[null,null,null,null,null,null,{"$f":"G32-G74","v":19951.329999999987}]
[12310,"Bank konto",{"$f":"SUMIFS(Bogføring!$G:$G,Bogføring!$A:$A,\">=\"&T!$C$4,Bogføring!$A:$A,\"<=\"&T!$C$5,Bogføring!$F:$F,A76)-SUMIFS(Bogføring!$H:$H,Bogføring!$A:$A,\">=\"&T!$C$4,Bogføring!$A:$A,\"<=\"&T!$C$5,Bogføring!$F:$F,A76)","v":21291.5},null,null,null,null,3030]
[12320,"Kasse",{"$f":"SUMIFS(Bogføring!$G:$G,Bogføring!$A:$A,\">=\"&T!$C$4,Bogføring!$A:$A,\"<=\"&T!$C$5,Bogføring!$F:$F,A77)-SUMIFS(Bogføring!$H:$H,Bogføring!$A:$A,\">=\"&T!$C$4,Bogføring!$A:$A,\"<=\"&T!$C$5,Bogføring!$F:$F,A77)","v":4736},null,null,null,null,3040]
[12330,"Egenkapital",{"$f":"SUMIFS(Bogføring!$H:$H,Bogføring!$A:$A,\">=\"&T!$C$4,Bogføring!$A:$A,\"<=\"&T!$C$5,Bogføring!$F:$F,A78)-SUMIFS(Bogføring!$G:$G,Bogføring!$A:$A,\">=\"&T!$C$4,Bogføring!$A:$A,\"<=\"&T!$C$5,Bogføring!$F:$F,A78)+G75","v":21961.169999999987}]
[null,null,{"$f":"SUMIFS(Bogføring!$G:$G,Bogføring!$A:$A,\">=\"&T!$C$4,Bogføring!$A:$A,\"<=\"&T!$C$5,Bogføring!$F:$F,A79)-SUMIFS(Bogføring!$H:$H,Bogføring!$A:$A,\">=\"&T!$C$4,Bogføring!$A:$A,\"<=\"&T!$C$5,Bogføring!$F:$F,A79)","v":0}]
[12360,"Skyldig A-skat",{"$f":"SUMIFS(Bogføring!$H:$H,Bogføring!$A:$A,\">=\"&T!$C$4,Bogføring!$A:$A,\"<=\"&T!$C$5,Bogføring!$F:$F,A80)-SUMIFS(Bogføring!$G:$G,Bogføring!$A:$A,\">=\"&T!$C$4,Bogføring!$A:$A,\"<=\"&T!$C$5,Bogføring!$F:$F,A80)+F73","v":4219}]
[12361,"Skyldig AM ",{"$f":"SUMIFS(Bogføring!$H:$H,Bogføring!$A:$A,\">=\"&T!$C$4,Bogføring!$A:$A,\"<=\"&T!$C$5,Bogføring!$F:$F,A81)-SUMIFS(Bogføring!$G:$G,Bogføring!$A:$A,\">=\"&T!$C$4,Bogføring!$A:$A,\"<=\"&T!$C$5,Bogføring!$F:$F,A81)+F74","v":797}]
[12362,"Skyldig ATP",{"$f":"SUMIFS(Bogføring!$H:$H,Bogføring!$A:$A,\">=\"&T!$C$4,Bogføring!$A:$A,\"<=\"&T!$C$5,Bogføring!$F:$F,A82)-SUMIFS(Bogføring!$G:$G,Bogføring!$A:$A,\">=\"&T!$C$4,Bogføring!$A:$A,\"<=\"&T!$C$5,Bogføring!$F:$F,A82)+F75","v":378.60000000000008}]
[12364,"Skyldig feriepenge",{"$f":"SUMIFS(Bogføring!$H:$H,Bogføring!$A:$A,\">=\"&T!$C$4,Bogføring!$A:$A,\"<=\"&T!$C$5,Bogføring!$F:$F,A83)-SUMIFS(Bogføring!$G:$G,Bogføring!$A:$A,\">=\"&T!$C$4,Bogføring!$A:$A,\"<=\"&T!$C$5,Bogføring!$F:$F,A83)","v":800}]
[12365,"Forudbetalt omk.",{"$f":"SUMIFS(Bogføring!$H:$H,Bogføring!$A:$A,\">=\"&T!$C$4,Bogføring!$A:$A,\"<=\"&T!$C$5,Bogføring!$F:$F,A84)-SUMIFS(Bogføring!$G:$G,Bogføring!$A:$A,\">=\"&T!$C$4,Bogføring!$A:$A,\"<=\"&T!$C$5,Bogføring!$F:$F,A84)+F77","v":0}]
[12370,"Forudbetalt kontingent",{"$f":"SUMIFS(Bogføring!$H:$H,Bogføring!$A:$A,\">=\"&T!$C$4,Bogføring!$A:$A,\"<=\"&T!$C$5,Bogføring!$F:$F,A85)-SUMIFS(Bogføring!$G:$G,Bogføring!$A:$A,\">=\"&T!$C$4,Bogføring!$A:$A,\"<=\"&T!$C$5,Bogføring!$F:$F,A85)+F78","v":0}]
[12380,"Banklån",{"$f":"SUMIFS(Bogføring!$H:$H,Bogføring!$A:$A,\">=\"&T!$C$4,Bogføring!$A:$A,\"<=\"&T!$C$5,Bogføring!$F:$F,A86)-SUMIFS(Bogføring!$G:$G,Bogføring!$A:$A,\">=\"&T!$C$4,Bogføring!$A:$A,\"<=\"&T!$C$5,Bogføring!$F:$F,A86)+F79","v":0}]
[12390,"Andre Lån",{"$f":"SUMIFS(Bogføring!$H:$H,Bogføring!$A:$A,\">=\"&T!$C$4,Bogføring!$A:$A,\"<=\"&T!$C$5,Bogføring!$F:$F,A87)-SUMIFS(Bogføring!$G:$G,Bogføring!$A:$A,\">=\"&T!$C$4,Bogføring!$A:$A,\"<=\"&T!$C$5,Bogføring!$F:$F,A87)+F80","v":0}]
[12400,"Kreditorer samler konto",{"$f":"SUMIFS(Bogføring!$G:$G,Bogføring!$A:$A,\">=\"&T!$C$4,Bogføring!$A:$A,\"<=\"&T!$C$5,Bogføring!$F:$F,A88)-SUMIFS(Bogføring!$H:$H,Bogføring!$A:$A,\">=\"&T!$C$4,Bogføring!$A:$A,\"<=\"&T!$C$5,Bogføring!$F:$F,A88)","v":0},null,12370,12390]
[]
[12410,"Tilgodehavende Kontingenter",{"$f":"SUMIFS(Bogføring!$H:$H,Bogføring!$A:$A,\">=\"&T!$C$4,Bogføring!$A:$A,\"<=\"&T!$C$5,Bogføring!$F:$F,A90)-SUMIFS(Bogføring!$G:$G,Bogføring!$A:$A,\">=\"&T!$C$4,Bogføring!$A:$A,\"<=\"&T!$C$5,Bogføring!$F:$F,A90)+F86","v":0}]
[12420,null,{"$f":"SUMIFS(Bogføring!$H:$H,Bogføring!$A:$A,\">=\"&T!$C$4,Bogføring!$A:$A,\"<=\"&T!$C$5,Bogføring!$F:$F,A91)-SUMIFS(Bogføring!$G:$G,Bogføring!$A:$A,\">=\"&T!$C$4,Bogføring!$A:$A,\"<=\"&T!$C$5,Bogføring!$F:$F,A91)+F87","v":0}]
[12430,"Tilgode PayPal",{"$f":"SUMIFS(Bogføring!$H:$H,Bogføring!$A:$A,\">=\"&T!$C$4,Bogføring!$A:$A,\"<=\"&T!$C$5,Bogføring!$F:$F,A92)-SUMIFS(Bogføring!$G:$G,Bogføring!$A:$A,\">=\"&T!$C$4,Bogføring!$A:$A,\"<=\"&T!$C$5,Bogføring!$F:$F,A92)","v":-1206.01}]
[12500,"Debitorer samler konto",{"$f":"SUM(C90:C91)","v":0},null,12410,12420]

{"sheet":"Regnskab GF","index":2,"n_rows":46,"n_cols":6,"rows_kept":46,"cut":false,"hidden":true,"merged":[[1,0,1,6],[35,0,35,6],[20,0,20,5]]}
[]
["REGNSKAB FOR 3. ORDINÆRE GENERALFORSAMLING 13.01.18. "]
[]
[null,null,null,"Indtægt","Udgift","Resultat"]
["41 Kuv. Gule ærter/Stroganof",null,null,6450,3772]
["41 øl",null,null,null,430]
["Kaffe, småkager",null,null,null,64]
["12 Morgenmad inkl. bestyrelse",null,null,470,410]
["Værelser (10 enheder)",null,null,1125,784.16]
["Duge, servietter m.m.",null,null,null,611]
["Salg af 79 øl",null,null,1580]
["Salg af 27 snaps",null,null,540]
["Salg af 8 vand",null,null,80]
["11 mærker",null,null,550]
[null,null,null,null,0]
[null,null,null,null,0]
[null,null,null,null,0]
["Gave til ",null,null,null,0]
["I alt",null,null,{"$f":"SUM(D5:D18)","v":10795},{"$f":"SUM(E5:E18)","v":6071.16},{"$f":"D19-E19","v":4723.84}]
[]
["Salget på denne generalforsamling har vist sig at passe perfekt - det stemmer på øren - og det er dejligt. Ved optælling af beholdning af øl og snaps, er der 30 øl og lidt snaps, til næste arrangement."]
[]
[]
[null,null,null,"Indtægt","Udgift","TOTAL"]
["Kontant fra festen indsat i bank",null,null,null,null,2750]
[]
["Salg af 11 klister/stofmærker",null,null,550]
["Salg af 79 øl og 27 snaps = 106",null,null,2120]
["Salg af 8 vand",null,null,80]
["I alt",null,null,{"$f":"SUM(D27:D29)","v":2750},null,2750]
["Overskud",null,null,null,null,{"$f":"F25-F30","v":0}]
[]
[]
[]
[]
["Der er overskud af snaps til næste Generalforsamling, samt 30 øl til brug ved et senere arrangement. Som det fremgår er der ingen udgift til øl, da disse er købt i okt 2017 og indgår i 2017 regnskabet, ligesom snaps, da der var overskud fra sidste generalforsamlingdet indhentet u/b."]
[]
[]
[]
[]
[]
[]
[]
[]
[]
["Jens P. Christoffersson - formand"]

{"sheet":"Medlemsliste","index":3,"n_rows":180,"n_cols":30,"rows_kept":180,"cut":false,"hidden":true,"merged":[[5,39,5,41],[7,39,7,41],[0,0,3,8],[3,9,4,9],[0,9,0,10],[1,9,1,10],[2,9,2,10],[3,39,3,41],[4,39,4,41],[0,12,2,12]]}
[{"$f":"\"Medlemsliste for \"&T!B9","v":"Medlemsliste for xxxxxxxxxxxxx"},null,null,null,null,null,null,null,null," Antal medlemmer : ",null,{"$f":"COUNT(A5:A189)","v":155},null,{"$f":"COUNT($A:$A)","v":155},null,{"$f":"COUNT($A:$A)","v":155},null,{"$f":"COUNT($A:$A)","v":155},null,{"$f":"COUNT($A:$A)","v":155}]
[null,null,null,null,null,null,null,null,null," Betalende medlemmer : ",null,{"$f":"COUNTIF(L6:L190,\">0\")+1","v":1},null,{"$f":"COUNTIF(M:M,\">0\")","v":0},null,{"$f":"COUNTIF(O:O,\">0\")","v":0},null,{"$f":"COUNTIF(Q:Q,\">0\")","v":0},null,{"$f":"COUNTIF(S:S,\">0\")","v":0}]
[null,null,null,null,null,null,null,null,null,"Rest : ",null,{"$f":"L1-L2-3","v":151},null,{"$f":"N1-N2","v":155},null,{"$f":"P1-P2","v":155},null,{"$f":"R1-R2","v":155},null,{"$f":"T1-T2","v":155}]
[null,null,null,null,null,null,null,null,null,"Medl.nr. :",null,{"$f":"DATE(L5,4,1)","v":"2020-04-01"},null,{"$f":"DATE(N5,4,1)","v":"2021-04-01"},null,"2022-04-01",null,"2023-04-01",null,"2024-04-01",null,"2025-04-01",null,"2026-04-01",null,"2027-04-01",null,"2028-04-01",null,"2029-04-01"]
["Medl.nr. :","NAVN","ADRESSE ","POSTNR","By","TELEFON","E-MAIL","Indmeldt","Bemærkning:",null,"Bet. Dato",2020,"Bet. Dato",2021,null,2022,null,2023,null,2024,null,2025,null,2026,null,2027,null,2028,null,2029]
[1,"Jens P. Christoffersson ","Højvangsparken 8 st. 1.",3700,"Rønne",40373460,"jp.stoffer.555@gmail.com",null,"Formand, Medlem af FU ",{"$f":"IF(A6=\"\",\"\",A6)","v":1},{"$f":"IF(L6=0,\"\",INDEX(Bogføring!$A:$A,MATCH(Tabel2[[#This Row],[Medl.nr. :]],Bogføring!$D:$D,0),0))","v":""},{"$f":"SUMIFS(Bogføring!H:H,Bogføring!E:E,\"=\"&$L$5,Bogføring!D:D,\"=\"&A6)","v":0},{"$f":"IF(N6=0,\"\",SUMIFS(Bogføring!$A:$A,Bogføring!$E:$E,\"=\"&$N$5,Bogføring!$D:$D,\"=\"&A6))","v":""},{"$f":"SUMIFS(Bogføring!H:H,Bogføring!E:E,\"=\"&$N$5,Bogføring!D:D,\"=\"&A6)","v":0},{"$f":"IF(P6=0,\"\",SUMIFS(Bogføring!$A:$A,Bogføring!$E:$E,\"=\"&$P$5,Bogføring!$D:$D,\"=\"&A6))","v":""},{"$f":"SUMIFS(Bogføring!$H:$H,Bogføring!$E:$E,\"=\"&$P$5,Bogføring!$D:$D,\"=\"&A6)","v":0},{"$f":"IF(R6=0,\"\",SUMIFS(Bogføring!$A:$A,Bogføring!$E:$E,\"=\"&$R$5,Bogføring!$D:$D,\"=\"&A6))","v":""},{"$f":"SUMIFS(Bogføring!$H:$H,Bogføring!$E:$E,\"=\"&$R$5,Bogføring!$D:$D,\"=\"&A6)","v":0},{"$f":"IF(T6=0,\"\",SUMIFS(Bogføring!$A:$A,Bogføring!$E:$E,\"=\"&$T$5,Bogføring!$D:$D,\"=\"&A6))","v":""},{"$f":"SUMIFS(Bogføring!$H:$H,Bogføring!$E:$E,\"=\"&$T$5,Bogføring!$D:$D,\"=\"&A6)","v":0},null,{"$f":"SUMIFS(Bogføring!$H:$H,Bogføring!$E:$E,\"=\"&$V$5,Bogføring!$D:$D,\"=\"&A6)","v":0},null,{"$f":"SUMIFS(Bogføring!$H:$H,Bogføring!$E:$E,\"=\"&$X$5,Bogføring!$D:$D,\"=\"&A6)","v":0},null,{"$f":"SUMIFS(Bogføring!$H:$H,Bogføring!$E:$E,\"=\"&$Z$5,Bogføring!$D:$D,\"=\"&A6)","v":0},null,{"$f":"SUMIFS(Bogføring!$H:$H,Bogføring!$E:$E,\"=\"&$AB$5,Bogføring!$D:$D,\"=\"&A6)","v":0},null,{"$f":"SUMIFS(Bogføring!$H:$H,Bogføring!$E:$E,\"=\"&$AD$5,Bogføring!$D:$D,\"=\"&A6)","v":0}]
[2,"Jens Chr. Skaarup","Hedningestræde 1",3700,"Rønne",21240945,"bjskaarup@gmail.com",null,"Næstformand, Medlem af FU",2,{"$f":"IF(L7=0,\"\",INDEX(Bogføring!$A:$A,MATCH(Tabel2[[#This Row],[Medl.nr. :]],Bogføring!$D:$D,0),0))","v":""},{"$f":"SUMIFS(Bogføring!H:H,Bogføring!E:E,\"=\"&$L$5,Bogføring!D:D,\"=\"&A7)","v":0},{"$f":"IF(N7=0,\"\",SUMIFS(Bogføring!A:A,Bogføring!E:E,\"=\"&$N$5,Bogføring!D:D,\"=\"&A7))","v":""},{"$f":"SUMIFS(Bogføring!H:H,Bogføring!E:E,\"=\"&$N$5,Bogføring!D:D,\"=\"&A7)","v":0},{"$f":"IF(N7=0,\"\",SUMIFS(Bogføring!$A:$A,Bogføring!$E:$E,\"=\"&$P$5,Bogføring!$D:$D,\"=\"&A7))","v":""},{"$f":"SUMIFS(Bogføring!$H:$H,Bogføring!$E:$E,\"=\"&$P$5,Bogføring!$D:$D,\"=\"&A7)","v":0}]
[3,"Jens Ole Ipsen Fassel","Smedegård, Kirkedalsvej 17, Rutsker",3700,"Rønne",56969798,"f@ssel.dk",null,"Bestyrelsesmedlem",3,{"$f":"IF(L8=0,\"\",INDEX(Bogføring!$A:$A,MATCH(Tabel2[[#This Row],[Medl.nr. :]],Bogføring!$D:$D,0),0))","v":""},{"$f":"SUMIFS(Bogføring!H:H,Bogføring!E:E,\"=\"&$L$5,Bogføring!D:D,\"=\"&A8)","v":0},{"$f":"IF(N8=0,\"\",SUMIFS(Bogføring!A:A,Bogføring!E:E,\"=\"&$N$5,Bogføring!D:D,\"=\"&A8))","v":""},{"$f":"SUMIFS(Bogføring!H:H,Bogføring!E:E,\"=\"&$N$5,Bogføring!D:D,\"=\"&A8)","v":0},{"$f":"IF(N8=0,\"\",SUMIFS(Bogføring!$A:$A,Bogføring!$E:$E,\"=\"&$P$5,Bogføring!$D:$D,\"=\"&A8))","v":""},{"$f":"SUMIFS(Bogføring!$H:$H,Bogføring!$E:$E,\"=\"&$P$5,Bogføring!$D:$D,\"=\"&A8)","v":0}]
[4,"Finn Kjerulff Hansen","Sigurdsgade 13",3700,"Rønne",30254320,"fkh.segen@gmail.com",null,"Sekretær, Medlem af FU",4,{"$f":"IF(L9=0,\"\",INDEX(Bogføring!$A:$A,MATCH(Tabel2[[#This Row],[Medl.nr. :]],Bogføring!$D:$D,0),0))","v":""},{"$f":"SUMIFS(Bogføring!H:H,Bogføring!E:E,\"=\"&$L$5,Bogføring!D:D,\"=\"&A9)","v":0},{"$f":"IF(N9=0,\"\",SUMIFS(Bogføring!A:A,Bogføring!E:E,\"=\"&$N$5,Bogføring!D:D,\"=\"&A9))","v":""},{"$f":"SUMIFS(Bogføring!H:H,Bogføring!E:E,\"=\"&$N$5,Bogføring!D:D,\"=\"&A9)","v":0},{"$f":"IF(N9=0,\"\",SUMIFS(Bogføring!$A:$A,Bogføring!$E:$E,\"=\"&$P$5,Bogføring!$D:$D,\"=\"&A9))","v":""},{"$f":"SUMIFS(Bogføring!$H:$H,Bogføring!$E:$E,\"=\"&$P$5,Bogføring!$D:$D,\"=\"&A9)","v":0}]
[5,"Stefan Erik Asp","Thorkildsvej 43, 2. th.",3700,"Rønne",23820033,"stefan_easp@hotmail.com",null,"Web&Marketing, Medlem af FU",5,{"$f":"IF(L10=0,\"\",INDEX(Bogføring!$A:$A,MATCH(Tabel2[[#This Row],[Medl.nr. :]],Bogføring!$D:$D,0),0))","v":""},{"$f":"SUMIFS(Bogføring!H:H,Bogføring!E:E,\"=\"&$L$5,Bogføring!D:D,\"=\"&A10)","v":0},{"$f":"IF(N10=0,\"\",SUMIFS(Bogføring!A:A,Bogføring!E:E,\"=\"&$N$5,Bogføring!D:D,\"=\"&A10))","v":""},{"$f":"SUMIFS(Bogføring!H:H,Bogføring!E:E,\"=\"&$N$5,Bogføring!D:D,\"=\"&A10)","v":0},{"$f":"IF(N10=0,\"\",SUMIFS(Bogføring!$A:$A,Bogføring!$E:$E,\"=\"&$P$5,Bogføring!$D:$D,\"=\"&A10))","v":""},{"$f":"SUMIFS(Bogføring!$H:$H,Bogføring!$E:$E,\"=\"&$P$5,Bogføring!$D:$D,\"=\"&A10)","v":0}]
[6,"Henrik Frost Rasmussen","Bøgeløkken 5",3700,"Rønne",21260931,"frost_rasmussen@mail.tele.dk",null,"Bestyrelsesmedlem",6,{"$f":"IF(L11=0,\"\",INDEX(Bogføring!$A:$A,MATCH(Tabel2[[#This Row],[Medl.nr. :]],Bogføring!$D:$D,0),0))","v":""},{"$f":"SUMIFS(Bogføring!H:H,Bogføring!E:E,\"=\"&$L$5,Bogføring!D:D,\"=\"&A11)","v":0},{"$f":"IF(N11=0,\"\",SUMIFS(Bogføring!A:A,Bogføring!E:E,\"=\"&$N$5,Bogføring!D:D,\"=\"&A11))","v":""},{"$f":"SUMIFS(Bogføring!H:H,Bogføring!E:E,\"=\"&$N$5,Bogføring!D:D,\"=\"&A11)","v":0},{"$f":"IF(N11=0,\"\",SUMIFS(Bogføring!$A:$A,Bogføring!$E:$E,\"=\"&$P$5,Bogføring!$D:$D,\"=\"&A11))","v":""},{"$f":"SUMIFS(Bogføring!$H:$H,Bogføring!$E:$E,\"=\"&$P$5,Bogføring!$D:$D,\"=\"&A11)","v":0}]
[7,"Henrik Vensild","Storegade 29",3700,"Rønne",21254190,"h.vensild@mail.dk",null,"Bestyrelsesmedlem",7,{"$f":"IF(L12=0,\"\",INDEX(Bogføring!$A:$A,MATCH(Tabel2[[#This Row],[Medl.nr. :]],Bogføring!$D:$D,0),0))","v":""},{"$f":"SUMIFS(Bogføring!H:H,Bogføring!E:E,\"=\"&$L$5,Bogføring!D:D,\"=\"&A12)","v":0},{"$f":"IF(N12=0,\"\",SUMIFS(Bogføring!A:A,Bogføring!E:E,\"=\"&$N$5,Bogføring!D:D,\"=\"&A12))","v":""},{"$f":"SUMIFS(Bogføring!H:H,Bogføring!E:E,\"=\"&$N$5,Bogføring!D:D,\"=\"&A12)","v":0},{"$f":"IF(N12=0,\"\",SUMIFS(Bogføring!$A:$A,Bogføring!$E:$E,\"=\"&$P$5,Bogføring!$D:$D,\"=\"&A12))","v":""},{"$f":"SUMIFS(Bogføring!$H:$H,Bogføring!$E:$E,\"=\"&$P$5,Bogføring!$D:$D,\"=\"&A12)","v":0}]
[8,"Jacob Bjerring-Hansen","Bh. Museum, Sct. Mortensgade 29",3700,"Rønne",25601164,"jbh@bornholmsmuseum.dk",null,"Udpeget bestyrelssmedlem",8,{"$f":"IF(L13=0,\"\",INDEX(Bogføring!$A:$A,MATCH(Tabel2[[#This Row],[Medl.nr. :]],Bogføring!$D:$D,0),0))","v":""},{"$f":"SUMIFS(Bogføring!H:H,Bogføring!E:E,\"=\"&$L$5,Bogføring!D:D,\"=\"&A13)","v":0},{"$f":"IF(N13=0,\"\",SUMIFS(Bogføring!A:A,Bogføring!E:E,\"=\"&$N$5,Bogføring!D:D,\"=\"&A13))","v":""},{"$f":"SUMIFS(Bogføring!H:H,Bogføring!E:E,\"=\"&$N$5,Bogføring!D:D,\"=\"&A13)","v":0},{"$f":"IF(N13=0,\"\",SUMIFS(Bogføring!$A:$A,Bogføring!$E:$E,\"=\"&$P$5,Bogføring!$D:$D,\"=\"&A13))","v":""},{"$f":"SUMIFS(Bogføring!$H:$H,Bogføring!$E:$E,\"=\"&$P$5,Bogføring!$D:$D,\"=\"&A13)","v":0}]
[9,"Torben Hedeman Petersen ","GSE, Almegårds Kaserne",3700,"Rønne",24654997,"ghr-3b-gse01@mil.dk",null,"Udpeget bestyrelsesmedlem",9,{"$f":"IF(L14=0,\"\",INDEX(Bogføring!$A:$A,MATCH(Tabel2[[#This Row],[Medl.nr. :]],Bogføring!$D:$D,0),0))","v":""},{"$f":"SUMIFS(Bogføring!H:H,Bogføring!E:E,\"=\"&$L$5,Bogføring!D:D,\"=\"&A14)","v":0},{"$f":"IF(N14=0,\"\",SUMIFS(Bogføring!A:A,Bogføring!E:E,\"=\"&$N$5,Bogføring!D:D,\"=\"&A14))","v":""},{"$f":"SUMIFS(Bogføring!H:H,Bogføring!E:E,\"=\"&$N$5,Bogføring!D:D,\"=\"&A14)","v":0},{"$f":"IF(N14=0,\"\",SUMIFS(Bogføring!$A:$A,Bogføring!$E:$E,\"=\"&$P$5,Bogføring!$D:$D,\"=\"&A14))","v":""},{"$f":"SUMIFS(Bogføring!$H:$H,Bogføring!$E:$E,\"=\"&$P$5,Bogføring!$D:$D,\"=\"&A14)","v":0}]
[10,"Poul E. T. Figa ","Møllebakken 21 A",3740,"Svaneke",51515550,"petfiga@gmail.com",null,"Udpeget bestyrelsesmedlem",10,{"$f":"IF(L15=0,\"\",INDEX(Bogføring!$A:$A,MATCH(Tabel2[[#This Row],[Medl.nr. :]],Bogføring!$D:$D,0),0))","v":""},{"$f":"SUMIFS(Bogføring!H:H,Bogføring!E:E,\"=\"&$L$5,Bogføring!D:D,\"=\"&A15)","v":0},{"$f":"IF(N15=0,\"\",SUMIFS(Bogføring!A:A,Bogføring!E:E,\"=\"&$N$5,Bogføring!D:D,\"=\"&A15))","v":""},{"$f":"SUMIFS(Bogføring!H:H,Bogføring!E:E,\"=\"&$N$5,Bogføring!D:D,\"=\"&A15)","v":0},{"$f":"IF(N15=0,\"\",SUMIFS(Bogføring!$A:$A,Bogføring!$E:$E,\"=\"&$P$5,Bogføring!$D:$D,\"=\"&A15))","v":""},{"$f":"SUMIFS(Bogføring!$H:$H,Bogføring!$E:$E,\"=\"&$P$5,Bogføring!$D:$D,\"=\"&A15)","v":0}]
[11,"Bjarne Hansen                                            ","Lyrsbyvej 31",3751,"Østermarie",40212694,"bjarne-hansen@outlook.dk",null,"Kasserer, Medlem af FU",11,{"$f":"IF(L16=0,\"\",INDEX(Bogføring!$A:$A,MATCH(Tabel2[[#This Row],[Medl.nr. :]],Bogføring!$D:$D,0),0))","v":""},{"$f":"SUMIFS(Bogføring!H:H,Bogføring!E:E,\"=\"&$L$5,Bogføring!D:D,\"=\"&A16)","v":0},{"$f":"IF(N16=0,\"\",SUMIFS(Bogføring!A:A,Bogføring!E:E,\"=\"&$N$5,Bogføring!D:D,\"=\"&A16))","v":""},{"$f":"SUMIFS(Bogføring!H:H,Bogføring!E:E,\"=\"&$N$5,Bogføring!D:D,\"=\"&A16)","v":0},{"$f":"IF(N16=0,\"\",SUMIFS(Bogføring!$A:$A,Bogføring!$E:$E,\"=\"&$P$5,Bogføring!$D:$D,\"=\"&A16))","v":""},{"$f":"SUMIFS(Bogføring!$H:$H,Bogføring!$E:$E,\"=\"&$P$5,Bogføring!$D:$D,\"=\"&A16)","v":0}]
[12,"Jakob Pii","Østerled 20",3700,"Rønne",null,"pii@mil.dk",null,"Bilagskontrollant",12,{"$f":"IF(L17=0,\"\",INDEX(Bogføring!$A:$A,MATCH(Tabel2[[#This Row],[Medl.nr. :]],Bogføring!$D:$D,0),0))","v":""},{"$f":"SUMIFS(Bogføring!H:H,Bogføring!E:E,\"=\"&$L$5,Bogføring!D:D,\"=\"&A17)","v":0},{"$f":"IF(N17=0,\"\",SUMIFS(Bogføring!A:A,Bogføring!E:E,\"=\"&$N$5,Bogføring!D:D,\"=\"&A17))","v":""},{"$f":"SUMIFS(Bogføring!H:H,Bogføring!E:E,\"=\"&$N$5,Bogføring!D:D,\"=\"&A17)","v":0},{"$f":"IF(N17=0,\"\",SUMIFS(Bogføring!$A:$A,Bogføring!$E:$E,\"=\"&$P$5,Bogføring!$D:$D,\"=\"&A17))","v":""},{"$f":"SUMIFS(Bogføring!$H:$H,Bogføring!$E:$E,\"=\"&$P$5,Bogføring!$D:$D,\"=\"&A17)","v":0}]
[13,"Kai Platz ","Sandgade 8",3700,"Rønne",null,"kaiplatz@mail.dk",null,"ÆRESMEDLEM - Bilagskontrollant",13,{"$f":"IF(L18=0,\"\",INDEX(Bogføring!$A:$A,MATCH(Tabel2[[#This Row],[Medl.nr. :]],Bogføring!$D:$D,0),0))","v":""},{"$f":"SUMIFS(Bogføring!H:H,Bogføring!E:E,\"=\"&$L$5,Bogføring!D:D,\"=\"&A18)","v":0},{"$f":"IF(N18=0,\"\",SUMIFS(Bogføring!A:A,Bogføring!E:E,\"=\"&$N$5,Bogføring!D:D,\"=\"&A18))","v":""},{"$f":"SUMIFS(Bogføring!H:H,Bogføring!E:E,\"=\"&$N$5,Bogføring!D:D,\"=\"&A18)","v":0},{"$f":"IF(N18=0,\"\",SUMIFS(Bogføring!$A:$A,Bogføring!$E:$E,\"=\"&$P$5,Bogføring!$D:$D,\"=\"&A18))","v":""},{"$f":"SUMIFS(Bogføring!$H:$H,Bogføring!$E:$E,\"=\"&$P$5,Bogføring!$D:$D,\"=\"&A18)","v":0}]
[14,"Maud og Tom West","Sølunden 4",3700,"Rønne",null,"sbfmw@mail.dk",null,"Maud, Bilagskontrollantsuppleant",14,{"$f":"IF(L19=0,\"\",INDEX(Bogføring!$A:$A,MATCH(Tabel2[[#This Row],[Medl.nr. :]],Bogføring!$D:$D,0),0))","v":""},{"$f":"SUMIFS(Bogføring!H:H,Bogføring!E:E,\"=\"&$L$5,Bogføring!D:D,\"=\"&A19)","v":0},{"$f":"IF(N19=0,\"\",SUMIFS(Bogføring!A:A,Bogføring!E:E,\"=\"&$N$5,Bogføring!D:D,\"=\"&A19))","v":""},{"$f":"SUMIFS(Bogføring!H:H,Bogføring!E:E,\"=\"&$N$5,Bogføring!D:D,\"=\"&A19)","v":0},{"$f":"IF(N19=0,\"\",SUMIFS(Bogføring!$A:$A,Bogføring!$E:$E,\"=\"&$P$5,Bogføring!$D:$D,\"=\"&A19))","v":""},{"$f":"SUMIFS(Bogføring!$H:$H,Bogføring!$E:$E,\"=\"&$P$5,Bogføring!$D:$D,\"=\"&A19)","v":0}]
[15,"Klaus Linnert ","Hedebovej 22, Knudsker",3700,"Rønne",51330033,"klaus@linnert.dk",null,"Museumsleder",15,{"$f":"IF(L20=0,\"\",INDEX(Bogføring!$A:$A,MATCH(Tabel2[[#This Row],[Medl.nr. :]],Bogføring!$D:$D,0),0))","v":""},{"$f":"SUMIFS(Bogføring!H:H,Bogføring!E:E,\"=\"&$L$5,Bogføring!D:D,\"=\"&A20)","v":0},{"$f":"IF(N20=0,\"\",SUMIFS(Bogføring!A:A,Bogføring!E:E,\"=\"&$N$5,Bogføring!D:D,\"=\"&A20))","v":""},{"$f":"SUMIFS(Bogføring!H:H,Bogføring!E:E,\"=\"&$N$5,Bogføring!D:D,\"=\"&A20)","v":0},{"$f":"IF(N20=0,\"\",SUMIFS(Bogføring!$A:$A,Bogføring!$E:$E,\"=\"&$P$5,Bogføring!$D:$D,\"=\"&A20))","v":""},{"$f":"SUMIFS(Bogføring!$H:$H,Bogføring!$E:$E,\"=\"&$P$5,Bogføring!$D:$D,\"=\"&A20)","v":0}]
[16,"Per A. Nielsen","Ingemannsvej 2, Listed",3740,"Svaneke",56496374,"signeogper@gmail.com",null,"ÆRESMEDLEM",16,{"$f":"IF(L21=0,\"\",INDEX(Bogføring!$A:$A,MATCH(Tabel2[[#This Row],[Medl.nr. :]],Bogføring!$D:$D,0),0))","v":""},{"$f":"SUMIFS(Bogføring!H:H,Bogføring!E:E,\"=\"&$L$5,Bogføring!D:D,\"=\"&A21)","v":0},{"$f":"IF(N21=0,\"\",SUMIFS(Bogføring!A:A,Bogføring!E:E,\"=\"&$N$5,Bogføring!D:D,\"=\"&A21))","v":""},{"$f":"SUMIFS(Bogføring!H:H,Bogføring!E:E,\"=\"&$N$5,Bogføring!D:D,\"=\"&A21)","v":0},{"$f":"IF(N21=0,\"\",SUMIFS(Bogføring!$A:$A,Bogføring!$E:$E,\"=\"&$P$5,Bogføring!$D:$D,\"=\"&A21))","v":""},{"$f":"SUMIFS(Bogføring!$H:$H,Bogføring!$E:$E,\"=\"&$P$5,Bogføring!$D:$D,\"=\"&A21)","v":0}]
[17,"Knud K. Pallesen","Weidekampsgade 29, 5.tv.",2300,"København S.",35391251,"kpallesen@gmail.com",null,null,17,{"$f":"IF(L22=0,\"\",INDEX(Bogføring!$A:$A,MATCH(Tabel2[[#This Row],[Medl.nr. :]],Bogføring!$D:$D,0),0))","v":""},{"$f":"SUMIFS(Bogføring!H:H,Bogføring!E:E,\"=\"&$L$5,Bogføring!D:D,\"=\"&A22)","v":0},{"$f":"IF(N22=0,\"\",SUMIFS(Bogføring!A:A,Bogføring!E:E,\"=\"&$N$5,Bogføring!D:D,\"=\"&A22))","v":""},{"$f":"SUMIFS(Bogføring!H:H,Bogføring!E:E,\"=\"&$N$5,Bogføring!D:D,\"=\"&A22)","v":0},{"$f":"IF(N22=0,\"\",SUMIFS(Bogføring!$A:$A,Bogføring!$E:$E,\"=\"&$P$5,Bogføring!$D:$D,\"=\"&A22))","v":""},{"$f":"SUMIFS(Bogføring!$H:$H,Bogføring!$E:$E,\"=\"&$P$5,Bogføring!$D:$D,\"=\"&A22)","v":0}]
[18,"Kristian Hofgaard","Kong Georgs Vej 54, I.tv.",2000,"Frederiksberg",null,"hofgaardkristian@gmail.com",null,null,18,{"$f":"IF(L23=0,\"\",INDEX(Bogføring!$A:$A,MATCH(Tabel2[[#This Row],[Medl.nr. :]],Bogføring!$D:$D,0),0))","v":""},{"$f":"SUMIFS(Bogføring!H:H,Bogføring!E:E,\"=\"&$L$5,Bogføring!D:D,\"=\"&A23)","v":0},{"$f":"IF(N23=0,\"\",SUMIFS(Bogføring!A:A,Bogføring!E:E,\"=\"&$N$5,Bogføring!D:D,\"=\"&A23))","v":""},{"$f":"SUMIFS(Bogføring!H:H,Bogføring!E:E,\"=\"&$N$5,Bogføring!D:D,\"=\"&A23)","v":0},{"$f":"IF(N23=0,\"\",SUMIFS(Bogføring!$A:$A,Bogføring!$E:$E,\"=\"&$P$5,Bogføring!$D:$D,\"=\"&A23))","v":""},{"$f":"SUMIFS(Bogføring!$H:$H,Bogføring!$E:$E,\"=\"&$P$5,Bogføring!$D:$D,\"=\"&A23)","v":0}]
[19,"Søren Bech Jensen","Østergade 46 b, ",3700,"Rønne",null,"sbjdansk@gmail.com",null,null,19,{"$f":"IF(L24=0,\"\",INDEX(Bogføring!$A:$A,MATCH(Tabel2[[#This Row],[Medl.nr. :]],Bogføring!$D:$D,0),0))","v":""},{"$f":"SUMIFS(Bogføring!H:H,Bogføring!E:E,\"=\"&$L$5,Bogføring!D:D,\"=\"&A24)","v":0},{"$f":"IF(N24=0,\"\",SUMIFS(Bogføring!A:A,Bogføring!E:E,\"=\"&$N$5,Bogføring!D:D,\"=\"&A24))","v":""},{"$f":"SUMIFS(Bogføring!H:H,Bogføring!E:E,\"=\"&$N$5,Bogføring!D:D,\"=\"&A24)","v":0},{"$f":"IF(N24=0,\"\",SUMIFS(Bogføring!$A:$A,Bogføring!$E:$E,\"=\"&$P$5,Bogføring!$D:$D,\"=\"&A24))","v":""},{"$f":"SUMIFS(Bogføring!$H:$H,Bogføring!$E:$E,\"=\"&$P$5,Bogføring!$D:$D,\"=\"&A24)","v":0}]
[20,"Peder Jon Andersen","Gartnerhaven 8",2800,"Kgs. Lyngby",null,"peajay@pc.dk",null,null,20,{"$f":"IF(L25=0,\"\",INDEX(Bogføring!$A:$A,MATCH(Tabel2[[#This Row],[Medl.nr. :]],Bogføring!$D:$D,0),0))","v":""},{"$f":"SUMIFS(Bogføring!H:H,Bogføring!E:E,\"=\"&$L$5,Bogføring!D:D,\"=\"&A25)","v":0},{"$f":"IF(N25=0,\"\",SUMIFS(Bogføring!A:A,Bogføring!E:E,\"=\"&$N$5,Bogføring!D:D,\"=\"&A25))","v":""},{"$f":"SUMIFS(Bogføring!H:H,Bogføring!E:E,\"=\"&$N$5,Bogføring!D:D,\"=\"&A25)","v":0},{"$f":"IF(N25=0,\"\",SUMIFS(Bogføring!$A:$A,Bogføring!$E:$E,\"=\"&$P$5,Bogføring!$D:$D,\"=\"&A25))","v":""},{"$f":"SUMIFS(Bogføring!$H:$H,Bogføring!$E:$E,\"=\"&$P$5,Bogføring!$D:$D,\"=\"&A25)","v":0}]
[21,"Kaj E. Boesen","Birkevej 20",3770,"Allinge",null,"kaje.boesen@gmail.com",null,"Frivillig",21,{"$f":"IF(L26=0,\"\",INDEX(Bogføring!$A:$A,MATCH(Tabel2[[#This Row],[Medl.nr. :]],Bogføring!$D:$D,0),0))","v":""},{"$f":"SUMIFS(Bogføring!H:H,Bogføring!E:E,\"=\"&$L$5,Bogføring!D:D,\"=\"&A26)","v":0},{"$f":"IF(N26=0,\"\",SUMIFS(Bogføring!A:A,Bogføring!E:E,\"=\"&$N$5,Bogføring!D:D,\"=\"&A26))","v":""},{"$f":"SUMIFS(Bogføring!H:H,Bogføring!E:E,\"=\"&$N$5,Bogføring!D:D,\"=\"&A26)","v":0},{"$f":"IF(N26=0,\"\",SUMIFS(Bogføring!$A:$A,Bogføring!$E:$E,\"=\"&$P$5,Bogføring!$D:$D,\"=\"&A26))","v":""},{"$f":"SUMIFS(Bogføring!$H:$H,Bogføring!$E:$E,\"=\"&$P$5,Bogføring!$D:$D,\"=\"&A26)","v":0}]
[22,"Jørn-Ole Lund","Borgmester Nielsensvej 84",3700,"Rønne",null,"jomlund@hotmail.com",null,"Pluggegårdsvej 25, Nyker",22,{"$f":"IF(L27=0,\"\",INDEX(Bogføring!$A:$A,MATCH(Tabel2[[#This Row],[Medl.nr. :]],Bogføring!$D:$D,0),0))","v":""},{"$f":"SUMIFS(Bogføring!H:H,Bogføring!E:E,\"=\"&$L$5,Bogføring!D:D,\"=\"&A27)","v":0},{"$f":"IF(N27=0,\"\",SUMIFS(Bogføring!A:A,Bogføring!E:E,\"=\"&$N$5,Bogføring!D:D,\"=\"&A27))","v":""},{"$f":"SUMIFS(Bogføring!H:H,Bogføring!E:E,\"=\"&$N$5,Bogføring!D:D,\"=\"&A27)","v":0},{"$f":"IF(N27=0,\"\",SUMIFS(Bogføring!$A:$A,Bogføring!$E:$E,\"=\"&$P$5,Bogføring!$D:$D,\"=\"&A27))","v":""},{"$f":"SUMIFS(Bogføring!$H:$H,Bogføring!$E:$E,\"=\"&$P$5,Bogføring!$D:$D,\"=\"&A27)","v":0}]
[23,"Henrik H. Poulsen","Kirkebyvej 46",3751,"Østermarie",null,"hhp@cabh.dk",null,null,23,{"$f":"IF(L28=0,\"\",INDEX(Bogføring!$A:$A,MATCH(Tabel2[[#This Row],[Medl.nr. :]],Bogføring!$D:$D,0),0))","v":""},{"$f":"SUMIFS(Bogføring!H:H,Bogføring!E:E,\"=\"&$L$5,Bogføring!D:D,\"=\"&A28)","v":0},{"$f":"IF(N28=0,\"\",SUMIFS(Bogføring!A:A,Bogføring!E:E,\"=\"&$N$5,Bogføring!D:D,\"=\"&A28))","v":""},{"$f":"SUMIFS(Bogføring!H:H,Bogføring!E:E,\"=\"&$N$5,Bogføring!D:D,\"=\"&A28)","v":0},{"$f":"IF(N28=0,\"\",SUMIFS(Bogføring!$A:$A,Bogføring!$E:$E,\"=\"&$P$5,Bogføring!$D:$D,\"=\"&A28))","v":""},{"$f":"SUMIFS(Bogføring!$H:$H,Bogføring!$E:$E,\"=\"&$P$5,Bogføring!$D:$D,\"=\"&A28)","v":0}]
[24,"Knud og Randi Veje","Teglgårdsvej 12",3700,"Rønne",null,"rkveje@pc.dk",null,null,24,{"$f":"IF(L29=0,\"\",INDEX(Bogføring!$A:$A,MATCH(Tabel2[[#This Row],[Medl.nr. :]],Bogføring!$D:$D,0),0))","v":""},{"$f":"SUMIFS(Bogføring!H:H,Bogføring!E:E,\"=\"&$L$5,Bogføring!D:D,\"=\"&A29)","v":0},{"$f":"IF(N29=0,\"\",SUMIFS(Bogføring!A:A,Bogføring!E:E,\"=\"&$N$5,Bogføring!D:D,\"=\"&A29))","v":""},{"$f":"SUMIFS(Bogføring!H:H,Bogføring!E:E,\"=\"&$N$5,Bogføring!D:D,\"=\"&A29)","v":0},{"$f":"IF(N29=0,\"\",SUMIFS(Bogføring!$A:$A,Bogføring!$E:$E,\"=\"&$P$5,Bogføring!$D:$D,\"=\"&A29))","v":""},{"$f":"SUMIFS(Bogføring!$H:$H,Bogføring!$E:$E,\"=\"&$P$5,Bogføring!$D:$D,\"=\"&A29)","v":0}]
[25,"John Bloch Andersen","Tornegård, Almegårdsvej 12",3700,"Rønne",21612882,"bloch44@hotmail.com",null,"Paradisvej 11, -10",25,{"$f":"IF(L30=0,\"\",INDEX(Bogføring!$A:$A,MATCH(Tabel2[[#This Row],[Medl.nr. :]],Bogføring!$D:$D,0),0))","v":""},{"$f":"SUMIFS(Bogføring!H:H,Bogføring!E:E,\"=\"&$L$5,Bogføring!D:D,\"=\"&A30)","v":0},{"$f":"IF(N30=0,\"\",SUMIFS(Bogføring!A:A,Bogføring!E:E,\"=\"&$N$5,Bogføring!D:D,\"=\"&A30))","v":""},{"$f":"SUMIFS(Bogføring!H:H,Bogføring!E:E,\"=\"&$N$5,Bogføring!D:D,\"=\"&A30)","v":0},{"$f":"IF(N30=0,\"\",SUMIFS(Bogføring!$A:$A,Bogføring!$E:$E,\"=\"&$P$5,Bogføring!$D:$D,\"=\"&A30))","v":""},{"$f":"SUMIFS(Bogføring!$H:$H,Bogføring!$E:$E,\"=\"&$P$5,Bogføring!$D:$D,\"=\"&A30)","v":0}]
[26,"Margrethe & Jørn Birk","Sdr. Landevej 47, Aaker",3720,"Åkirkeby",56974743,"aakervvs@os.dk",null,null,26,{"$f":"IF(L31=0,\"\",INDEX(Bogføring!$A:$A,MATCH(Tabel2[[#This Row],[Medl.nr. :]],Bogføring!$D:$D,0),0))","v":""},{"$f":"SUMIFS(Bogføring!H:H,Bogføring!E:E,\"=\"&$L$5,Bogføring!D:D,\"=\"&A31)","v":0},{"$f":"IF(N31=0,\"\",SUMIFS(Bogføring!A:A,Bogføring!E:E,\"=\"&$N$5,Bogføring!D:D,\"=\"&A31))","v":""},{"$f":"SUMIFS(Bogføring!H:H,Bogføring!E:E,\"=\"&$N$5,Bogføring!D:D,\"=\"&A31)","v":0},{"$f":"IF(N31=0,\"\",SUMIFS(Bogføring!$A:$A,Bogføring!$E:$E,\"=\"&$P$5,Bogføring!$D:$D,\"=\"&A31))","v":""},{"$f":"SUMIFS(Bogføring!$H:$H,Bogføring!$E:$E,\"=\"&$P$5,Bogføring!$D:$D,\"=\"&A31)","v":0}]
[27,"Helge Holst","Bramsnæslund 12 Ejby",4070,"Kirke Hylling",null,"helgeaholst@gmail.com",null,null,27,{"$f":"IF(L32=0,\"\",INDEX(Bogføring!$A:$A,MATCH(Tabel2[[#This Row],[Medl.nr. :]],Bogføring!$D:$D,0),0))","v":""},{"$f":"SUMIFS(Bogføring!H:H,Bogføring!E:E,\"=\"&$L$5,Bogføring!D:D,\"=\"&A32)","v":0},{"$f":"IF(N32=0,\"\",SUMIFS(Bogføring!A:A,Bogføring!E:E,\"=\"&$N$5,Bogføring!D:D,\"=\"&A32))","v":""},{"$f":"SUMIFS(Bogføring!H:H,Bogføring!E:E,\"=\"&$N$5,Bogføring!D:D,\"=\"&A32)","v":0},{"$f":"IF(N32=0,\"\",SUMIFS(Bogføring!$A:$A,Bogføring!$E:$E,\"=\"&$P$5,Bogføring!$D:$D,\"=\"&A32))","v":""},{"$f":"SUMIFS(Bogføring!$H:$H,Bogføring!$E:$E,\"=\"&$P$5,Bogføring!$D:$D,\"=\"&A32)","v":0}]
[28,"Lars T. Jensen","Poul Ankersvej 17",3700,"Rønne",null,"bltjacn@gmail.com",null,null,28,{"$f":"IF(L33=0,\"\",INDEX(Bogføring!$A:$A,MATCH(Tabel2[[#This Row],[Medl.nr. :]],Bogføring!$D:$D,0),0))","v":""},{"$f":"SUMIFS(Bogføring!H:H,Bogføring!E:E,\"=\"&$L$5,Bogføring!D:D,\"=\"&A33)","v":0},{"$f":"IF(N33=0,\"\",SUMIFS(Bogføring!A:A,Bogføring!E:E,\"=\"&$N$5,Bogføring!D:D,\"=\"&A33))","v":""},{"$f":"SUMIFS(Bogføring!H:H,Bogføring!E:E,\"=\"&$N$5,Bogføring!D:D,\"=\"&A33)","v":0},{"$f":"IF(N33=0,\"\",SUMIFS(Bogføring!$A:$A,Bogføring!$E:$E,\"=\"&$P$5,Bogføring!$D:$D,\"=\"&A33))","v":""},{"$f":"SUMIFS(Bogføring!$H:$H,Bogføring!$E:$E,\"=\"&$P$5,Bogføring!$D:$D,\"=\"&A33)","v":0}]
[30,"Grethe og Finn J.H. Carlsen","Brøndshøj 7",3700,"Rønne",56950212,"finnc@post12.tele.dk",null,null,30,{"$f":"IF(L34=0,\"\",INDEX(Bogføring!$A:$A,MATCH(Tabel2[[#This Row],[Medl.nr. :]],Bogføring!$D:$D,0),0))","v":""},{"$f":"SUMIFS(Bogføring!H:H,Bogføring!E:E,\"=\"&$L$5,Bogføring!D:D,\"=\"&A34)","v":0},{"$f":"IF(N34=0,\"\",SUMIFS(Bogføring!A:A,Bogføring!E:E,\"=\"&$N$5,Bogføring!D:D,\"=\"&A34))","v":""},{"$f":"SUMIFS(Bogføring!H:H,Bogføring!E:E,\"=\"&$N$5,Bogføring!D:D,\"=\"&A34)","v":0},{"$f":"IF(N34=0,\"\",SUMIFS(Bogføring!$A:$A,Bogføring!$E:$E,\"=\"&$P$5,Bogføring!$D:$D,\"=\"&A34))","v":""},{"$f":"SUMIFS(Bogføring!$H:$H,Bogføring!$E:$E,\"=\"&$P$5,Bogføring!$D:$D,\"=\"&A34)","v":0}]
[31,"Ivar Jørgensen","Havnebryggen 1",3740,"Svaneke",null,"havnebryggen@gmail.com",null,null,31,{"$f":"IF(L35=0,\"\",INDEX(Bogføring!$A:$A,MATCH(Tabel2[[#This Row],[Medl.nr. :]],Bogføring!$D:$D,0),0))","v":""},{"$f":"SUMIFS(Bogføring!H:H,Bogføring!E:E,\"=\"&$L$5,Bogføring!D:D,\"=\"&A35)","v":0},{"$f":"IF(N35=0,\"\",SUMIFS(Bogføring!A:A,Bogføring!E:E,\"=\"&$N$5,Bogføring!D:D,\"=\"&A35))","v":""},{"$f":"SUMIFS(Bogføring!H:H,Bogføring!E:E,\"=\"&$N$5,Bogføring!D:D,\"=\"&A35)","v":0},{"$f":"IF(N35=0,\"\",SUMIFS(Bogføring!$A:$A,Bogføring!$E:$E,\"=\"&$P$5,Bogføring!$D:$D,\"=\"&A35))","v":""},{"$f":"SUMIFS(Bogføring!$H:$H,Bogføring!$E:$E,\"=\"&$P$5,Bogføring!$D:$D,\"=\"&A35)","v":0}]
[32,"Carsten Gjessing","Kirkepladsen 6",3700,"Rønne",null,"oz4cg@post3.tele.dk",null,null,32,{"$f":"IF(L36=0,\"\",INDEX(Bogføring!$A:$A,MATCH(Tabel2[[#This Row],[Medl.nr. :]],Bogføring!$D:$D,0),0))","v":""},{"$f":"SUMIFS(Bogføring!H:H,Bogføring!E:E,\"=\"&$L$5,Bogføring!D:D,\"=\"&A36)","v":0},{"$f":"IF(N36=0,\"\",SUMIFS(Bogføring!A:A,Bogføring!E:E,\"=\"&$N$5,Bogføring!D:D,\"=\"&A36))","v":""},{"$f":"SUMIFS(Bogføring!H:H,Bogføring!E:E,\"=\"&$N$5,Bogføring!D:D,\"=\"&A36)","v":0},{"$f":"IF(N36=0,\"\",SUMIFS(Bogføring!$A:$A,Bogføring!$E:$E,\"=\"&$P$5,Bogføring!$D:$D,\"=\"&A36))","v":""},{"$f":"SUMIFS(Bogføring!$H:$H,Bogføring!$E:$E,\"=\"&$P$5,Bogføring!$D:$D,\"=\"&A36)","v":0}]
[33,"Jan Kristiansen","Bækken 21",3700,"Rønne",null,"jandor51@youmail.dk",null,"Solbakkevej 4",33,{"$f":"IF(L37=0,\"\",INDEX(Bogføring!$A:$A,MATCH(Tabel2[[#This Row],[Medl.nr. :]],Bogføring!$D:$D,0),0))","v":""},{"$f":"SUMIFS(Bogføring!H:H,Bogføring!E:E,\"=\"&$L$5,Bogføring!D:D,\"=\"&A37)","v":0},{"$f":"IF(N37=0,\"\",SUMIFS(Bogføring!A:A,Bogføring!E:E,\"=\"&$N$5,Bogføring!D:D,\"=\"&A37))","v":""},{"$f":"SUMIFS(Bogføring!H:H,Bogføring!E:E,\"=\"&$N$5,Bogføring!D:D,\"=\"&A37)","v":0},{"$f":"IF(N37=0,\"\",SUMIFS(Bogføring!$A:$A,Bogføring!$E:$E,\"=\"&$P$5,Bogføring!$D:$D,\"=\"&A37))","v":""},{"$f":"SUMIFS(Bogføring!$H:$H,Bogføring!$E:$E,\"=\"&$P$5,Bogføring!$D:$D,\"=\"&A37)","v":0}]
[34,"Elin og Hans Jørgen Brandt","Præstegårdsvejen 7, Vestermarie",3700,"Rønne",null,"maresoe@hotmail.com",null,null,{"$f":"IF(A38=\"\",\"\",A38)","v":34},{"$f":"IF(L38=0,\"\",INDEX(Bogføring!$A:$A,MATCH(Tabel2[[#This Row],[Medl.nr. :]],Bogføring!$D:$D,0),0))","v":""},{"$f":"SUMIFS(Bogføring!H:H,Bogføring!E:E,\"=\"&$L$5,Bogføring!D:D,\"=\"&A38)","v":0},{"$f":"IF(N38=0,\"\",SUMIFS(Bogføring!A:A,Bogføring!E:E,\"=\"&$N$5,Bogføring!D:D,\"=\"&A38))","v":""},{"$f":"SUMIFS(Bogføring!H:H,Bogføring!E:E,\"=\"&$N$5,Bogføring!D:D,\"=\"&A38)","v":0},{"$f":"IF(N38=0,\"\",SUMIFS(Bogføring!$A:$A,Bogføring!$E:$E,\"=\"&$P$5,Bogføring!$D:$D,\"=\"&A38))","v":""},{"$f":"SUMIFS(Bogføring!$H:$H,Bogføring!$E:$E,\"=\"&$P$5,Bogføring!$D:$D,\"=\"&A38)","v":0}]
[35,"Niels Chr. Garde","Mulebyvej 24",3700,"Rønne",null,"niels-garde@hotmail.com",null,null,35,{"$f":"IF(L39=0,\"\",INDEX(Bogføring!$A:$A,MATCH(Tabel2[[#This Row],[Medl.nr. :]],Bogføring!$D:$D,0),0))","v":""},{"$f":"SUMIFS(Bogføring!H:H,Bogføring!E:E,\"=\"&$L$5,Bogføring!D:D,\"=\"&A39)","v":0},{"$f":"IF(N39=0,\"\",SUMIFS(Bogføring!A:A,Bogføring!E:E,\"=\"&$N$5,Bogføring!D:D,\"=\"&A39))","v":""},{"$f":"SUMIFS(Bogføring!H:H,Bogføring!E:E,\"=\"&$N$5,Bogføring!D:D,\"=\"&A39)","v":0},{"$f":"IF(N39=0,\"\",SUMIFS(Bogføring!$A:$A,Bogføring!$E:$E,\"=\"&$P$5,Bogføring!$D:$D,\"=\"&A39))","v":""},{"$f":"SUMIFS(Bogføring!$H:$H,Bogføring!$E:$E,\"=\"&$P$5,Bogføring!$D:$D,\"=\"&A39)","v":0}]
[36,"Connie og Flemming Lykke Koch","Møllevænget 11, Nyker",3700,"Rønne",20186030,"flkoch@outlook.com",null,null,36,{"$f":"IF(L40=0,\"\",INDEX(Bogføring!$A:$A,MATCH(Tabel2[[#This Row],[Medl.nr. :]],Bogføring!$D:$D,0),0))","v":""},{"$f":"SUMIFS(Bogføring!H:H,Bogføring!E:E,\"=\"&$L$5,Bogføring!D:D,\"=\"&A40)","v":0},{"$f":"IF(N40=0,\"\",SUMIFS(Bogføring!A:A,Bogføring!E:E,\"=\"&$N$5,Bogføring!D:D,\"=\"&A40))","v":""},{"$f":"SUMIFS(Bogføring!H:H,Bogføring!E:E,\"=\"&$N$5,Bogføring!D:D,\"=\"&A40)","v":0},{"$f":"IF(N40=0,\"\",SUMIFS(Bogføring!$A:$A,Bogføring!$E:$E,\"=\"&$P$5,Bogføring!$D:$D,\"=\"&A40))","v":""},{"$f":"SUMIFS(Bogføring!$H:$H,Bogføring!$E:$E,\"=\"&$P$5,Bogføring!$D:$D,\"=\"&A40)","v":0}]
[37,"Erik Andersen","Malmøvej 26",3700,"Rønne",null,"erik-ag@mail.dk ",null,null,37,{"$f":"IF(L41=0,\"\",INDEX(Bogføring!$A:$A,MATCH(Tabel2[[#This Row],[Medl.nr. :]],Bogføring!$D:$D,0),0))","v":""},{"$f":"SUMIFS(Bogføring!H:H,Bogføring!E:E,\"=\"&$L$5,Bogføring!D:D,\"=\"&A41)","v":0},{"$f":"IF(N41=0,\"\",SUMIFS(Bogføring!A:A,Bogføring!E:E,\"=\"&$N$5,Bogføring!D:D,\"=\"&A41))","v":""},{"$f":"SUMIFS(Bogføring!H:H,Bogføring!E:E,\"=\"&$N$5,Bogføring!D:D,\"=\"&A41)","v":0},{"$f":"IF(N41=0,\"\",SUMIFS(Bogføring!$A:$A,Bogføring!$E:$E,\"=\"&$P$5,Bogføring!$D:$D,\"=\"&A41))","v":""},{"$f":"SUMIFS(Bogføring!$H:$H,Bogføring!$E:$E,\"=\"&$P$5,Bogføring!$D:$D,\"=\"&A41)","v":0}]
[38,"Holger Pii","Byvangen 37",3700,"Rønne",null,"hpii@city.dk",null,null,38,{"$f":"IF(L42=0,\"\",INDEX(Bogføring!$A:$A,MATCH(Tabel2[[#This Row],[Medl.nr. :]],Bogføring!$D:$D,0),0))","v":""},{"$f":"SUMIFS(Bogføring!H:H,Bogføring!E:E,\"=\"&$L$5,Bogføring!D:D,\"=\"&A42)","v":0},{"$f":"IF(N42=0,\"\",SUMIFS(Bogføring!A:A,Bogføring!E:E,\"=\"&$N$5,Bogføring!D:D,\"=\"&A42))","v":""},{"$f":"SUMIFS(Bogføring!H:H,Bogføring!E:E,\"=\"&$N$5,Bogføring!D:D,\"=\"&A42)","v":0},{"$f":"IF(N42=0,\"\",SUMIFS(Bogføring!$A:$A,Bogføring!$E:$E,\"=\"&$P$5,Bogføring!$D:$D,\"=\"&A42))","v":""},{"$f":"SUMIFS(Bogføring!$H:$H,Bogføring!$E:$E,\"=\"&$P$5,Bogføring!$D:$D,\"=\"&A42)","v":0}]
[39,"Bente Kofod","Østergade 44 C",3700,"Rønne",24402236,"bhkofod@email.dk",null,null,39,{"$f":"IF(L43=0,\"\",INDEX(Bogføring!$A:$A,MATCH(Tabel2[[#This Row],[Medl.nr. :]],Bogføring!$D:$D,0),0))","v":""},{"$f":"SUMIFS(Bogføring!H:H,Bogføring!E:E,\"=\"&$L$5,Bogføring!D:D,\"=\"&A43)","v":0},{"$f":"IF(N43=0,\"\",SUMIFS(Bogføring!A:A,Bogføring!E:E,\"=\"&$N$5,Bogføring!D:D,\"=\"&A43))","v":""},{"$f":"SUMIFS(Bogføring!H:H,Bogføring!E:E,\"=\"&$N$5,Bogføring!D:D,\"=\"&A43)","v":0},{"$f":"IF(N43=0,\"\",SUMIFS(Bogføring!$A:$A,Bogføring!$E:$E,\"=\"&$P$5,Bogføring!$D:$D,\"=\"&A43))","v":""},{"$f":"SUMIFS(Bogføring!$H:$H,Bogføring!$E:$E,\"=\"&$P$5,Bogføring!$D:$D,\"=\"&A43)","v":0}]
[40,"Jens Baunsgaard","Teglkåsvej 36, Rutsker",3790,"Hasle",null,"j_baunsgaard@hotmail.com",null,null,40,{"$f":"IF(L44=0,\"\",INDEX(Bogføring!$A:$A,MATCH(Tabel2[[#This Row],[Medl.nr. :]],Bogføring!$D:$D,0),0))","v":""},{"$f":"SUMIFS(Bogføring!H:H,Bogføring!E:E,\"=\"&$L$5,Bogføring!D:D,\"=\"&A44)","v":0},{"$f":"IF(N44=0,\"\",SUMIFS(Bogføring!A:A,Bogføring!E:E,\"=\"&$N$5,Bogføring!D:D,\"=\"&A44))","v":""},{"$f":"SUMIFS(Bogføring!H:H,Bogføring!E:E,\"=\"&$N$5,Bogføring!D:D,\"=\"&A44)","v":0},{"$f":"IF(N44=0,\"\",SUMIFS(Bogføring!$A:$A,Bogføring!$E:$E,\"=\"&$P$5,Bogføring!$D:$D,\"=\"&A44))","v":""},{"$f":"SUMIFS(Bogføring!$H:$H,Bogføring!$E:$E,\"=\"&$P$5,Bogføring!$D:$D,\"=\"&A44)","v":0}]
[41,"Charlotte Henriksen","Malmøvej 7",3700,"Rønne",null,"kim.charlotte@stofanet.dk",2018,null,41,{"$f":"IF(L45=0,\"\",INDEX(Bogføring!$A:$A,MATCH(Tabel2[[#This Row],[Medl.nr. :]],Bogføring!$D:$D,0),0))","v":""},{"$f":"SUMIFS(Bogføring!H:H,Bogføring!E:E,\"=\"&$L$5,Bogføring!D:D,\"=\"&A45)","v":0},{"$f":"IF(N45=0,\"\",SUMIFS(Bogføring!A:A,Bogføring!E:E,\"=\"&$N$5,Bogføring!D:D,\"=\"&A45))","v":""},{"$f":"SUMIFS(Bogføring!H:H,Bogføring!E:E,\"=\"&$N$5,Bogføring!D:D,\"=\"&A45)","v":0},{"$f":"IF(N45=0,\"\",SUMIFS(Bogføring!$A:$A,Bogføring!$E:$E,\"=\"&$P$5,Bogføring!$D:$D,\"=\"&A45))","v":""},{"$f":"SUMIFS(Bogføring!$H:$H,Bogføring!$E:$E,\"=\"&$P$5,Bogføring!$D:$D,\"=\"&A45)","v":0}]
[42,"Hanne og Sten Hueg","Sofienborg, Lynggårdsvej 11, Olsker",3770,"Allinge",null,"sfhueg@godmail.dk",null,null,42,{"$f":"IF(L46=0,\"\",INDEX(Bogføring!$A:$A,MATCH(Tabel2[[#This Row],[Medl.nr. :]],Bogføring!$D:$D,0),0))","v":""},{"$f":"SUMIFS(Bogføring!H:H,Bogføring!E:E,\"=\"&$L$5,Bogføring!D:D,\"=\"&A46)","v":0},{"$f":"IF(N46=0,\"\",SUMIFS(Bogføring!A:A,Bogføring!E:E,\"=\"&$N$5,Bogføring!D:D,\"=\"&A46))","v":""},{"$f":"SUMIFS(Bogføring!H:H,Bogføring!E:E,\"=\"&$N$5,Bogføring!D:D,\"=\"&A46)","v":0},{"$f":"IF(N46=0,\"\",SUMIFS(Bogføring!$A:$A,Bogføring!$E:$E,\"=\"&$P$5,Bogføring!$D:$D,\"=\"&A46))","v":""},{"$f":"SUMIFS(Bogføring!$H:$H,Bogføring!$E:$E,\"=\"&$P$5,Bogføring!$D:$D,\"=\"&A46)","v":0}]
[43,"Zarina Tina Sose","Pilestræde 18",3700,"Rønne",null,"zizisose@outlook.dk",null,"Frivillig",43,{"$f":"IF(L47=0,\"\",INDEX(Bogføring!$A:$A,MATCH(Tabel2[[#This Row],[Medl.nr. :]],Bogføring!$D:$D,0),0))","v":""},{"$f":"SUMIFS(Bogføring!H:H,Bogføring!E:E,\"=\"&$L$5,Bogføring!D:D,\"=\"&A47)","v":0},{"$f":"IF(N47=0,\"\",SUMIFS(Bogføring!A:A,Bogføring!E:E,\"=\"&$N$5,Bogføring!D:D,\"=\"&A47))","v":""},{"$f":"SUMIFS(Bogføring!H:H,Bogføring!E:E,\"=\"&$N$5,Bogføring!D:D,\"=\"&A47)","v":0},{"$f":"IF(N47=0,\"\",SUMIFS(Bogføring!$A:$A,Bogføring!$E:$E,\"=\"&$P$5,Bogføring!$D:$D,\"=\"&A47))","v":""},{"$f":"SUMIFS(Bogføring!$H:$H,Bogføring!$E:$E,\"=\"&$P$5,Bogføring!$D:$D,\"=\"&A47)","v":0}]
[44,"Ole Bramsgaard","Borgergade 11",3700,"Rønne",21647153,"ole@bramsgaard.dk",null,null,44,{"$f":"IF(L48=0,\"\",INDEX(Bogføring!$A:$A,MATCH(Tabel2[[#This Row],[Medl.nr. :]],Bogføring!$D:$D,0),0))","v":""},{"$f":"SUMIFS(Bogføring!H:H,Bogføring!E:E,\"=\"&$L$5,Bogføring!D:D,\"=\"&A48)","v":0},{"$f":"IF(N48=0,\"\",SUMIFS(Bogføring!A:A,Bogføring!E:E,\"=\"&$N$5,Bogføring!D:D,\"=\"&A48))","v":""},{"$f":"SUMIFS(Bogføring!H:H,Bogføring!E:E,\"=\"&$N$5,Bogføring!D:D,\"=\"&A48)","v":0},{"$f":"IF(N48=0,\"\",SUMIFS(Bogføring!$A:$A,Bogføring!$E:$E,\"=\"&$P$5,Bogføring!$D:$D,\"=\"&A48))","v":""},{"$f":"SUMIFS(Bogføring!$H:$H,Bogføring!$E:$E,\"=\"&$P$5,Bogføring!$D:$D,\"=\"&A48)","v":0}]
[45,"Hanne Bærild Jacobsen","St. Torvegade 58",3700,"Rønne",null,"hbj0940@gmail.com",null,null,45,{"$f":"IF(L49=0,\"\",INDEX(Bogføring!$A:$A,MATCH(Tabel2[[#This Row],[Medl.nr. :]],Bogføring!$D:$D,0),0))","v":""},{"$f":"SUMIFS(Bogføring!H:H,Bogføring!E:E,\"=\"&$L$5,Bogføring!D:D,\"=\"&A49)","v":0},{"$f":"IF(N49=0,\"\",SUMIFS(Bogføring!A:A,Bogføring!E:E,\"=\"&$N$5,Bogføring!D:D,\"=\"&A49))","v":""},{"$f":"SUMIFS(Bogføring!H:H,Bogføring!E:E,\"=\"&$N$5,Bogføring!D:D,\"=\"&A49)","v":0},{"$f":"IF(N49=0,\"\",SUMIFS(Bogføring!$A:$A,Bogføring!$E:$E,\"=\"&$P$5,Bogføring!$D:$D,\"=\"&A49))","v":""},{"$f":"SUMIFS(Bogføring!$H:$H,Bogføring!$E:$E,\"=\"&$P$5,Bogføring!$D:$D,\"=\"&A49)","v":0}]
[46,"Anne og Niels-Kristian Pii","Langholmen 3",2630,"Tåstrup",null,"anne.pii@mail.dk",null,null,46,{"$f":"IF(L50=0,\"\",INDEX(Bogføring!$A:$A,MATCH(Tabel2[[#This Row],[Medl.nr. :]],Bogføring!$D:$D,0),0))","v":""},{"$f":"SUMIFS(Bogføring!H:H,Bogføring!E:E,\"=\"&$L$5,Bogføring!D:D,\"=\"&A50)","v":0},{"$f":"IF(N50=0,\"\",SUMIFS(Bogføring!A:A,Bogføring!E:E,\"=\"&$N$5,Bogføring!D:D,\"=\"&A50))","v":""},{"$f":"SUMIFS(Bogføring!H:H,Bogføring!E:E,\"=\"&$N$5,Bogføring!D:D,\"=\"&A50)","v":0},{"$f":"IF(N50=0,\"\",SUMIFS(Bogføring!$A:$A,Bogføring!$E:$E,\"=\"&$P$5,Bogføring!$D:$D,\"=\"&A50))","v":""},{"$f":"SUMIFS(Bogføring!$H:$H,Bogføring!$E:$E,\"=\"&$P$5,Bogføring!$D:$D,\"=\"&A50)","v":0}]
[47,"Arne V. Hansen","Gyldengårdsvej 5",3700,"Rønne",null,"arne.v@hansen.mail.dk",null,null,47,{"$f":"IF(L51=0,\"\",INDEX(Bogføring!$A:$A,MATCH(Tabel2[[#This Row],[Medl.nr. :]],Bogføring!$D:$D,0),0))","v":""},{"$f":"SUMIFS(Bogføring!H:H,Bogføring!E:E,\"=\"&$L$5,Bogføring!D:D,\"=\"&A51)","v":0},{"$f":"IF(N51=0,\"\",SUMIFS(Bogføring!A:A,Bogføring!E:E,\"=\"&$N$5,Bogføring!D:D,\"=\"&A51))","v":""},{"$f":"SUMIFS(Bogføring!H:H,Bogføring!E:E,\"=\"&$N$5,Bogføring!D:D,\"=\"&A51)","v":0},{"$f":"IF(N51=0,\"\",SUMIFS(Bogføring!$A:$A,Bogføring!$E:$E,\"=\"&$P$5,Bogføring!$D:$D,\"=\"&A51))","v":""},{"$f":"SUMIFS(Bogføring!$H:$H,Bogføring!$E:$E,\"=\"&$P$5,Bogføring!$D:$D,\"=\"&A51)","v":0}]
[48,"Marian og Holger Juul-Pedersen","Bagergade 1",3700,"Rønne",null,"juul-pedersen@hotmail.dk",null,null,48,{"$f":"IF(L52=0,\"\",INDEX(Bogføring!$A:$A,MATCH(Tabel2[[#This Row],[Medl.nr. :]],Bogføring!$D:$D,0),0))","v":""},{"$f":"SUMIFS(Bogføring!H:H,Bogføring!E:E,\"=\"&$L$5,Bogføring!D:D,\"=\"&A52)","v":0},{"$f":"IF(N52=0,\"\",SUMIFS(Bogføring!A:A,Bogføring!E:E,\"=\"&$N$5,Bogføring!D:D,\"=\"&A52))","v":""},{"$f":"SUMIFS(Bogføring!H:H,Bogføring!E:E,\"=\"&$N$5,Bogføring!D:D,\"=\"&A52)","v":0},{"$f":"IF(N52=0,\"\",SUMIFS(Bogføring!$A:$A,Bogføring!$E:$E,\"=\"&$P$5,Bogføring!$D:$D,\"=\"&A52))","v":""},{"$f":"SUMIFS(Bogføring!$H:$H,Bogføring!$E:$E,\"=\"&$P$5,Bogføring!$D:$D,\"=\"&A52)","v":0}]
[49,"C.U. Essemann-Beck","Sejersvej 29",3700,"Rønne",56955329,"essebeck3@gmail.com",null,null,49,{"$f":"IF(L53=0,\"\",INDEX(Bogføring!$A:$A,MATCH(Tabel2[[#This Row],[Medl.nr. :]],Bogføring!$D:$D,0),0))","v":""},{"$f":"SUMIFS(Bogføring!H:H,Bogføring!E:E,\"=\"&$L$5,Bogføring!D:D,\"=\"&A53)","v":0},{"$f":"IF(N53=0,\"\",SUMIFS(Bogføring!A:A,Bogføring!E:E,\"=\"&$N$5,Bogføring!D:D,\"=\"&A53))","v":""},{"$f":"SUMIFS(Bogføring!H:H,Bogføring!E:E,\"=\"&$N$5,Bogføring!D:D,\"=\"&A53)","v":0},{"$f":"IF(N53=0,\"\",SUMIFS(Bogføring!$A:$A,Bogføring!$E:$E,\"=\"&$P$5,Bogføring!$D:$D,\"=\"&A53))","v":""},{"$f":"SUMIFS(Bogføring!$H:$H,Bogføring!$E:$E,\"=\"&$P$5,Bogføring!$D:$D,\"=\"&A53)","v":0}]
[50,"Erik A. Larsen","Svanekevej 60",3700,"Rønne",56953180,"erik.a.larsen@mail.dk",null,null,50,{"$f":"IF(L54=0,\"\",INDEX(Bogføring!$A:$A,MATCH(Tabel2[[#This Row],[Medl.nr. :]],Bogføring!$D:$D,0),0))","v":""},{"$f":"SUMIFS(Bogføring!H:H,Bogføring!E:E,\"=\"&$L$5,Bogføring!D:D,\"=\"&A54)","v":0},{"$f":"IF(N54=0,\"\",SUMIFS(Bogføring!A:A,Bogføring!E:E,\"=\"&$N$5,Bogføring!D:D,\"=\"&A54))","v":""},{"$f":"SUMIFS(Bogføring!H:H,Bogføring!E:E,\"=\"&$N$5,Bogføring!D:D,\"=\"&A54)","v":0},{"$f":"IF(N54=0,\"\",SUMIFS(Bogføring!$A:$A,Bogføring!$E:$E,\"=\"&$P$5,Bogføring!$D:$D,\"=\"&A54))","v":""},{"$f":"SUMIFS(Bogføring!$H:$H,Bogføring!$E:$E,\"=\"&$P$5,Bogføring!$D:$D,\"=\"&A54)","v":0}]
[51,"Finn Jakobsen","Toftekrogen 2",3790,"Hasle",null,"finn@stortuen.dk",null,null,51,{"$f":"IF(L55=0,\"\",INDEX(Bogføring!$A:$A,MATCH(Tabel2[[#This Row],[Medl.nr. :]],Bogføring!$D:$D,0),0))","v":""},{"$f":"SUMIFS(Bogføring!H:H,Bogføring!E:E,\"=\"&$L$5,Bogføring!D:D,\"=\"&A55)","v":0},{"$f":"IF(N55=0,\"\",SUMIFS(Bogføring!A:A,Bogføring!E:E,\"=\"&$N$5,Bogføring!D:D,\"=\"&A55))","v":""},{"$f":"SUMIFS(Bogføring!H:H,Bogføring!E:E,\"=\"&$N$5,Bogføring!D:D,\"=\"&A55)","v":0},{"$f":"IF(N55=0,\"\",SUMIFS(Bogføring!$A:$A,Bogføring!$E:$E,\"=\"&$P$5,Bogføring!$D:$D,\"=\"&A55))","v":""},{"$f":"SUMIFS(Bogføring!$H:$H,Bogføring!$E:$E,\"=\"&$P$5,Bogføring!$D:$D,\"=\"&A55)","v":0}]
[52,"Jens Kofod","Søndre Mosevej 2, Snogebæk",3730,"Nexø",22115310,"jenskofod@outlook.com",null,null,52,{"$f":"IF(L56=0,\"\",INDEX(Bogføring!$A:$A,MATCH(Tabel2[[#This Row],[Medl.nr. :]],Bogføring!$D:$D,0),0))","v":""},{"$f":"SUMIFS(Bogføring!H:H,Bogføring!E:E,\"=\"&$L$5,Bogføring!D:D,\"=\"&A56)","v":0},{"$f":"IF(N56=0,\"\",SUMIFS(Bogføring!A:A,Bogføring!E:E,\"=\"&$N$5,Bogføring!D:D,\"=\"&A56))","v":""},{"$f":"SUMIFS(Bogføring!H:H,Bogføring!E:E,\"=\"&$N$5,Bogføring!D:D,\"=\"&A56)","v":0},{"$f":"IF(N56=0,\"\",SUMIFS(Bogføring!$A:$A,Bogføring!$E:$E,\"=\"&$P$5,Bogføring!$D:$D,\"=\"&A56))","v":""},{"$f":"SUMIFS(Bogføring!$H:$H,Bogføring!$E:$E,\"=\"&$P$5,Bogføring!$D:$D,\"=\"&A56)","v":0}]
[53,"Jørn Ole Jensen","Højegårdsvej 9",3700,"Rønne",null,"joj74@icloud.com",null,null,53,{"$f":"IF(L57=0,\"\",INDEX(Bogføring!$A:$A,MATCH(Tabel2[[#This Row],[Medl.nr. :]],Bogføring!$D:$D,0),0))","v":""},{"$f":"SUMIFS(Bogføring!H:H,Bogføring!E:E,\"=\"&$L$5,Bogføring!D:D,\"=\"&A57)","v":0},{"$f":"IF(N57=0,\"\",SUMIFS(Bogføring!A:A,Bogføring!E:E,\"=\"&$N$5,Bogføring!D:D,\"=\"&A57))","v":""},{"$f":"SUMIFS(Bogføring!H:H,Bogføring!E:E,\"=\"&$N$5,Bogføring!D:D,\"=\"&A57)","v":0},{"$f":"IF(N57=0,\"\",SUMIFS(Bogføring!$A:$A,Bogføring!$E:$E,\"=\"&$P$5,Bogføring!$D:$D,\"=\"&A57))","v":""},{"$f":"SUMIFS(Bogføring!$H:$H,Bogføring!$E:$E,\"=\"&$P$5,Bogføring!$D:$D,\"=\"&A57)","v":0}]
[54,"Ole Ingvorsen","Duebjerggård, Simblegårdsvej 21",3790,"Hasle",null,"ole.ingvorsen40@gmail.com",null,null,54,{"$f":"IF(L58=0,\"\",INDEX(Bogføring!$A:$A,MATCH(Tabel2[[#This Row],[Medl.nr. :]],Bogføring!$D:$D,0),0))","v":""},{"$f":"SUMIFS(Bogføring!H:H,Bogføring!E:E,\"=\"&$L$5,Bogføring!D:D,\"=\"&A58)","v":0},{"$f":"IF(N58=0,\"\",SUMIFS(Bogføring!A:A,Bogføring!E:E,\"=\"&$N$5,Bogføring!D:D,\"=\"&A58))","v":""},{"$f":"SUMIFS(Bogføring!H:H,Bogføring!E:E,\"=\"&$N$5,Bogføring!D:D,\"=\"&A58)","v":0},{"$f":"IF(N58=0,\"\",SUMIFS(Bogføring!$A:$A,Bogføring!$E:$E,\"=\"&$P$5,Bogføring!$D:$D,\"=\"&A58))","v":""},{"$f":"SUMIFS(Bogføring!$H:$H,Bogføring!$E:$E,\"=\"&$P$5,Bogføring!$D:$D,\"=\"&A58)","v":0}]
[55,"Michael Berg Petersen","Lille Madsegade 123",3700,"Rønne",null,"mbpberg@image.dk",null,null,55,{"$f":"IF(L59=0,\"\",INDEX(Bogføring!$A:$A,MATCH(Tabel2[[#This Row],[Medl.nr. :]],Bogføring!$D:$D,0),0))","v":""},{"$f":"SUMIFS(Bogføring!H:H,Bogføring!E:E,\"=\"&$L$5,Bogføring!D:D,\"=\"&A59)","v":0},{"$f":"IF(N59=0,\"\",SUMIFS(Bogføring!A:A,Bogføring!E:E,\"=\"&$N$5,Bogføring!D:D,\"=\"&A59))","v":""},{"$f":"SUMIFS(Bogføring!H:H,Bogføring!E:E,\"=\"&$N$5,Bogføring!D:D,\"=\"&A59)","v":0},{"$f":"IF(N59=0,\"\",SUMIFS(Bogføring!$A:$A,Bogføring!$E:$E,\"=\"&$P$5,Bogføring!$D:$D,\"=\"&A59))","v":""},{"$f":"SUMIFS(Bogføring!$H:$H,Bogføring!$E:$E,\"=\"&$P$5,Bogføring!$D:$D,\"=\"&A59)","v":0}]
[56,"Hans Jørn Sonne","Tornegård, Hovedgårdsvejen 3",3720,"Åkirkeby",null,"Sellesborg@mail.tele.dk",null,null,56,{"$f":"IF(L60=0,\"\",INDEX(Bogføring!$A:$A,MATCH(Tabel2[[#This Row],[Medl.nr. :]],Bogføring!$D:$D,0),0))","v":""},{"$f":"SUMIFS(Bogføring!H:H,Bogføring!E:E,\"=\"&$L$5,Bogføring!D:D,\"=\"&A60)","v":0},{"$f":"IF(N60=0,\"\",SUMIFS(Bogføring!A:A,Bogføring!E:E,\"=\"&$N$5,Bogføring!D:D,\"=\"&A60))","v":""},{"$f":"SUMIFS(Bogføring!H:H,Bogføring!E:E,\"=\"&$N$5,Bogføring!D:D,\"=\"&A60)","v":0},{"$f":"IF(N60=0,\"\",SUMIFS(Bogføring!$A:$A,Bogføring!$E:$E,\"=\"&$P$5,Bogføring!$D:$D,\"=\"&A60))","v":""},{"$f":"SUMIFS(Bogføring!$H:$H,Bogføring!$E:$E,\"=\"&$P$5,Bogføring!$D:$D,\"=\"&A60)","v":0}]
[57,"Palle Roch Nielsen","Ugleengevejen 1",3720,"Åkirkeby",null,"palle@roch.dk",null,null,57,{"$f":"IF(L61=0,\"\",INDEX(Bogføring!$A:$A,MATCH(Tabel2[[#This Row],[Medl.nr. :]],Bogføring!$D:$D,0),0))","v":""},{"$f":"SUMIFS(Bogføring!H:H,Bogføring!E:E,\"=\"&$L$5,Bogføring!D:D,\"=\"&A61)","v":0},{"$f":"IF(N61=0,\"\",SUMIFS(Bogføring!A:A,Bogføring!E:E,\"=\"&$N$5,Bogføring!D:D,\"=\"&A61))","v":""},{"$f":"SUMIFS(Bogføring!H:H,Bogføring!E:E,\"=\"&$N$5,Bogføring!D:D,\"=\"&A61)","v":0},{"$f":"IF(N61=0,\"\",SUMIFS(Bogføring!$A:$A,Bogføring!$E:$E,\"=\"&$P$5,Bogføring!$D:$D,\"=\"&A61))","v":""},{"$f":"SUMIFS(Bogføring!$H:$H,Bogføring!$E:$E,\"=\"&$P$5,Bogføring!$D:$D,\"=\"&A61)","v":0}]
[58,"Per Erik Christiansen","Hellestien 3",8600,"Silkeborg",null,"hellestien3@yahoo.dk",null,null,58,{"$f":"IF(L62=0,\"\",INDEX(Bogføring!$A:$A,MATCH(Tabel2[[#This Row],[Medl.nr. :]],Bogføring!$D:$D,0),0))","v":""},{"$f":"SUMIFS(Bogføring!H:H,Bogføring!E:E,\"=\"&$L$5,Bogføring!D:D,\"=\"&A62)","v":0},{"$f":"IF(N62=0,\"\",SUMIFS(Bogføring!A:A,Bogføring!E:E,\"=\"&$N$5,Bogføring!D:D,\"=\"&A62))","v":""},{"$f":"SUMIFS(Bogføring!H:H,Bogføring!E:E,\"=\"&$N$5,Bogføring!D:D,\"=\"&A62)","v":0},{"$f":"IF(N62=0,\"\",SUMIFS(Bogføring!$A:$A,Bogføring!$E:$E,\"=\"&$P$5,Bogføring!$D:$D,\"=\"&A62))","v":""},{"$f":"SUMIFS(Bogføring!$H:$H,Bogføring!$E:$E,\"=\"&$P$5,Bogføring!$D:$D,\"=\"&A62)","v":0}]
[59,"Flemming Hansen","Bøllingsvej 15 D, st. th.,",4100,"Ringsted",22369745,"lifl@live.dk",null,null,59,{"$f":"IF(L63=0,\"\",INDEX(Bogføring!$A:$A,MATCH(Tabel2[[#This Row],[Medl.nr. :]],Bogføring!$D:$D,0),0))","v":""},{"$f":"SUMIFS(Bogføring!H:H,Bogføring!E:E,\"=\"&$L$5,Bogføring!D:D,\"=\"&A63)","v":0},{"$f":"IF(N63=0,\"\",SUMIFS(Bogføring!A:A,Bogføring!E:E,\"=\"&$N$5,Bogføring!D:D,\"=\"&A63))","v":""},{"$f":"SUMIFS(Bogføring!H:H,Bogføring!E:E,\"=\"&$N$5,Bogføring!D:D,\"=\"&A63)","v":0},{"$f":"IF(N63=0,\"\",SUMIFS(Bogføring!$A:$A,Bogføring!$E:$E,\"=\"&$P$5,Bogføring!$D:$D,\"=\"&A63))","v":""},{"$f":"SUMIFS(Bogføring!$H:$H,Bogføring!$E:$E,\"=\"&$P$5,Bogføring!$D:$D,\"=\"&A63)","v":0}]
[60,"Jørgen Ulrik Selmer","Østergade 2",3700,"Rønne",53656166,"joergenselmer@gmail.com",2018,null,60,{"$f":"IF(L64=0,\"\",INDEX(Bogføring!$A:$A,MATCH(Tabel2[[#This Row],[Medl.nr. :]],Bogføring!$D:$D,0),0))","v":""},{"$f":"SUMIFS(Bogføring!H:H,Bogføring!E:E,\"=\"&$L$5,Bogføring!D:D,\"=\"&A64)","v":0},{"$f":"IF(N64=0,\"\",SUMIFS(Bogføring!A:A,Bogføring!E:E,\"=\"&$N$5,Bogføring!D:D,\"=\"&A64))","v":""},{"$f":"SUMIFS(Bogføring!H:H,Bogføring!E:E,\"=\"&$N$5,Bogføring!D:D,\"=\"&A64)","v":0},{"$f":"IF(N64=0,\"\",SUMIFS(Bogføring!$A:$A,Bogføring!$E:$E,\"=\"&$P$5,Bogføring!$D:$D,\"=\"&A64))","v":""},{"$f":"SUMIFS(Bogføring!$H:$H,Bogføring!$E:$E,\"=\"&$P$5,Bogføring!$D:$D,\"=\"&A64)","v":0}]
[61,"Hans Hellisen","Slamrebjergvej 4, Bodilsker",3730,"Nexø",null,"hans.hellisen@get2net.dk",null,null,61,{"$f":"IF(L65=0,\"\",INDEX(Bogføring!$A:$A,MATCH(Tabel2[[#This Row],[Medl.nr. :]],Bogføring!$D:$D,0),0))","v":""},{"$f":"SUMIFS(Bogføring!H:H,Bogføring!E:E,\"=\"&$L$5,Bogføring!D:D,\"=\"&A65)","v":0},{"$f":"IF(N65=0,\"\",SUMIFS(Bogføring!A:A,Bogføring!E:E,\"=\"&$N$5,Bogføring!D:D,\"=\"&A65))","v":""},{"$f":"SUMIFS(Bogføring!H:H,Bogføring!E:E,\"=\"&$N$5,Bogføring!D:D,\"=\"&A65)","v":0},{"$f":"IF(N65=0,\"\",SUMIFS(Bogføring!$A:$A,Bogføring!$E:$E,\"=\"&$P$5,Bogføring!$D:$D,\"=\"&A65))","v":""},{"$f":"SUMIFS(Bogføring!$H:$H,Bogføring!$E:$E,\"=\"&$P$5,Bogføring!$D:$D,\"=\"&A65)","v":0}]
[62,"Tommy Niels Bendtsen","Bodernevej 6",3720,"Åkirkeby",23274895,"Tommy25dk@gmail.com",2018,null,62,{"$f":"IF(L66=0,\"\",INDEX(Bogføring!$A:$A,MATCH(Tabel2[[#This Row],[Medl.nr. :]],Bogføring!$D:$D,0),0))","v":""},{"$f":"SUMIFS(Bogføring!H:H,Bogføring!E:E,\"=\"&$L$5,Bogføring!D:D,\"=\"&A66)","v":0},{"$f":"IF(N66=0,\"\",SUMIFS(Bogføring!A:A,Bogføring!E:E,\"=\"&$N$5,Bogføring!D:D,\"=\"&A66))","v":""},{"$f":"SUMIFS(Bogføring!H:H,Bogføring!E:E,\"=\"&$N$5,Bogføring!D:D,\"=\"&A66)","v":0},{"$f":"IF(N66=0,\"\",SUMIFS(Bogføring!$A:$A,Bogføring!$E:$E,\"=\"&$P$5,Bogføring!$D:$D,\"=\"&A66))","v":""},{"$f":"SUMIFS(Bogføring!$H:$H,Bogføring!$E:$E,\"=\"&$P$5,Bogføring!$D:$D,\"=\"&A66)","v":0}]
[63,"Jens Christian Hansen","Snorrebakken 50",3700,"Rønne",null,"jchansen@nypost.dk",null,null,63,{"$f":"IF(L67=0,\"\",INDEX(Bogføring!$A:$A,MATCH(Tabel2[[#This Row],[Medl.nr. :]],Bogføring!$D:$D,0),0))","v":""},{"$f":"SUMIFS(Bogføring!H:H,Bogføring!E:E,\"=\"&$L$5,Bogføring!D:D,\"=\"&A67)","v":0},{"$f":"IF(N67=0,\"\",SUMIFS(Bogføring!A:A,Bogføring!E:E,\"=\"&$N$5,Bogføring!D:D,\"=\"&A67))","v":""},{"$f":"SUMIFS(Bogføring!H:H,Bogføring!E:E,\"=\"&$N$5,Bogføring!D:D,\"=\"&A67)","v":0},{"$f":"IF(N67=0,\"\",SUMIFS(Bogføring!$A:$A,Bogføring!$E:$E,\"=\"&$P$5,Bogføring!$D:$D,\"=\"&A67))","v":""},{"$f":"SUMIFS(Bogføring!$H:$H,Bogføring!$E:$E,\"=\"&$P$5,Bogføring!$D:$D,\"=\"&A67)","v":0}]
[64,"Erik Ipsen","Borgmester Nielsensvej 153",3700,"Rønne",null,"ipsen@post7.tele.dk",null,null,64,{"$f":"IF(L68=0,\"\",INDEX(Bogføring!$A:$A,MATCH(Tabel2[[#This Row],[Medl.nr. :]],Bogføring!$D:$D,0),0))","v":""},{"$f":"SUMIFS(Bogføring!H:H,Bogføring!E:E,\"=\"&$L$5,Bogføring!D:D,\"=\"&A68)","v":0},{"$f":"IF(N68=0,\"\",SUMIFS(Bogføring!A:A,Bogføring!E:E,\"=\"&$N$5,Bogføring!D:D,\"=\"&A68))","v":""},{"$f":"SUMIFS(Bogføring!H:H,Bogføring!E:E,\"=\"&$N$5,Bogføring!D:D,\"=\"&A68)","v":0},{"$f":"IF(N68=0,\"\",SUMIFS(Bogføring!$A:$A,Bogføring!$E:$E,\"=\"&$P$5,Bogføring!$D:$D,\"=\"&A68))","v":""},{"$f":"SUMIFS(Bogføring!$H:$H,Bogføring!$E:$E,\"=\"&$P$5,Bogføring!$D:$D,\"=\"&A68)","v":0}]
[65,"Jesper Lund Koefoed","Spageregård, Loftsgårdsvej 1",3720,"Åkirkeby",null,"spageregaard@get2net.dk",null,null,65,{"$f":"IF(L69=0,\"\",INDEX(Bogføring!$A:$A,MATCH(Tabel2[[#This Row],[Medl.nr. :]],Bogføring!$D:$D,0),0))","v":""},{"$f":"SUMIFS(Bogføring!H:H,Bogføring!E:E,\"=\"&$L$5,Bogføring!D:D,\"=\"&A69)","v":0},{"$f":"IF(N69=0,\"\",SUMIFS(Bogføring!A:A,Bogføring!E:E,\"=\"&$N$5,Bogføring!D:D,\"=\"&A69))","v":""},{"$f":"SUMIFS(Bogføring!H:H,Bogføring!E:E,\"=\"&$N$5,Bogføring!D:D,\"=\"&A69)","v":0},{"$f":"IF(N69=0,\"\",SUMIFS(Bogføring!$A:$A,Bogføring!$E:$E,\"=\"&$P$5,Bogføring!$D:$D,\"=\"&A69))","v":""},{"$f":"SUMIFS(Bogføring!$H:$H,Bogføring!$E:$E,\"=\"&$P$5,Bogføring!$D:$D,\"=\"&A69)","v":0}]
[66,"Jens & Lene Holm Andersen","Sandmarksvej 6, Sorthat-Muleby",3700,"Rønne",null,"jensandersen59@gmail.com",null,null,{"$f":"IF(A70=\"\",\"\",A70)","v":66},{"$f":"IF(L70=0,\"\",INDEX(Bogføring!$A:$A,MATCH(Tabel2[[#This Row],[Medl.nr. :]],Bogføring!$D:$D,0),0))","v":""},{"$f":"SUMIFS(Bogføring!H:H,Bogføring!E:E,\"=\"&$L$5,Bogføring!D:D,\"=\"&A70)","v":0},{"$f":"IF(N70=0,\"\",SUMIFS(Bogføring!A:A,Bogføring!E:E,\"=\"&$N$5,Bogføring!D:D,\"=\"&A70))","v":""},{"$f":"SUMIFS(Bogføring!H:H,Bogføring!E:E,\"=\"&$N$5,Bogføring!D:D,\"=\"&A70)","v":0},{"$f":"IF(N70=0,\"\",SUMIFS(Bogføring!$A:$A,Bogføring!$E:$E,\"=\"&$P$5,Bogføring!$D:$D,\"=\"&A70))","v":""},{"$f":"SUMIFS(Bogføring!$H:$H,Bogføring!$E:$E,\"=\"&$P$5,Bogføring!$D:$D,\"=\"&A70)","v":0}]
[67,"Poul Hviid","Tyttebærløkken 1",3700,"Rønne",null,"poul.hviid@gmail.com",null,null,67,{"$f":"IF(L71=0,\"\",INDEX(Bogføring!$A:$A,MATCH(Tabel2[[#This Row],[Medl.nr. :]],Bogføring!$D:$D,0),0))","v":""},{"$f":"SUMIFS(Bogføring!H:H,Bogføring!E:E,\"=\"&$L$5,Bogføring!D:D,\"=\"&A71)","v":0},{"$f":"IF(N71=0,\"\",SUMIFS(Bogføring!A:A,Bogføring!E:E,\"=\"&$N$5,Bogføring!D:D,\"=\"&A71))","v":""},{"$f":"SUMIFS(Bogføring!H:H,Bogføring!E:E,\"=\"&$N$5,Bogføring!D:D,\"=\"&A71)","v":0},{"$f":"IF(N71=0,\"\",SUMIFS(Bogføring!$A:$A,Bogføring!$E:$E,\"=\"&$P$5,Bogføring!$D:$D,\"=\"&A71))","v":""},{"$f":"SUMIFS(Bogføring!$H:$H,Bogføring!$E:$E,\"=\"&$P$5,Bogføring!$D:$D,\"=\"&A71)","v":0}]
[68,"Ketty Fuglsbjerg Hansen","Ingemannsvej 6, Listed",3740,"Svaneke",null,"fuglsbjerg@privat.dk",null,null,68,{"$f":"IF(L72=0,\"\",INDEX(Bogføring!$A:$A,MATCH(Tabel2[[#This Row],[Medl.nr. :]],Bogføring!$D:$D,0),0))","v":""},{"$f":"SUMIFS(Bogføring!H:H,Bogføring!E:E,\"=\"&$L$5,Bogføring!D:D,\"=\"&A72)","v":0},{"$f":"IF(N72=0,\"\",SUMIFS(Bogføring!A:A,Bogføring!E:E,\"=\"&$N$5,Bogføring!D:D,\"=\"&A72))","v":""},{"$f":"SUMIFS(Bogføring!H:H,Bogføring!E:E,\"=\"&$N$5,Bogføring!D:D,\"=\"&A72)","v":0},{"$f":"IF(N72=0,\"\",SUMIFS(Bogføring!$A:$A,Bogføring!$E:$E,\"=\"&$P$5,Bogføring!$D:$D,\"=\"&A72))","v":""},{"$f":"SUMIFS(Bogføring!$H:$H,Bogføring!$E:$E,\"=\"&$P$5,Bogføring!$D:$D,\"=\"&A72)","v":0}]
[69,"Annette S. Dreyer","Højvangsparken 43 st.",3700,"Rønne",50994923,"a.solveig.dreyer@gmail.com",2019,"Frivillig",69,{"$f":"IF(L73=0,\"\",INDEX(Bogføring!$A:$A,MATCH(Tabel2[[#This Row],[Medl.nr. :]],Bogføring!$D:$D,0),0))","v":""},{"$f":"SUMIFS(Bogføring!H:H,Bogføring!E:E,\"=\"&$L$5,Bogføring!D:D,\"=\"&A73)","v":0},{"$f":"IF(N73=0,\"\",SUMIFS(Bogføring!A:A,Bogføring!E:E,\"=\"&$N$5,Bogføring!D:D,\"=\"&A73))","v":""},{"$f":"SUMIFS(Bogføring!H:H,Bogføring!E:E,\"=\"&$N$5,Bogføring!D:D,\"=\"&A73)","v":0},{"$f":"IF(N73=0,\"\",SUMIFS(Bogføring!$A:$A,Bogføring!$E:$E,\"=\"&$P$5,Bogføring!$D:$D,\"=\"&A73))","v":""},{"$f":"SUMIFS(Bogføring!$H:$H,Bogføring!$E:$E,\"=\"&$P$5,Bogføring!$D:$D,\"=\"&A73)","v":0}]
[70,"Bjarne Rasmussen","Bygvænget 6, Lendemarke",4780,"Stege",28408914,"ulla.bjarne@dlgtele.dk",2019,null,70,{"$f":"IF(L74=0,\"\",INDEX(Bogføring!$A:$A,MATCH(Tabel2[[#This Row],[Medl.nr. :]],Bogføring!$D:$D,0),0))","v":""},{"$f":"SUMIFS(Bogføring!H:H,Bogføring!E:E,\"=\"&$L$5,Bogføring!D:D,\"=\"&A74)","v":0},{"$f":"IF(N74=0,\"\",SUMIFS(Bogføring!A:A,Bogføring!E:E,\"=\"&$N$5,Bogføring!D:D,\"=\"&A74))","v":""},{"$f":"SUMIFS(Bogføring!H:H,Bogføring!E:E,\"=\"&$N$5,Bogføring!D:D,\"=\"&A74)","v":0},{"$f":"IF(N74=0,\"\",SUMIFS(Bogføring!$A:$A,Bogføring!$E:$E,\"=\"&$P$5,Bogføring!$D:$D,\"=\"&A74))","v":""},{"$f":"SUMIFS(Bogføring!$H:$H,Bogføring!$E:$E,\"=\"&$P$5,Bogføring!$D:$D,\"=\"&A74)","v":0}]
[71,"Bitten Poss Jørgensen","Studebyvej 10",3760,"Gudhjem",51893547,"maj-ben@privat.dk",2019,null,71,{"$f":"IF(L75=0,\"\",INDEX(Bogføring!$A:$A,MATCH(Tabel2[[#This Row],[Medl.nr. :]],Bogføring!$D:$D,0),0))","v":""},{"$f":"SUMIFS(Bogføring!H:H,Bogføring!E:E,\"=\"&$L$5,Bogføring!D:D,\"=\"&A75)","v":0},{"$f":"IF(N75=0,\"\",SUMIFS(Bogføring!A:A,Bogføring!E:E,\"=\"&$N$5,Bogføring!D:D,\"=\"&A75))","v":""},{"$f":"SUMIFS(Bogføring!H:H,Bogføring!E:E,\"=\"&$N$5,Bogføring!D:D,\"=\"&A75)","v":0},{"$f":"IF(N75=0,\"\",SUMIFS(Bogføring!$A:$A,Bogføring!$E:$E,\"=\"&$P$5,Bogføring!$D:$D,\"=\"&A75))","v":""},{"$f":"SUMIFS(Bogføring!$H:$H,Bogføring!$E:$E,\"=\"&$P$5,Bogføring!$D:$D,\"=\"&A75)","v":0}]
[72,"Sven Holm Jensen","Smørengevejen 26, V-Marie",3720,"Åkirkeby",61334913,"lykkensproeve@gmail.com",2019,null,72,{"$f":"IF(L76=0,\"\",INDEX(Bogføring!$A:$A,MATCH(Tabel2[[#This Row],[Medl.nr. :]],Bogføring!$D:$D,0),0))","v":""},{"$f":"SUMIFS(Bogføring!H:H,Bogføring!E:E,\"=\"&$L$5,Bogføring!D:D,\"=\"&A76)","v":0},{"$f":"IF(N76=0,\"\",SUMIFS(Bogføring!A:A,Bogføring!E:E,\"=\"&$N$5,Bogføring!D:D,\"=\"&A76))","v":""},{"$f":"SUMIFS(Bogføring!H:H,Bogføring!E:E,\"=\"&$N$5,Bogføring!D:D,\"=\"&A76)","v":0},{"$f":"IF(N76=0,\"\",SUMIFS(Bogføring!$A:$A,Bogføring!$E:$E,\"=\"&$P$5,Bogføring!$D:$D,\"=\"&A76))","v":""},{"$f":"SUMIFS(Bogføring!$H:$H,Bogføring!$E:$E,\"=\"&$P$5,Bogføring!$D:$D,\"=\"&A76)","v":0}]
[73,"Kenneth Frithiof Kure","Meulenborg Park 31",3070,"Snekkersten",24630084,"kurs@mail.dk",2019,null,73,{"$f":"IF(L77=0,\"\",INDEX(Bogføring!$A:$A,MATCH(Tabel2[[#This Row],[Medl.nr. :]],Bogføring!$D:$D,0),0))","v":""},{"$f":"SUMIFS(Bogføring!H:H,Bogføring!E:E,\"=\"&$L$5,Bogføring!D:D,\"=\"&A77)","v":0},{"$f":"IF(N77=0,\"\",SUMIFS(Bogføring!A:A,Bogføring!E:E,\"=\"&$N$5,Bogføring!D:D,\"=\"&A77))","v":""},{"$f":"SUMIFS(Bogføring!H:H,Bogføring!E:E,\"=\"&$N$5,Bogføring!D:D,\"=\"&A77)","v":0},{"$f":"IF(N77=0,\"\",SUMIFS(Bogføring!$A:$A,Bogføring!$E:$E,\"=\"&$P$5,Bogføring!$D:$D,\"=\"&A77))","v":""},{"$f":"SUMIFS(Bogføring!$H:$H,Bogføring!$E:$E,\"=\"&$P$5,Bogføring!$D:$D,\"=\"&A77)","v":0}]
[74,"Lotte Roch","Strøbyvej 2",3720,"Åkirkeby",21912063,"lotte@roch.dk",null,null,74,{"$f":"IF(L78=0,\"\",INDEX(Bogføring!$A:$A,MATCH(Tabel2[[#This Row],[Medl.nr. :]],Bogføring!$D:$D,0),0))","v":""},{"$f":"SUMIFS(Bogføring!H:H,Bogføring!E:E,\"=\"&$L$5,Bogføring!D:D,\"=\"&A78)","v":0},{"$f":"IF(N78=0,\"\",SUMIFS(Bogføring!A:A,Bogføring!E:E,\"=\"&$N$5,Bogføring!D:D,\"=\"&A78))","v":""},{"$f":"SUMIFS(Bogføring!H:H,Bogføring!E:E,\"=\"&$N$5,Bogføring!D:D,\"=\"&A78)","v":0},{"$f":"IF(N78=0,\"\",SUMIFS(Bogføring!$A:$A,Bogføring!$E:$E,\"=\"&$P$5,Bogføring!$D:$D,\"=\"&A78))","v":""},{"$f":"SUMIFS(Bogføring!$H:$H,Bogføring!$E:$E,\"=\"&$P$5,Bogføring!$D:$D,\"=\"&A78)","v":0}]
[75,"Niels-Viggo Stage","Kapelvej 53",3700,"Rønne",56914825,"niels-viggostage@mail.dk",null,null,75,{"$f":"IF(L79=0,\"\",INDEX(Bogføring!$A:$A,MATCH(Tabel2[[#This Row],[Medl.nr. :]],Bogføring!$D:$D,0),0))","v":""},{"$f":"SUMIFS(Bogføring!H:H,Bogføring!E:E,\"=\"&$L$5,Bogføring!D:D,\"=\"&A79)","v":0},{"$f":"IF(N79=0,\"\",SUMIFS(Bogføring!A:A,Bogføring!E:E,\"=\"&$N$5,Bogføring!D:D,\"=\"&A79))","v":""},{"$f":"SUMIFS(Bogføring!H:H,Bogføring!E:E,\"=\"&$N$5,Bogføring!D:D,\"=\"&A79)","v":0},{"$f":"IF(N79=0,\"\",SUMIFS(Bogføring!$A:$A,Bogføring!$E:$E,\"=\"&$P$5,Bogføring!$D:$D,\"=\"&A79))","v":""},{"$f":"SUMIFS(Bogføring!$H:$H,Bogføring!$E:$E,\"=\"&$P$5,Bogføring!$D:$D,\"=\"&A79)","v":0}]
[76,"Søren Peter Elleby","Slappegade 12",3700,"Rønne",56951086,"s.p.elleby@hotmail.com",null,"Bet. af Hanne Merete Elleby, Solnavej 23,St tv,2860 Søborg",76,{"$f":"IF(L80=0,\"\",INDEX(Bogføring!$A:$A,MATCH(Tabel2[[#This Row],[Medl.nr. :]],Bogføring!$D:$D,0),0))","v":""},{"$f":"SUMIFS(Bogføring!H:H,Bogføring!E:E,\"=\"&$L$5,Bogføring!D:D,\"=\"&A80)","v":0},{"$f":"IF(N80=0,\"\",SUMIFS(Bogføring!A:A,Bogføring!E:E,\"=\"&$N$5,Bogføring!D:D,\"=\"&A80))","v":""},{"$f":"SUMIFS(Bogføring!H:H,Bogføring!E:E,\"=\"&$N$5,Bogføring!D:D,\"=\"&A80)","v":0},{"$f":"IF(N80=0,\"\",SUMIFS(Bogføring!$A:$A,Bogføring!$E:$E,\"=\"&$P$5,Bogføring!$D:$D,\"=\"&A80))","v":""},{"$f":"SUMIFS(Bogføring!$H:$H,Bogføring!$E:$E,\"=\"&$P$5,Bogføring!$D:$D,\"=\"&A80)","v":0}]
[77,"Jørgen Christian Espersen","Peter Ipsensvej 49",3700,"Rønne",24436630,"espersen@piv49.dk",null,null,77,{"$f":"IF(L81=0,\"\",INDEX(Bogføring!$A:$A,MATCH(Tabel2[[#This Row],[Medl.nr. :]],Bogføring!$D:$D,0),0))","v":""},{"$f":"SUMIFS(Bogføring!H:H,Bogføring!E:E,\"=\"&$L$5,Bogføring!D:D,\"=\"&A81)","v":0},{"$f":"IF(N81=0,\"\",SUMIFS(Bogføring!A:A,Bogføring!E:E,\"=\"&$N$5,Bogføring!D:D,\"=\"&A81))","v":""},{"$f":"SUMIFS(Bogføring!H:H,Bogføring!E:E,\"=\"&$N$5,Bogføring!D:D,\"=\"&A81)","v":0},{"$f":"IF(N81=0,\"\",SUMIFS(Bogføring!$A:$A,Bogføring!$E:$E,\"=\"&$P$5,Bogføring!$D:$D,\"=\"&A81))","v":""},{"$f":"SUMIFS(Bogføring!$H:$H,Bogføring!$E:$E,\"=\"&$P$5,Bogføring!$D:$D,\"=\"&A81)","v":0}]
[78,"Henning Nielsen","Gammelvældevej 1 A, Østerlars",3760,"Gudhjem",23245589,"hnielsen293@gmail.com",null,null,78,{"$f":"IF(L82=0,\"\",INDEX(Bogføring!$A:$A,MATCH(Tabel2[[#This Row],[Medl.nr. :]],Bogføring!$D:$D,0),0))","v":""},{"$f":"SUMIFS(Bogføring!H:H,Bogføring!E:E,\"=\"&$L$5,Bogføring!D:D,\"=\"&A82)","v":0},{"$f":"IF(N82=0,\"\",SUMIFS(Bogføring!A:A,Bogføring!E:E,\"=\"&$N$5,Bogføring!D:D,\"=\"&A82))","v":""},{"$f":"SUMIFS(Bogføring!H:H,Bogføring!E:E,\"=\"&$N$5,Bogføring!D:D,\"=\"&A82)","v":0},{"$f":"IF(N82=0,\"\",SUMIFS(Bogføring!$A:$A,Bogføring!$E:$E,\"=\"&$P$5,Bogføring!$D:$D,\"=\"&A82))","v":""},{"$f":"SUMIFS(Bogføring!$H:$H,Bogføring!$E:$E,\"=\"&$P$5,Bogføring!$D:$D,\"=\"&A82)","v":0}]
[79,"Jørn Uffe Hansen","Krakvej 7, Rutsker",3790,"Hasle",30119065,"j.u.hansen@mail.dk",null,null,79,{"$f":"IF(L83=0,\"\",INDEX(Bogføring!$A:$A,MATCH(Tabel2[[#This Row],[Medl.nr. :]],Bogføring!$D:$D,0),0))","v":""},{"$f":"SUMIFS(Bogføring!H:H,Bogføring!E:E,\"=\"&$L$5,Bogføring!D:D,\"=\"&A83)","v":0},{"$f":"IF(N83=0,\"\",SUMIFS(Bogføring!A:A,Bogføring!E:E,\"=\"&$N$5,Bogføring!D:D,\"=\"&A83))","v":""},{"$f":"SUMIFS(Bogføring!H:H,Bogføring!E:E,\"=\"&$N$5,Bogføring!D:D,\"=\"&A83)","v":0},{"$f":"IF(N83=0,\"\",SUMIFS(Bogføring!$A:$A,Bogføring!$E:$E,\"=\"&$P$5,Bogføring!$D:$D,\"=\"&A83))","v":""},{"$f":"SUMIFS(Bogføring!$H:$H,Bogføring!$E:$E,\"=\"&$P$5,Bogføring!$D:$D,\"=\"&A83)","v":0}]
[80,"Georg Wibe Nielsen","Rønnevej 109",3700,"Rønne",56972146,"geni2@outlook.dk ",null,null,80,{"$f":"IF(L84=0,\"\",INDEX(Bogføring!$A:$A,MATCH(Tabel2[[#This Row],[Medl.nr. :]],Bogføring!$D:$D,0),0))","v":""},{"$f":"SUMIFS(Bogføring!H:H,Bogføring!E:E,\"=\"&$L$5,Bogføring!D:D,\"=\"&A84)","v":0},{"$f":"IF(N84=0,\"\",SUMIFS(Bogføring!A:A,Bogføring!E:E,\"=\"&$N$5,Bogføring!D:D,\"=\"&A84))","v":""},{"$f":"SUMIFS(Bogføring!H:H,Bogføring!E:E,\"=\"&$N$5,Bogføring!D:D,\"=\"&A84)","v":0},{"$f":"IF(N84=0,\"\",SUMIFS(Bogføring!$A:$A,Bogføring!$E:$E,\"=\"&$P$5,Bogføring!$D:$D,\"=\"&A84))","v":""},{"$f":"SUMIFS(Bogføring!$H:$H,Bogføring!$E:$E,\"=\"&$P$5,Bogføring!$D:$D,\"=\"&A84)","v":0}]
[81,"Jørn Lund","St. Torvegade 62",3700,"Rønne",40282002,"jorn.lund.ronne@gmail.com",null,null,81,{"$f":"IF(L85=0,\"\",INDEX(Bogføring!$A:$A,MATCH(Tabel2[[#This Row],[Medl.nr. :]],Bogføring!$D:$D,0),0))","v":""},{"$f":"SUMIFS(Bogføring!H:H,Bogføring!E:E,\"=\"&$L$5,Bogføring!D:D,\"=\"&A85)","v":0},{"$f":"IF(N85=0,\"\",SUMIFS(Bogføring!A:A,Bogføring!E:E,\"=\"&$N$5,Bogføring!D:D,\"=\"&A85))","v":""},{"$f":"SUMIFS(Bogføring!H:H,Bogføring!E:E,\"=\"&$N$5,Bogføring!D:D,\"=\"&A85)","v":0},{"$f":"IF(N85=0,\"\",SUMIFS(Bogføring!$A:$A,Bogføring!$E:$E,\"=\"&$P$5,Bogføring!$D:$D,\"=\"&A85))","v":""},{"$f":"SUMIFS(Bogføring!$H:$H,Bogføring!$E:$E,\"=\"&$P$5,Bogføring!$D:$D,\"=\"&A85)","v":0}]
[82,"Jan og Inge Grete Gulstad","Sveasvej 28",3700,"Rønne",29435783,"janinge@youmail.dk",null,null,82,{"$f":"IF(L86=0,\"\",INDEX(Bogføring!$A:$A,MATCH(Tabel2[[#This Row],[Medl.nr. :]],Bogføring!$D:$D,0),0))","v":""},{"$f":"SUMIFS(Bogføring!H:H,Bogføring!E:E,\"=\"&$L$5,Bogføring!D:D,\"=\"&A86)","v":0},{"$f":"IF(N86=0,\"\",SUMIFS(Bogføring!A:A,Bogføring!E:E,\"=\"&$N$5,Bogføring!D:D,\"=\"&A86))","v":""},{"$f":"SUMIFS(Bogføring!H:H,Bogføring!E:E,\"=\"&$N$5,Bogføring!D:D,\"=\"&A86)","v":0},{"$f":"IF(N86=0,\"\",SUMIFS(Bogføring!$A:$A,Bogføring!$E:$E,\"=\"&$P$5,Bogføring!$D:$D,\"=\"&A86))","v":""},{"$f":"SUMIFS(Bogføring!$H:$H,Bogføring!$E:$E,\"=\"&$P$5,Bogføring!$D:$D,\"=\"&A86)","v":0}]
[83,"Pia Thykjær & Ole Gerhard Jørgensen","Blemmelyngvejen 12, Nylars",3700,"Rønne",24455947,"pjot@mail.dk",null,null,83,{"$f":"IF(L87=0,\"\",INDEX(Bogføring!$A:$A,MATCH(Tabel2[[#This Row],[Medl.nr. :]],Bogføring!$D:$D,0),0))","v":""},{"$f":"SUMIFS(Bogføring!H:H,Bogføring!E:E,\"=\"&$L$5,Bogføring!D:D,\"=\"&A87)","v":0},{"$f":"IF(N87=0,\"\",SUMIFS(Bogføring!A:A,Bogføring!E:E,\"=\"&$N$5,Bogføring!D:D,\"=\"&A87))","v":""},{"$f":"SUMIFS(Bogføring!H:H,Bogføring!E:E,\"=\"&$N$5,Bogføring!D:D,\"=\"&A87)","v":0},{"$f":"IF(N87=0,\"\",SUMIFS(Bogføring!$A:$A,Bogføring!$E:$E,\"=\"&$P$5,Bogføring!$D:$D,\"=\"&A87))","v":""},{"$f":"SUMIFS(Bogføring!$H:$H,Bogføring!$E:$E,\"=\"&$P$5,Bogføring!$D:$D,\"=\"&A87)","v":0}]
[84,"Per Loumand","Stationsvej 72, Pjedsted",7000,"Frederecia",27777890,"Per@spanensbjerg-loumand.dk",2019,null,84,{"$f":"IF(L88=0,\"\",INDEX(Bogføring!$A:$A,MATCH(Tabel2[[#This Row],[Medl.nr. :]],Bogføring!$D:$D,0),0))","v":""},{"$f":"SUMIFS(Bogføring!H:H,Bogføring!E:E,\"=\"&$L$5,Bogføring!D:D,\"=\"&A88)","v":0},{"$f":"IF(N88=0,\"\",SUMIFS(Bogføring!A:A,Bogføring!E:E,\"=\"&$N$5,Bogføring!D:D,\"=\"&A88))","v":""},{"$f":"SUMIFS(Bogføring!H:H,Bogføring!E:E,\"=\"&$N$5,Bogføring!D:D,\"=\"&A88)","v":0},{"$f":"IF(N88=0,\"\",SUMIFS(Bogføring!$A:$A,Bogføring!$E:$E,\"=\"&$P$5,Bogføring!$D:$D,\"=\"&A88))","v":""},{"$f":"SUMIFS(Bogføring!$H:$H,Bogføring!$E:$E,\"=\"&$P$5,Bogføring!$D:$D,\"=\"&A88)","v":0}]
[85,"Bente Hansen","Morrevej 14",7500,"Holstebro",30428102,"bh.fjt@fibermail.dk ",2019,null,85,{"$f":"IF(L89=0,\"\",INDEX(Bogføring!$A:$A,MATCH(Tabel2[[#This Row],[Medl.nr. :]],Bogføring!$D:$D,0),0))","v":""},{"$f":"SUMIFS(Bogføring!H:H,Bogføring!E:E,\"=\"&$L$5,Bogføring!D:D,\"=\"&A89)","v":0},{"$f":"IF(N89=0,\"\",SUMIFS(Bogføring!A:A,Bogføring!E:E,\"=\"&$N$5,Bogføring!D:D,\"=\"&A89))","v":""},{"$f":"SUMIFS(Bogføring!H:H,Bogføring!E:E,\"=\"&$N$5,Bogføring!D:D,\"=\"&A89)","v":0},{"$f":"IF(N89=0,\"\",SUMIFS(Bogføring!$A:$A,Bogføring!$E:$E,\"=\"&$P$5,Bogføring!$D:$D,\"=\"&A89))","v":""},{"$f":"SUMIFS(Bogføring!$H:$H,Bogføring!$E:$E,\"=\"&$P$5,Bogføring!$D:$D,\"=\"&A89)","v":0}]
[86,"Hans Jacob Rømer","Fabriksvej 30",3782,"Klemensker",56966024,"hansjacobroemer@gmail.com",null,null,86,{"$f":"IF(L90=0,\"\",INDEX(Bogføring!$A:$A,MATCH(Tabel2[[#This Row],[Medl.nr. :]],Bogføring!$D:$D,0),0))","v":""},{"$f":"SUMIFS(Bogføring!H:H,Bogføring!E:E,\"=\"&$L$5,Bogføring!D:D,\"=\"&A90)","v":0},{"$f":"IF(N90=0,\"\",SUMIFS(Bogføring!A:A,Bogføring!E:E,\"=\"&$N$5,Bogføring!D:D,\"=\"&A90))","v":""},{"$f":"SUMIFS(Bogføring!H:H,Bogføring!E:E,\"=\"&$N$5,Bogføring!D:D,\"=\"&A90)","v":0},{"$f":"IF(N90=0,\"\",SUMIFS(Bogføring!$A:$A,Bogføring!$E:$E,\"=\"&$P$5,Bogføring!$D:$D,\"=\"&A90))","v":""},{"$f":"SUMIFS(Bogføring!$H:$H,Bogføring!$E:$E,\"=\"&$P$5,Bogføring!$D:$D,\"=\"&A90)","v":0}]
[87,"Jens og Anne-Lise Aagesen","Egeløkken 11",3700,"Rønne",51895289,"jens.aagesen@gmail.com ",null,null,87,{"$f":"IF(L91=0,\"\",INDEX(Bogføring!$A:$A,MATCH(Tabel2[[#This Row],[Medl.nr. :]],Bogføring!$D:$D,0),0))","v":""},{"$f":"SUMIFS(Bogføring!H:H,Bogføring!E:E,\"=\"&$L$5,Bogføring!D:D,\"=\"&A91)","v":0},{"$f":"IF(N91=0,\"\",SUMIFS(Bogføring!A:A,Bogføring!E:E,\"=\"&$N$5,Bogføring!D:D,\"=\"&A91))","v":""},{"$f":"SUMIFS(Bogføring!H:H,Bogføring!E:E,\"=\"&$N$5,Bogføring!D:D,\"=\"&A91)","v":0},{"$f":"IF(N91=0,\"\",SUMIFS(Bogføring!$A:$A,Bogføring!$E:$E,\"=\"&$P$5,Bogføring!$D:$D,\"=\"&A91))","v":""},{"$f":"SUMIFS(Bogføring!$H:$H,Bogføring!$E:$E,\"=\"&$P$5,Bogføring!$D:$D,\"=\"&A91)","v":0}]
[88,"S. Aa. Olsen","Dampmøllegade 5B",3700,"Rønne",30265597,"svaaolsen@godmail.dk ",null,null,88,{"$f":"IF(L92=0,\"\",INDEX(Bogføring!$A:$A,MATCH(Tabel2[[#This Row],[Medl.nr. :]],Bogføring!$D:$D,0),0))","v":""},{"$f":"SUMIFS(Bogføring!H:H,Bogføring!E:E,\"=\"&$L$5,Bogføring!D:D,\"=\"&A92)","v":0},{"$f":"IF(N92=0,\"\",SUMIFS(Bogføring!A:A,Bogføring!E:E,\"=\"&$N$5,Bogføring!D:D,\"=\"&A92))","v":""},{"$f":"SUMIFS(Bogføring!H:H,Bogføring!E:E,\"=\"&$N$5,Bogføring!D:D,\"=\"&A92)","v":0},{"$f":"IF(N92=0,\"\",SUMIFS(Bogføring!$A:$A,Bogføring!$E:$E,\"=\"&$P$5,Bogføring!$D:$D,\"=\"&A92))","v":""},{"$f":"SUMIFS(Bogføring!$H:$H,Bogføring!$E:$E,\"=\"&$P$5,Bogføring!$D:$D,\"=\"&A92)","v":0}]
[89,"Claus Paulsen","Syrenvej 5",3700,"Rønne",30715477,"birgit_claus@paulsen.mail.dk",null,null,89,{"$f":"IF(L93=0,\"\",INDEX(Bogføring!$A:$A,MATCH(Tabel2[[#This Row],[Medl.nr. :]],Bogføring!$D:$D,0),0))","v":""},{"$f":"SUMIFS(Bogføring!H:H,Bogføring!E:E,\"=\"&$L$5,Bogføring!D:D,\"=\"&A93)","v":0},{"$f":"IF(N93=0,\"\",SUMIFS(Bogføring!A:A,Bogføring!E:E,\"=\"&$N$5,Bogføring!D:D,\"=\"&A93))","v":""},{"$f":"SUMIFS(Bogføring!H:H,Bogføring!E:E,\"=\"&$N$5,Bogføring!D:D,\"=\"&A93)","v":0},{"$f":"IF(N93=0,\"\",SUMIFS(Bogføring!$A:$A,Bogføring!$E:$E,\"=\"&$P$5,Bogføring!$D:$D,\"=\"&A93))","v":""},{"$f":"SUMIFS(Bogføring!$H:$H,Bogføring!$E:$E,\"=\"&$P$5,Bogføring!$D:$D,\"=\"&A93)","v":0}]
[90,"Dan Olsen","Ølenevejen 58",3720,"Åkirkeby",29421873,"d-olsen8268@gmail.com",null,null,90,{"$f":"IF(L94=0,\"\",INDEX(Bogføring!$A:$A,MATCH(Tabel2[[#This Row],[Medl.nr. :]],Bogføring!$D:$D,0),0))","v":""},{"$f":"SUMIFS(Bogføring!H:H,Bogføring!E:E,\"=\"&$L$5,Bogføring!D:D,\"=\"&A94)","v":0},{"$f":"IF(N94=0,\"\",SUMIFS(Bogføring!A:A,Bogføring!E:E,\"=\"&$N$5,Bogføring!D:D,\"=\"&A94))","v":""},{"$f":"SUMIFS(Bogføring!H:H,Bogføring!E:E,\"=\"&$N$5,Bogføring!D:D,\"=\"&A94)","v":0},{"$f":"IF(N94=0,\"\",SUMIFS(Bogføring!$A:$A,Bogføring!$E:$E,\"=\"&$P$5,Bogføring!$D:$D,\"=\"&A94))","v":""},{"$f":"SUMIFS(Bogføring!$H:$H,Bogføring!$E:$E,\"=\"&$P$5,Bogføring!$D:$D,\"=\"&A94)","v":0}]
[91,"Sven Haugaard Jørgensen","Timianløkken 10",3700,"Rønne",20185984,"jemsj@youmail.dk",null,null,91,{"$f":"IF(L95=0,\"\",INDEX(Bogføring!$A:$A,MATCH(Tabel2[[#This Row],[Medl.nr. :]],Bogføring!$D:$D,0),0))","v":""},{"$f":"SUMIFS(Bogføring!H:H,Bogføring!E:E,\"=\"&$L$5,Bogføring!D:D,\"=\"&A95)","v":0},{"$f":"IF(N95=0,\"\",SUMIFS(Bogføring!A:A,Bogføring!E:E,\"=\"&$N$5,Bogføring!D:D,\"=\"&A95))","v":""},{"$f":"SUMIFS(Bogføring!H:H,Bogføring!E:E,\"=\"&$N$5,Bogføring!D:D,\"=\"&A95)","v":0},{"$f":"IF(N95=0,\"\",SUMIFS(Bogføring!$A:$A,Bogføring!$E:$E,\"=\"&$P$5,Bogføring!$D:$D,\"=\"&A95))","v":""},{"$f":"SUMIFS(Bogføring!$H:$H,Bogføring!$E:$E,\"=\"&$P$5,Bogføring!$D:$D,\"=\"&A95)","v":0}]
[92,"Ole Kock-Jensen","Skovløkken 8",3720,"Åkirkeby",21458148,"ole.kock-jensen@mail.dk",null,null,92,{"$f":"IF(L96=0,\"\",INDEX(Bogføring!$A:$A,MATCH(Tabel2[[#This Row],[Medl.nr. :]],Bogføring!$D:$D,0),0))","v":""},{"$f":"SUMIFS(Bogføring!H:H,Bogføring!E:E,\"=\"&$L$5,Bogføring!D:D,\"=\"&A96)","v":0},{"$f":"IF(N96=0,\"\",SUMIFS(Bogføring!A:A,Bogføring!E:E,\"=\"&$N$5,Bogføring!D:D,\"=\"&A96))","v":""},{"$f":"SUMIFS(Bogføring!H:H,Bogføring!E:E,\"=\"&$N$5,Bogføring!D:D,\"=\"&A96)","v":0},{"$f":"IF(N96=0,\"\",SUMIFS(Bogføring!$A:$A,Bogføring!$E:$E,\"=\"&$P$5,Bogføring!$D:$D,\"=\"&A96))","v":""},{"$f":"SUMIFS(Bogføring!$H:$H,Bogføring!$E:$E,\"=\"&$P$5,Bogføring!$D:$D,\"=\"&A96)","v":0}]
[93,"Thomas Thors","Tyttebærløkken 4",3700,"Rønne",56951349,"thomas.thors@live.dk",null,null,93,{"$f":"IF(L97=0,\"\",INDEX(Bogføring!$A:$A,MATCH(Tabel2[[#This Row],[Medl.nr. :]],Bogføring!$D:$D,0),0))","v":""},{"$f":"SUMIFS(Bogføring!H:H,Bogføring!E:E,\"=\"&$L$5,Bogføring!D:D,\"=\"&A97)","v":0},{"$f":"IF(N97=0,\"\",SUMIFS(Bogføring!A:A,Bogføring!E:E,\"=\"&$N$5,Bogføring!D:D,\"=\"&A97))","v":""},{"$f":"SUMIFS(Bogføring!H:H,Bogføring!E:E,\"=\"&$N$5,Bogføring!D:D,\"=\"&A97)","v":0},{"$f":"IF(N97=0,\"\",SUMIFS(Bogføring!$A:$A,Bogføring!$E:$E,\"=\"&$P$5,Bogføring!$D:$D,\"=\"&A97))","v":""},{"$f":"SUMIFS(Bogføring!$H:$H,Bogføring!$E:$E,\"=\"&$P$5,Bogføring!$D:$D,\"=\"&A97)","v":0}]
[94,"Frank Kofoed","Engvej 1",3700,"Rønne",61339036,"engvej1@live.dk",null,null,94,{"$f":"IF(L98=0,\"\",INDEX(Bogføring!$A:$A,MATCH(Tabel2[[#This Row],[Medl.nr. :]],Bogføring!$D:$D,0),0))","v":""},{"$f":"SUMIFS(Bogføring!H:H,Bogføring!E:E,\"=\"&$L$5,Bogføring!D:D,\"=\"&A98)","v":0},{"$f":"IF(N98=0,\"\",SUMIFS(Bogføring!A:A,Bogføring!E:E,\"=\"&$N$5,Bogføring!D:D,\"=\"&A98))","v":""},{"$f":"SUMIFS(Bogføring!H:H,Bogføring!E:E,\"=\"&$N$5,Bogføring!D:D,\"=\"&A98)","v":0},{"$f":"IF(N98=0,\"\",SUMIFS(Bogføring!$A:$A,Bogføring!$E:$E,\"=\"&$P$5,Bogføring!$D:$D,\"=\"&A98))","v":""},{"$f":"SUMIFS(Bogføring!$H:$H,Bogføring!$E:$E,\"=\"&$P$5,Bogføring!$D:$D,\"=\"&A98)","v":0}]
[95,"Per Ole Westall","Rønnebær Allé 32",3000,"Helsingør",25411343,"westall@it.dk",null,null,95,{"$f":"IF(L99=0,\"\",INDEX(Bogføring!$A:$A,MATCH(Tabel2[[#This Row],[Medl.nr. :]],Bogføring!$D:$D,0),0))","v":""},{"$f":"SUMIFS(Bogføring!H:H,Bogføring!E:E,\"=\"&$L$5,Bogføring!D:D,\"=\"&A99)","v":0},{"$f":"IF(N99=0,\"\",SUMIFS(Bogføring!A:A,Bogføring!E:E,\"=\"&$N$5,Bogføring!D:D,\"=\"&A99))","v":""},{"$f":"SUMIFS(Bogføring!H:H,Bogføring!E:E,\"=\"&$N$5,Bogføring!D:D,\"=\"&A99)","v":0},{"$f":"IF(N99=0,\"\",SUMIFS(Bogføring!$A:$A,Bogføring!$E:$E,\"=\"&$P$5,Bogføring!$D:$D,\"=\"&A99))","v":""},{"$f":"SUMIFS(Bogføring!$H:$H,Bogføring!$E:$E,\"=\"&$P$5,Bogføring!$D:$D,\"=\"&A99)","v":0}]
[96,"Flemming Thorsen","Præstevej 65 c",4700,"Næstved",26821044,"thormark27@gmail.com",null,null,96,{"$f":"IF(L100=0,\"\",INDEX(Bogføring!$A:$A,MATCH(Tabel2[[#This Row],[Medl.nr. :]],Bogføring!$D:$D,0),0))","v":""},{"$f":"SUMIFS(Bogføring!H:H,Bogføring!E:E,\"=\"&$L$5,Bogføring!D:D,\"=\"&A100)","v":0},{"$f":"IF(N100=0,\"\",SUMIFS(Bogføring!A:A,Bogføring!E:E,\"=\"&$N$5,Bogføring!D:D,\"=\"&A100))","v":""},{"$f":"SUMIFS(Bogføring!H:H,Bogføring!E:E,\"=\"&$N$5,Bogføring!D:D,\"=\"&A100)","v":0},{"$f":"IF(N100=0,\"\",SUMIFS(Bogføring!$A:$A,Bogføring!$E:$E,\"=\"&$P$5,Bogføring!$D:$D,\"=\"&A100))","v":""},{"$f":"SUMIFS(Bogføring!$H:$H,Bogføring!$E:$E,\"=\"&$P$5,Bogføring!$D:$D,\"=\"&A100)","v":0}]
[97,"Bettina Pedersen","Sursænkevej 1",3700,"Rønne",23477109,"pedersen@outlook.dk",2019,null,97,{"$f":"IF(L101=0,\"\",INDEX(Bogføring!$A:$A,MATCH(Tabel2[[#This Row],[Medl.nr. :]],Bogføring!$D:$D,0),0))","v":""},{"$f":"SUMIFS(Bogføring!H:H,Bogføring!E:E,\"=\"&$L$5,Bogføring!D:D,\"=\"&A101)","v":0},{"$f":"IF(N101=0,\"\",SUMIFS(Bogføring!A:A,Bogføring!E:E,\"=\"&$N$5,Bogføring!D:D,\"=\"&A101))","v":""},{"$f":"SUMIFS(Bogføring!H:H,Bogføring!E:E,\"=\"&$N$5,Bogføring!D:D,\"=\"&A101)","v":0},{"$f":"IF(N101=0,\"\",SUMIFS(Bogføring!$A:$A,Bogføring!$E:$E,\"=\"&$P$5,Bogføring!$D:$D,\"=\"&A101))","v":""},{"$f":"SUMIFS(Bogføring!$H:$H,Bogføring!$E:$E,\"=\"&$P$5,Bogføring!$D:$D,\"=\"&A101)","v":0}]
[98,"Gitte Haahr","Jerndorffsvænget",7000,"Frederecia",30115670,"haahr.gitte@gmail.com",2019,null,{"$f":"IF(A102=\"\",\"\",A102)","v":98},{"$f":"IF(L102=0,\"\",INDEX(Bogføring!$A:$A,MATCH(Tabel2[[#This Row],[Medl.nr. :]],Bogføring!$D:$D,0),0))","v":""},{"$f":"SUMIFS(Bogføring!H:H,Bogføring!E:E,\"=\"&$L$5,Bogføring!D:D,\"=\"&A102)","v":0},{"$f":"IF(N102=0,\"\",SUMIFS(Bogføring!A:A,Bogføring!E:E,\"=\"&$N$5,Bogføring!D:D,\"=\"&A102))","v":""},{"$f":"SUMIFS(Bogføring!H:H,Bogføring!E:E,\"=\"&$N$5,Bogføring!D:D,\"=\"&A102)","v":0},{"$f":"IF(N102=0,\"\",SUMIFS(Bogføring!$A:$A,Bogføring!$E:$E,\"=\"&$P$5,Bogføring!$D:$D,\"=\"&A102))","v":""},{"$f":"SUMIFS(Bogføring!$H:$H,Bogføring!$E:$E,\"=\"&$P$5,Bogføring!$D:$D,\"=\"&A102)","v":0}]
[99,"Jørn Kofod","Gadekæret 9",3720,"Åkirkeby",21391507,"jekofod4501@gmail.com",null,null,99,{"$f":"IF(L103=0,\"\",INDEX(Bogføring!$A:$A,MATCH(Tabel2[[#This Row],[Medl.nr. :]],Bogføring!$D:$D,0),0))","v":""},{"$f":"SUMIFS(Bogføring!H:H,Bogføring!E:E,\"=\"&$L$5,Bogføring!D:D,\"=\"&A103)","v":0},{"$f":"IF(N103=0,\"\",SUMIFS(Bogføring!A:A,Bogføring!E:E,\"=\"&$N$5,Bogføring!D:D,\"=\"&A103))","v":""},{"$f":"SUMIFS(Bogføring!H:H,Bogføring!E:E,\"=\"&$N$5,Bogføring!D:D,\"=\"&A103)","v":0},{"$f":"IF(N103=0,\"\",SUMIFS(Bogføring!$A:$A,Bogføring!$E:$E,\"=\"&$P$5,Bogføring!$D:$D,\"=\"&A103))","v":""},{"$f":"SUMIFS(Bogføring!$H:$H,Bogføring!$E:$E,\"=\"&$P$5,Bogføring!$D:$D,\"=\"&A103)","v":0}]
[100,"Kurt Friedrich Peters","Søndre Allé 30",3700,"Rønne",56958686,"kurt.peters@dadelnet.dk",null,null,100,{"$f":"IF(L104=0,\"\",INDEX(Bogføring!$A:$A,MATCH(Tabel2[[#This Row],[Medl.nr. :]],Bogføring!$D:$D,0),0))","v":""},{"$f":"SUMIFS(Bogføring!H:H,Bogføring!E:E,\"=\"&$L$5,Bogføring!D:D,\"=\"&A104)","v":0},{"$f":"IF(N104=0,\"\",SUMIFS(Bogføring!A:A,Bogføring!E:E,\"=\"&$N$5,Bogføring!D:D,\"=\"&A104))","v":""},{"$f":"SUMIFS(Bogføring!H:H,Bogføring!E:E,\"=\"&$N$5,Bogføring!D:D,\"=\"&A104)","v":0},{"$f":"IF(N104=0,\"\",SUMIFS(Bogføring!$A:$A,Bogføring!$E:$E,\"=\"&$P$5,Bogføring!$D:$D,\"=\"&A104))","v":""},{"$f":"SUMIFS(Bogføring!$H:$H,Bogføring!$E:$E,\"=\"&$P$5,Bogføring!$D:$D,\"=\"&A104)","v":0}]
[101,"Gunnar Kofoed","Lillegade 20",3700,"Rønne",51329941,"gunnar-kofoed@gmail.com",null,null,101,{"$f":"IF(L105=0,\"\",INDEX(Bogføring!$A:$A,MATCH(Tabel2[[#This Row],[Medl.nr. :]],Bogføring!$D:$D,0),0))","v":""},{"$f":"SUMIFS(Bogføring!H:H,Bogføring!E:E,\"=\"&$L$5,Bogføring!D:D,\"=\"&A105)","v":0},{"$f":"IF(N105=0,\"\",SUMIFS(Bogføring!A:A,Bogføring!E:E,\"=\"&$N$5,Bogføring!D:D,\"=\"&A105))","v":""},{"$f":"SUMIFS(Bogføring!H:H,Bogføring!E:E,\"=\"&$N$5,Bogføring!D:D,\"=\"&A105)","v":0},{"$f":"IF(N105=0,\"\",SUMIFS(Bogføring!$A:$A,Bogføring!$E:$E,\"=\"&$P$5,Bogføring!$D:$D,\"=\"&A105))","v":""},{"$f":"SUMIFS(Bogføring!$H:$H,Bogføring!$E:$E,\"=\"&$P$5,Bogføring!$D:$D,\"=\"&A105)","v":0}]
[102,"Mogens Christoffersen","Pingels Allé 70",3700,"Rønne",56951013,"mac@teliamail.dk",null,null,102,{"$f":"IF(L106=0,\"\",INDEX(Bogføring!$A:$A,MATCH(Tabel2[[#This Row],[Medl.nr. :]],Bogføring!$D:$D,0),0))","v":""},{"$f":"SUMIFS(Bogføring!H:H,Bogføring!E:E,\"=\"&$L$5,Bogføring!D:D,\"=\"&A106)","v":0},{"$f":"IF(N106=0,\"\",SUMIFS(Bogføring!A:A,Bogføring!E:E,\"=\"&$N$5,Bogføring!D:D,\"=\"&A106))","v":""},{"$f":"SUMIFS(Bogføring!H:H,Bogføring!E:E,\"=\"&$N$5,Bogføring!D:D,\"=\"&A106)","v":0},{"$f":"IF(N106=0,\"\",SUMIFS(Bogføring!$A:$A,Bogføring!$E:$E,\"=\"&$P$5,Bogføring!$D:$D,\"=\"&A106))","v":""},{"$f":"SUMIFS(Bogføring!$H:$H,Bogføring!$E:$E,\"=\"&$P$5,Bogføring!$D:$D,\"=\"&A106)","v":0}]
[103,"Kjeld E. Hansen","Torneværksvej 36",3700,"Rønne",56955076,"torn@hansen.mail.dk",null,null,103,{"$f":"IF(L107=0,\"\",INDEX(Bogføring!$A:$A,MATCH(Tabel2[[#This Row],[Medl.nr. :]],Bogføring!$D:$D,0),0))","v":""},{"$f":"SUMIFS(Bogføring!H:H,Bogføring!E:E,\"=\"&$L$5,Bogføring!D:D,\"=\"&A107)","v":0},{"$f":"IF(N107=0,\"\",SUMIFS(Bogføring!A:A,Bogføring!E:E,\"=\"&$N$5,Bogføring!D:D,\"=\"&A107))","v":""},{"$f":"SUMIFS(Bogføring!H:H,Bogføring!E:E,\"=\"&$N$5,Bogføring!D:D,\"=\"&A107)","v":0},{"$f":"IF(N107=0,\"\",SUMIFS(Bogføring!$A:$A,Bogføring!$E:$E,\"=\"&$P$5,Bogføring!$D:$D,\"=\"&A107))","v":""},{"$f":"SUMIFS(Bogføring!$H:$H,Bogføring!$E:$E,\"=\"&$P$5,Bogføring!$D:$D,\"=\"&A107)","v":0}]
[104,"Christian J. Duch","Borreshovedvej 5",4654,"Fakse Ladeplads",21220340,"christianduch@fakse-ladeplads.dk",null,null,104,{"$f":"IF(L108=0,\"\",INDEX(Bogføring!$A:$A,MATCH(Tabel2[[#This Row],[Medl.nr. :]],Bogføring!$D:$D,0),0))","v":""},{"$f":"SUMIFS(Bogføring!H:H,Bogføring!E:E,\"=\"&$L$5,Bogføring!D:D,\"=\"&A108)","v":0},{"$f":"IF(N108=0,\"\",SUMIFS(Bogføring!A:A,Bogføring!E:E,\"=\"&$N$5,Bogføring!D:D,\"=\"&A108))","v":""},{"$f":"SUMIFS(Bogføring!H:H,Bogføring!E:E,\"=\"&$N$5,Bogføring!D:D,\"=\"&A108)","v":0},{"$f":"IF(N108=0,\"\",SUMIFS(Bogføring!$A:$A,Bogføring!$E:$E,\"=\"&$P$5,Bogføring!$D:$D,\"=\"&A108))","v":""},{"$f":"SUMIFS(Bogføring!$H:$H,Bogføring!$E:$E,\"=\"&$P$5,Bogføring!$D:$D,\"=\"&A108)","v":0}]
[105,"Lauge Madsen","Østergade 19",4171,"Glumsø",57646877,"inge-lise@madsen.adsl.tdc.dk",null,null,105,{"$f":"IF(L109=0,\"\",INDEX(Bogføring!$A:$A,MATCH(Tabel2[[#This Row],[Medl.nr. :]],Bogføring!$D:$D,0),0))","v":""},{"$f":"SUMIFS(Bogføring!H:H,Bogføring!E:E,\"=\"&$L$5,Bogføring!D:D,\"=\"&A109)","v":0},{"$f":"IF(N109=0,\"\",SUMIFS(Bogføring!A:A,Bogføring!E:E,\"=\"&$N$5,Bogføring!D:D,\"=\"&A109))","v":""},{"$f":"SUMIFS(Bogføring!H:H,Bogføring!E:E,\"=\"&$N$5,Bogføring!D:D,\"=\"&A109)","v":0},{"$f":"IF(N109=0,\"\",SUMIFS(Bogføring!$A:$A,Bogføring!$E:$E,\"=\"&$P$5,Bogføring!$D:$D,\"=\"&A109))","v":""},{"$f":"SUMIFS(Bogføring!$H:$H,Bogføring!$E:$E,\"=\"&$P$5,Bogføring!$D:$D,\"=\"&A109)","v":0}]
[106,"Bjarne Lind","Strandvejen 140",3700,"Rønne",21750454,"b.lind@privat.dk",null,"Har betalt 2 gange, 31/3/20 - næste år",106,{"$f":"IF(L110=0,\"\",INDEX(Bogføring!$A:$A,MATCH(Tabel2[[#This Row],[Medl.nr. :]],Bogføring!$D:$D,0),0))","v":""},{"$f":"SUMIFS(Bogføring!H:H,Bogføring!E:E,\"=\"&$L$5,Bogføring!D:D,\"=\"&A110)","v":0},{"$f":"IF(N110=0,\"\",SUMIFS(Bogføring!A:A,Bogføring!E:E,\"=\"&$N$5,Bogføring!D:D,\"=\"&A110))","v":""},{"$f":"SUMIFS(Bogføring!H:H,Bogføring!E:E,\"=\"&$N$5,Bogføring!D:D,\"=\"&A110)","v":0},{"$f":"IF(N110=0,\"\",SUMIFS(Bogføring!$A:$A,Bogføring!$E:$E,\"=\"&$P$5,Bogføring!$D:$D,\"=\"&A110))","v":""},{"$f":"SUMIFS(Bogføring!$H:$H,Bogføring!$E:$E,\"=\"&$P$5,Bogføring!$D:$D,\"=\"&A110)","v":0}]
[107,"Vagn Risager","Ndr. Strandvej 73, Tejn",3770,"Allinge",21275950,"vri@mail.dk",null,"Har betalt 2 gange, 13/3/20 - næste år",107,{"$f":"IF(L111=0,\"\",INDEX(Bogføring!$A:$A,MATCH(Tabel2[[#This Row],[Medl.nr. :]],Bogføring!$D:$D,0),0))","v":""},{"$f":"SUMIFS(Bogføring!H:H,Bogføring!E:E,\"=\"&$L$5,Bogføring!D:D,\"=\"&A111)","v":0},{"$f":"IF(N111=0,\"\",SUMIFS(Bogføring!A:A,Bogføring!E:E,\"=\"&$N$5,Bogføring!D:D,\"=\"&A111))","v":""},{"$f":"SUMIFS(Bogføring!H:H,Bogføring!E:E,\"=\"&$N$5,Bogføring!D:D,\"=\"&A111)","v":0},{"$f":"IF(N111=0,\"\",SUMIFS(Bogføring!$A:$A,Bogføring!$E:$E,\"=\"&$P$5,Bogføring!$D:$D,\"=\"&A111))","v":""},{"$f":"SUMIFS(Bogføring!$H:$H,Bogføring!$E:$E,\"=\"&$P$5,Bogføring!$D:$D,\"=\"&A111)","v":0}]
[108,"Kornel L. Christiansen","Blykobbevej 26",3700,"Rønne",56952610,"jytte-kornel@post.tele.dk",null,null,108,{"$f":"IF(L112=0,\"\",INDEX(Bogføring!$A:$A,MATCH(Tabel2[[#This Row],[Medl.nr. :]],Bogføring!$D:$D,0),0))","v":""},{"$f":"SUMIFS(Bogføring!H:H,Bogføring!E:E,\"=\"&$L$5,Bogføring!D:D,\"=\"&A112)","v":0},{"$f":"IF(N112=0,\"\",SUMIFS(Bogføring!A:A,Bogføring!E:E,\"=\"&$N$5,Bogføring!D:D,\"=\"&A112))","v":""},{"$f":"SUMIFS(Bogføring!H:H,Bogføring!E:E,\"=\"&$N$5,Bogføring!D:D,\"=\"&A112)","v":0},{"$f":"IF(N112=0,\"\",SUMIFS(Bogføring!$A:$A,Bogføring!$E:$E,\"=\"&$P$5,Bogføring!$D:$D,\"=\"&A112))","v":""},{"$f":"SUMIFS(Bogføring!$H:$H,Bogføring!$E:$E,\"=\"&$P$5,Bogføring!$D:$D,\"=\"&A112)","v":0}]
[109,"Svend Rasmussen","Kjeldgårdsvej 8, Gl. Mollerup",7900,"Nykøbing Mors",20153735,"svendrasmussen@hotmail.com",2018,null,109,{"$f":"IF(L113=0,\"\",INDEX(Bogføring!$A:$A,MATCH(Tabel2[[#This Row],[Medl.nr. :]],Bogføring!$D:$D,0),0))","v":""},{"$f":"SUMIFS(Bogføring!H:H,Bogføring!E:E,\"=\"&$L$5,Bogføring!D:D,\"=\"&A113)","v":0},{"$f":"IF(N113=0,\"\",SUMIFS(Bogføring!A:A,Bogføring!E:E,\"=\"&$N$5,Bogføring!D:D,\"=\"&A113))","v":""},{"$f":"SUMIFS(Bogføring!H:H,Bogføring!E:E,\"=\"&$N$5,Bogføring!D:D,\"=\"&A113)","v":0},{"$f":"IF(N113=0,\"\",SUMIFS(Bogføring!$A:$A,Bogføring!$E:$E,\"=\"&$P$5,Bogføring!$D:$D,\"=\"&A113))","v":""},{"$f":"SUMIFS(Bogføring!$H:$H,Bogføring!$E:$E,\"=\"&$P$5,Bogføring!$D:$D,\"=\"&A113)","v":0}]
[110,"Kaj Grøn","Egeløkken 14",3700,"Rønne",56952592,"kgron@mail.dk",null,null,110,{"$f":"IF(L114=0,\"\",INDEX(Bogføring!$A:$A,MATCH(Tabel2[[#This Row],[Medl.nr. :]],Bogføring!$D:$D,0),0))","v":""},{"$f":"SUMIFS(Bogføring!H:H,Bogføring!E:E,\"=\"&$L$5,Bogføring!D:D,\"=\"&A114)","v":0},{"$f":"IF(N114=0,\"\",SUMIFS(Bogføring!A:A,Bogføring!E:E,\"=\"&$N$5,Bogføring!D:D,\"=\"&A114))","v":""},{"$f":"SUMIFS(Bogføring!H:H,Bogføring!E:E,\"=\"&$N$5,Bogføring!D:D,\"=\"&A114)","v":0},{"$f":"IF(N114=0,\"\",SUMIFS(Bogføring!$A:$A,Bogføring!$E:$E,\"=\"&$P$5,Bogføring!$D:$D,\"=\"&A114))","v":""},{"$f":"SUMIFS(Bogføring!$H:$H,Bogføring!$E:$E,\"=\"&$P$5,Bogføring!$D:$D,\"=\"&A114)","v":0}]
[111,"Carl Ilsøe","Kapelvej 15",3700,"Rønne",30181939,"carlilsoe@gmail.com",null,null,111,{"$f":"IF(L115=0,\"\",INDEX(Bogføring!$A:$A,MATCH(Tabel2[[#This Row],[Medl.nr. :]],Bogføring!$D:$D,0),0))","v":""},{"$f":"SUMIFS(Bogføring!H:H,Bogføring!E:E,\"=\"&$L$5,Bogføring!D:D,\"=\"&A115)","v":0},{"$f":"IF(N115=0,\"\",SUMIFS(Bogføring!A:A,Bogføring!E:E,\"=\"&$N$5,Bogføring!D:D,\"=\"&A115))","v":""},{"$f":"SUMIFS(Bogføring!H:H,Bogføring!E:E,\"=\"&$N$5,Bogføring!D:D,\"=\"&A115)","v":0},{"$f":"IF(N115=0,\"\",SUMIFS(Bogføring!$A:$A,Bogføring!$E:$E,\"=\"&$P$5,Bogføring!$D:$D,\"=\"&A115))","v":""},{"$f":"SUMIFS(Bogføring!$H:$H,Bogføring!$E:$E,\"=\"&$P$5,Bogføring!$D:$D,\"=\"&A115)","v":0}]
[112,"Nicolai Ilsted Bech","Teglporten 16",3460,"Birkerød",60777958,"ilsted.nb@gmail.com",2018,null,112,{"$f":"IF(L116=0,\"\",INDEX(Bogføring!$A:$A,MATCH(Tabel2[[#This Row],[Medl.nr. :]],Bogføring!$D:$D,0),0))","v":""},{"$f":"SUMIFS(Bogføring!H:H,Bogføring!E:E,\"=\"&$L$5,Bogføring!D:D,\"=\"&A116)","v":0},{"$f":"IF(N116=0,\"\",SUMIFS(Bogføring!A:A,Bogføring!E:E,\"=\"&$N$5,Bogføring!D:D,\"=\"&A116))","v":""},{"$f":"SUMIFS(Bogføring!H:H,Bogføring!E:E,\"=\"&$N$5,Bogføring!D:D,\"=\"&A116)","v":0},{"$f":"IF(N116=0,\"\",SUMIFS(Bogføring!$A:$A,Bogføring!$E:$E,\"=\"&$P$5,Bogføring!$D:$D,\"=\"&A116))","v":""},{"$f":"SUMIFS(Bogføring!$H:$H,Bogføring!$E:$E,\"=\"&$P$5,Bogføring!$D:$D,\"=\"&A116)","v":0}]
[113,"Marianne Thomsen Kjæmpe","Røglevænget 5",3450,"Allerød",null,"Marianne@kjoeller.dk",null,null,113,{"$f":"IF(L117=0,\"\",INDEX(Bogføring!$A:$A,MATCH(Tabel2[[#This Row],[Medl.nr. :]],Bogføring!$D:$D,0),0))","v":""},{"$f":"SUMIFS(Bogføring!H:H,Bogføring!E:E,\"=\"&$L$5,Bogføring!D:D,\"=\"&A117)","v":0},{"$f":"IF(N117=0,\"\",SUMIFS(Bogføring!A:A,Bogføring!E:E,\"=\"&$N$5,Bogføring!D:D,\"=\"&A117))","v":""},{"$f":"SUMIFS(Bogføring!H:H,Bogføring!E:E,\"=\"&$N$5,Bogføring!D:D,\"=\"&A117)","v":0},{"$f":"IF(N117=0,\"\",SUMIFS(Bogføring!$A:$A,Bogføring!$E:$E,\"=\"&$P$5,Bogføring!$D:$D,\"=\"&A117))","v":""},{"$f":"SUMIFS(Bogføring!$H:$H,Bogføring!$E:$E,\"=\"&$P$5,Bogføring!$D:$D,\"=\"&A117)","v":0}]
[114,"Henning Søby Andersen","Hedebovej 31",3700,"Rønne",24851642,"hsoebyandersen1961@gmail.com",null,null,114,{"$f":"IF(L118=0,\"\",INDEX(Bogføring!$A:$A,MATCH(Tabel2[[#This Row],[Medl.nr. :]],Bogføring!$D:$D,0),0))","v":""},{"$f":"SUMIFS(Bogføring!H:H,Bogføring!E:E,\"=\"&$L$5,Bogføring!D:D,\"=\"&A118)","v":0},{"$f":"IF(N118=0,\"\",SUMIFS(Bogføring!A:A,Bogføring!E:E,\"=\"&$N$5,Bogføring!D:D,\"=\"&A118))","v":""},{"$f":"SUMIFS(Bogføring!H:H,Bogføring!E:E,\"=\"&$N$5,Bogføring!D:D,\"=\"&A118)","v":0},{"$f":"IF(N118=0,\"\",SUMIFS(Bogføring!$A:$A,Bogføring!$E:$E,\"=\"&$P$5,Bogføring!$D:$D,\"=\"&A118))","v":""},{"$f":"SUMIFS(Bogføring!$H:$H,Bogføring!$E:$E,\"=\"&$P$5,Bogføring!$D:$D,\"=\"&A118)","v":0}]
[115,"Anders Koefoed Larsen","Kampeløkken 9",3770,"Allinge",40322002,"akl@sport.dk",null,null,115,{"$f":"IF(L119=0,\"\",INDEX(Bogføring!$A:$A,MATCH(Tabel2[[#This Row],[Medl.nr. :]],Bogføring!$D:$D,0),0))","v":""},{"$f":"SUMIFS(Bogføring!H:H,Bogføring!E:E,\"=\"&$L$5,Bogføring!D:D,\"=\"&A119)","v":0},{"$f":"IF(N119=0,\"\",SUMIFS(Bogføring!A:A,Bogføring!E:E,\"=\"&$N$5,Bogføring!D:D,\"=\"&A119))","v":""},{"$f":"SUMIFS(Bogføring!H:H,Bogføring!E:E,\"=\"&$N$5,Bogføring!D:D,\"=\"&A119)","v":0},{"$f":"IF(N119=0,\"\",SUMIFS(Bogføring!$A:$A,Bogføring!$E:$E,\"=\"&$P$5,Bogføring!$D:$D,\"=\"&A119))","v":""},{"$f":"SUMIFS(Bogføring!$H:$H,Bogføring!$E:$E,\"=\"&$P$5,Bogføring!$D:$D,\"=\"&A119)","v":0}]
[116,"Holger Fuglsang-Damgård","Pæretræsdalen 12",3700,"Rønne",23305594,"fuglsang@info.dk",null,null,116,{"$f":"IF(L120=0,\"\",INDEX(Bogføring!$A:$A,MATCH(Tabel2[[#This Row],[Medl.nr. :]],Bogføring!$D:$D,0),0))","v":""},{"$f":"SUMIFS(Bogføring!H:H,Bogføring!E:E,\"=\"&$L$5,Bogføring!D:D,\"=\"&A120)","v":0},{"$f":"IF(N120=0,\"\",SUMIFS(Bogføring!A:A,Bogføring!E:E,\"=\"&$N$5,Bogføring!D:D,\"=\"&A120))","v":""},{"$f":"SUMIFS(Bogføring!H:H,Bogføring!E:E,\"=\"&$N$5,Bogføring!D:D,\"=\"&A120)","v":0},{"$f":"IF(N120=0,\"\",SUMIFS(Bogføring!$A:$A,Bogføring!$E:$E,\"=\"&$P$5,Bogføring!$D:$D,\"=\"&A120))","v":""},{"$f":"SUMIFS(Bogføring!$H:$H,Bogføring!$E:$E,\"=\"&$P$5,Bogføring!$D:$D,\"=\"&A120)","v":0}]
[117,"Martin Kaltoft","Lille Madsegade 19",3700,"Rønne",40412349,"seattle@mail.tele.dk",null,"OBS - 2019 - betalt til og med 2029",117,{"$f":"IF(L121=0,\"\",INDEX(Bogføring!$A:$A,MATCH(Tabel2[[#This Row],[Medl.nr. :]],Bogføring!$D:$D,0),0))","v":""},{"$f":"SUMIFS(Bogføring!H:H,Bogføring!E:E,\"=\"&$L$5,Bogføring!D:D,\"=\"&A121)","v":0},{"$f":"IF(N121=0,\"\",SUMIFS(Bogføring!A:A,Bogføring!E:E,\"=\"&$N$5,Bogføring!D:D,\"=\"&A121))","v":""},{"$f":"SUMIFS(Bogføring!H:H,Bogføring!E:E,\"=\"&$N$5,Bogføring!D:D,\"=\"&A121)","v":0},{"$f":"IF(N121=0,\"\",SUMIFS(Bogføring!$A:$A,Bogføring!$E:$E,\"=\"&$P$5,Bogføring!$D:$D,\"=\"&A121))","v":""},{"$f":"SUMIFS(Bogføring!$H:$H,Bogføring!$E:$E,\"=\"&$P$5,Bogføring!$D:$D,\"=\"&A121)","v":0}]
[118,"Poul Johnny Drachmann","Toftelunden 24",3790,"Hasle",61713848,"johnny.drachmann@gmail.com",2018,null,118,{"$f":"IF(L122=0,\"\",INDEX(Bogføring!$A:$A,MATCH(Tabel2[[#This Row],[Medl.nr. :]],Bogføring!$D:$D,0),0))","v":""},{"$f":"SUMIFS(Bogføring!H:H,Bogføring!E:E,\"=\"&$L$5,Bogføring!D:D,\"=\"&A122)","v":0},{"$f":"IF(N122=0,\"\",SUMIFS(Bogføring!A:A,Bogføring!E:E,\"=\"&$N$5,Bogføring!D:D,\"=\"&A122))","v":""},{"$f":"SUMIFS(Bogføring!H:H,Bogføring!E:E,\"=\"&$N$5,Bogføring!D:D,\"=\"&A122)","v":0},{"$f":"IF(N122=0,\"\",SUMIFS(Bogføring!$A:$A,Bogføring!$E:$E,\"=\"&$P$5,Bogføring!$D:$D,\"=\"&A122))","v":""},{"$f":"SUMIFS(Bogføring!$H:$H,Bogføring!$G:$G,\"=\"&$P$5,Bogføring!$D:$D,\"=\"&A122)","v":0}]
[119,"John V. Jakobsen","Kong Georgs Vej 88, 4 th.",2000,"Frederiksberg",28608077,"jvarmark@gmail.com",null,null,119,{"$f":"IF(L123=0,\"\",INDEX(Bogføring!$A:$A,MATCH(Tabel2[[#This Row],[Medl.nr. :]],Bogføring!$D:$D,0),0))","v":""},{"$f":"SUMIFS(Bogføring!H:H,Bogføring!E:E,\"=\"&$L$5,Bogføring!D:D,\"=\"&A123)","v":0},{"$f":"IF(N123=0,\"\",SUMIFS(Bogføring!A:A,Bogføring!E:E,\"=\"&$N$5,Bogføring!D:D,\"=\"&A123))","v":""},{"$f":"SUMIFS(Bogføring!H:H,Bogføring!E:E,\"=\"&$N$5,Bogføring!D:D,\"=\"&A123)","v":0},{"$f":"IF(N123=0,\"\",SUMIFS(Bogføring!$A:$A,Bogføring!$E:$E,\"=\"&$P$5,Bogføring!$D:$D,\"=\"&A123))","v":""},{"$f":"SUMIFS(Bogføring!$H:$H,Bogføring!$G:$G,\"=\"&$P$5,Bogføring!$D:$D,\"=\"&A123)","v":0}]
[120,"Aage Juul","Svanekevej 19",3700,"Rønne",56952410,"aagejuul@mail.dk",null,null,120,{"$f":"IF(L124=0,\"\",INDEX(Bogføring!$A:$A,MATCH(Tabel2[[#This Row],[Medl.nr. :]],Bogføring!$D:$D,0),0))","v":""},{"$f":"SUMIFS(Bogføring!H:H,Bogføring!E:E,\"=\"&$L$5,Bogføring!D:D,\"=\"&A124)","v":0},{"$f":"IF(N124=0,\"\",SUMIFS(Bogføring!A:A,Bogføring!E:E,\"=\"&$N$5,Bogføring!D:D,\"=\"&A124))","v":""},{"$f":"SUMIFS(Bogføring!H:H,Bogføring!E:E,\"=\"&$N$5,Bogføring!D:D,\"=\"&A124)","v":0},{"$f":"IF(N124=0,\"\",SUMIFS(Bogføring!$A:$A,Bogføring!$E:$E,\"=\"&$P$5,Bogføring!$D:$D,\"=\"&A124))","v":""},{"$f":"SUMIFS(Bogføring!$H:$H,Bogføring!$G:$G,\"=\"&$P$5,Bogføring!$D:$D,\"=\"&A124)","v":0}]
[121,"Ole og Gurli Hansen","Munkegårdsvejen 10, Poulsker",3730,"Nexø",42211180,"gurli@mailreal.dk",null,null,121,{"$f":"IF(L125=0,\"\",INDEX(Bogføring!$A:$A,MATCH(Tabel2[[#This Row],[Medl.nr. :]],Bogføring!$D:$D,0),0))","v":""},{"$f":"SUMIFS(Bogføring!H:H,Bogføring!E:E,\"=\"&$L$5,Bogføring!D:D,\"=\"&A125)","v":0},{"$f":"IF(N125=0,\"\",SUMIFS(Bogføring!A:A,Bogføring!E:E,\"=\"&$N$5,Bogføring!D:D,\"=\"&A125))","v":""},{"$f":"SUMIFS(Bogføring!H:H,Bogføring!E:E,\"=\"&$N$5,Bogføring!D:D,\"=\"&A125)","v":0},{"$f":"IF(N125=0,\"\",SUMIFS(Bogføring!$A:$A,Bogføring!$E:$E,\"=\"&$P$5,Bogføring!$D:$D,\"=\"&A125))","v":""},{"$f":"SUMIFS(Bogføring!$H:$H,Bogføring!$G:$G,\"=\"&$P$5,Bogføring!$D:$D,\"=\"&A125)","v":0}]
[122,"Noomi og Peter Aage Bak","Rønnevej 132, Nylars",3700,"Rønne",56972166,"peteraagebak@gmail.com",null,null,122,{"$f":"IF(L126=0,\"\",INDEX(Bogføring!$A:$A,MATCH(Tabel2[[#This Row],[Medl.nr. :]],Bogføring!$D:$D,0),0))","v":""},{"$f":"SUMIFS(Bogføring!H:H,Bogføring!E:E,\"=\"&$L$5,Bogføring!D:D,\"=\"&A126)","v":0},{"$f":"IF(N126=0,\"\",SUMIFS(Bogføring!A:A,Bogføring!E:E,\"=\"&$N$5,Bogføring!D:D,\"=\"&A126))","v":""},{"$f":"SUMIFS(Bogføring!H:H,Bogføring!E:E,\"=\"&$N$5,Bogføring!D:D,\"=\"&A126)","v":0},{"$f":"IF(N126=0,\"\",SUMIFS(Bogføring!$A:$A,Bogføring!$E:$E,\"=\"&$P$5,Bogføring!$D:$D,\"=\"&A126))","v":""},{"$f":"SUMIFS(Bogføring!$H:$H,Bogføring!$G:$G,\"=\"&$P$5,Bogføring!$D:$D,\"=\"&A126)","v":0}]
[123,"Carl Emil Kragh","Helgenæsvej 175",4900,"Nakskov",51158426,"cekragh@youmail.dk",null,null,123,{"$f":"IF(L127=0,\"\",INDEX(Bogføring!$A:$A,MATCH(Tabel2[[#This Row],[Medl.nr. :]],Bogføring!$D:$D,0),0))","v":""},{"$f":"SUMIFS(Bogføring!H:H,Bogføring!E:E,\"=\"&$L$5,Bogføring!D:D,\"=\"&A127)","v":0},{"$f":"IF(N127=0,\"\",SUMIFS(Bogføring!A:A,Bogføring!E:E,\"=\"&$N$5,Bogføring!D:D,\"=\"&A127))","v":""},{"$f":"SUMIFS(Bogføring!H:H,Bogføring!E:E,\"=\"&$N$5,Bogføring!D:D,\"=\"&A127)","v":0},{"$f":"IF(N127=0,\"\",SUMIFS(Bogføring!$A:$A,Bogføring!$E:$E,\"=\"&$P$5,Bogføring!$D:$D,\"=\"&A127))","v":""},{"$f":"SUMIFS(Bogføring!$H:$H,Bogføring!$G:$G,\"=\"&$P$5,Bogføring!$D:$D,\"=\"&A127)","v":0}]
[124,"Jørn Koefoed Larsen","Mågevej 34, Madsnedø",4760,"Vordingborg",23628188,"masnedbo34@gmail.com",null,null,124,{"$f":"IF(L128=0,\"\",INDEX(Bogføring!$A:$A,MATCH(Tabel2[[#This Row],[Medl.nr. :]],Bogføring!$D:$D,0),0))","v":""},{"$f":"SUMIFS(Bogføring!H:H,Bogføring!E:E,\"=\"&$L$5,Bogføring!D:D,\"=\"&A128)","v":0},{"$f":"IF(N128=0,\"\",SUMIFS(Bogføring!A:A,Bogføring!E:E,\"=\"&$N$5,Bogføring!D:D,\"=\"&A128))","v":""},{"$f":"SUMIFS(Bogføring!H:H,Bogføring!E:E,\"=\"&$N$5,Bogføring!D:D,\"=\"&A128)","v":0},{"$f":"IF(N128=0,\"\",SUMIFS(Bogføring!$A:$A,Bogføring!$E:$E,\"=\"&$P$5,Bogføring!$D:$D,\"=\"&A128))","v":""},{"$f":"SUMIFS(Bogføring!$H:$H,Bogføring!$G:$G,\"=\"&$P$5,Bogføring!$D:$D,\"=\"&A128)","v":0}]
[125,"Jørgen Jensen","Stenhusvej 2",4130,"Viby Sj.",23414178,"jfmj78@gmail.com",2020,null,125,{"$f":"IF(L129=0,\"\",INDEX(Bogføring!$A:$A,MATCH(Tabel2[[#This Row],[Medl.nr. :]],Bogføring!$D:$D,0),0))","v":""},{"$f":"SUMIFS(Bogføring!H:H,Bogføring!E:E,\"=\"&$L$5,Bogføring!D:D,\"=\"&A129)","v":0},{"$f":"IF(N129=0,\"\",SUMIFS(Bogføring!A:A,Bogføring!E:E,\"=\"&$N$5,Bogføring!D:D,\"=\"&A129))","v":""},{"$f":"SUMIFS(Bogføring!H:H,Bogføring!E:E,\"=\"&$N$5,Bogføring!D:D,\"=\"&A129)","v":0},{"$f":"IF(N129=0,\"\",SUMIFS(Bogføring!$A:$A,Bogføring!$E:$E,\"=\"&$P$5,Bogføring!$D:$D,\"=\"&A129))","v":""},{"$f":"SUMIFS(Bogføring!$H:$H,Bogføring!$G:$G,\"=\"&$P$5,Bogføring!$D:$D,\"=\"&A129)","v":0}]
[126,"Ole Hassager","Ved Grænsen 62",2000,"Frederiksberg",23652303,"ole.hassager@gmail.com",2020,null,126,{"$f":"IF(L130=0,\"\",INDEX(Bogføring!$A:$A,MATCH(Tabel2[[#This Row],[Medl.nr. :]],Bogføring!$D:$D,0),0))","v":""},{"$f":"SUMIFS(Bogføring!H:H,Bogføring!E:E,\"=\"&$L$5,Bogføring!D:D,\"=\"&A130)","v":0},{"$f":"IF(N130=0,\"\",SUMIFS(Bogføring!A:A,Bogføring!E:E,\"=\"&$N$5,Bogføring!D:D,\"=\"&A130))","v":""},{"$f":"SUMIFS(Bogføring!H:H,Bogføring!E:E,\"=\"&$N$5,Bogføring!D:D,\"=\"&A130)","v":0},{"$f":"IF(N130=0,\"\",SUMIFS(Bogføring!$A:$A,Bogføring!$E:$E,\"=\"&$P$5,Bogføring!$D:$D,\"=\"&A130))","v":""},{"$f":"SUMIFS(Bogføring!$H:$H,Bogføring!$G:$G,\"=\"&$P$5,Bogføring!$D:$D,\"=\"&A130)","v":0}]
[127,"Per K. Funch","Skarpegade 5",3700,"Rønne",null,"GIRO",null,null,127,{"$f":"IF(L131=0,\"\",INDEX(Bogføring!$A:$A,MATCH(Tabel2[[#This Row],[Medl.nr. :]],Bogføring!$D:$D,0),0))","v":""},{"$f":"SUMIFS(Bogføring!H:H,Bogføring!E:E,\"=\"&$L$5,Bogføring!D:D,\"=\"&A131)","v":0},{"$f":"IF(N131=0,\"\",SUMIFS(Bogføring!A:A,Bogføring!E:E,\"=\"&$N$5,Bogføring!D:D,\"=\"&A131))","v":""},{"$f":"SUMIFS(Bogføring!H:H,Bogføring!E:E,\"=\"&$N$5,Bogføring!D:D,\"=\"&A131)","v":0},{"$f":"IF(N131=0,\"\",SUMIFS(Bogføring!$A:$A,Bogføring!$E:$E,\"=\"&$P$5,Bogføring!$D:$D,\"=\"&A131))","v":""},{"$f":"SUMIFS(Bogføring!$H:$H,Bogføring!$G:$G,\"=\"&$P$5,Bogføring!$D:$D,\"=\"&A131)","v":0}]
[128,"Niels Bøje P. Karlsen","Torneværksvej 45,1 lejl. 5",3700,"Rønne",40203559,"GIRO",2019,null,128,{"$f":"IF(L132=0,\"\",INDEX(Bogføring!$A:$A,MATCH(Tabel2[[#This Row],[Medl.nr. :]],Bogføring!$D:$D,0),0))","v":""},{"$f":"SUMIFS(Bogføring!H:H,Bogføring!E:E,\"=\"&$L$5,Bogføring!D:D,\"=\"&A132)","v":0},{"$f":"IF(N132=0,\"\",SUMIFS(Bogføring!A:A,Bogføring!E:E,\"=\"&$N$5,Bogføring!D:D,\"=\"&A132))","v":""},{"$f":"SUMIFS(Bogføring!H:H,Bogføring!E:E,\"=\"&$N$5,Bogføring!D:D,\"=\"&A132)","v":0},{"$f":"IF(N132=0,\"\",SUMIFS(Bogføring!$A:$A,Bogføring!$E:$E,\"=\"&$P$5,Bogføring!$D:$D,\"=\"&A132))","v":""},{"$f":"SUMIFS(Bogføring!$H:$H,Bogføring!$G:$G,\"=\"&$P$5,Bogføring!$D:$D,\"=\"&A132)","v":0}]
[129,"Ebba L. Bang","Skarvigen 8, Aarsdale",3740,"Svaneke",56496566,"GIRO",null,null,129,{"$f":"IF(L133=0,\"\",INDEX(Bogføring!$A:$A,MATCH(Tabel2[[#This Row],[Medl.nr. :]],Bogføring!$D:$D,0),0))","v":""},{"$f":"SUMIFS(Bogføring!H:H,Bogføring!E:E,\"=\"&$L$5,Bogføring!D:D,\"=\"&A133)","v":0},{"$f":"IF(N133=0,\"\",SUMIFS(Bogføring!A:A,Bogføring!E:E,\"=\"&$N$5,Bogføring!D:D,\"=\"&A133))","v":""},{"$f":"SUMIFS(Bogføring!H:H,Bogføring!E:E,\"=\"&$N$5,Bogføring!D:D,\"=\"&A133)","v":0},{"$f":"IF(N133=0,\"\",SUMIFS(Bogføring!$A:$A,Bogføring!$E:$E,\"=\"&$P$5,Bogføring!$D:$D,\"=\"&A133))","v":""},{"$f":"SUMIFS(Bogføring!$H:$H,Bogføring!$G:$G,\"=\"&$P$5,Bogføring!$D:$D,\"=\"&A133)","v":0}]
[130,"Jørn Nilsson","Snellemark 4",3700,"Rønne",null,"GIRO",2018,"Bet. af Jesper Nilsson - Stormgade 5",{"$f":"IF(A134=\"\",\"\",A134)","v":130},{"$f":"IF(L134=0,\"\",INDEX(Bogføring!$A:$A,MATCH(Tabel2[[#This Row],[Medl.nr. :]],Bogføring!$D:$D,0),0))","v":""},{"$f":"SUMIFS(Bogføring!H:H,Bogføring!E:E,\"=\"&$L$5,Bogføring!D:D,\"=\"&A134)","v":0},{"$f":"IF(N134=0,\"\",SUMIFS(Bogføring!A:A,Bogføring!E:E,\"=\"&$N$5,Bogføring!D:D,\"=\"&A134))","v":""},{"$f":"SUMIFS(Bogføring!H:H,Bogføring!E:E,\"=\"&$N$5,Bogføring!D:D,\"=\"&A134)","v":0},{"$f":"IF(N134=0,\"\",SUMIFS(Bogføring!$A:$A,Bogføring!$E:$E,\"=\"&$P$5,Bogføring!$D:$D,\"=\"&A134))","v":""},{"$f":"SUMIFS(Bogføring!$H:$H,Bogføring!$G:$G,\"=\"&$P$5,Bogføring!$D:$D,\"=\"&A134)","v":0}]
[131,"Ole Brandt Andersen","Æblestien 13",3700,"Rønne",29889916,"GIRO",null,null,131,{"$f":"IF(L135=0,\"\",INDEX(Bogføring!$A:$A,MATCH(Tabel2[[#This Row],[Medl.nr. :]],Bogføring!$D:$D,0),0))","v":""},{"$f":"SUMIFS(Bogføring!H:H,Bogføring!E:E,\"=\"&$L$5,Bogføring!D:D,\"=\"&A135)","v":0},{"$f":"IF(N135=0,\"\",SUMIFS(Bogføring!A:A,Bogføring!E:E,\"=\"&$N$5,Bogføring!D:D,\"=\"&A135))","v":""},{"$f":"SUMIFS(Bogføring!H:H,Bogføring!E:E,\"=\"&$N$5,Bogføring!D:D,\"=\"&A135)","v":0},{"$f":"IF(N135=0,\"\",SUMIFS(Bogføring!$A:$A,Bogføring!$E:$E,\"=\"&$P$5,Bogføring!$D:$D,\"=\"&A135))","v":""},{"$f":"SUMIFS(Bogføring!$H:$H,Bogføring!$G:$G,\"=\"&$P$5,Bogføring!$D:$D,\"=\"&A135)","v":0}]
[132,"Bent Aune","Gammel Byvej 4A, 1.th.",2650,"Hvidovre",29629091,"GIRO",null,null,132,{"$f":"IF(L136=0,\"\",INDEX(Bogføring!$A:$A,MATCH(Tabel2[[#This Row],[Medl.nr. :]],Bogføring!$D:$D,0),0))","v":""},{"$f":"SUMIFS(Bogføring!H:H,Bogføring!E:E,\"=\"&$L$5,Bogføring!D:D,\"=\"&A136)","v":0},{"$f":"IF(N136=0,\"\",SUMIFS(Bogføring!A:A,Bogføring!E:E,\"=\"&$N$5,Bogføring!D:D,\"=\"&A136))","v":""},{"$f":"SUMIFS(Bogføring!H:H,Bogføring!E:E,\"=\"&$N$5,Bogføring!D:D,\"=\"&A136)","v":0},{"$f":"IF(N136=0,\"\",SUMIFS(Bogføring!$A:$A,Bogføring!$E:$E,\"=\"&$P$5,Bogføring!$D:$D,\"=\"&A136))","v":""},{"$f":"SUMIFS(Bogføring!$H:$H,Bogføring!$G:$G,\"=\"&$P$5,Bogføring!$D:$D,\"=\"&A136)","v":0}]
[134,"Poul Dyrekær Nielsen","Diget 16",4652,"Hårlev",23906231,"GIRO",null,null,134,{"$f":"IF(L137=0,\"\",INDEX(Bogføring!$A:$A,MATCH(Tabel2[[#This Row],[Medl.nr. :]],Bogføring!$D:$D,0),0))","v":""},{"$f":"SUMIFS(Bogføring!H:H,Bogføring!E:E,\"=\"&$L$5,Bogføring!D:D,\"=\"&A137)","v":0},{"$f":"IF(N137=0,\"\",SUMIFS(Bogføring!A:A,Bogføring!E:E,\"=\"&$N$5,Bogføring!D:D,\"=\"&A137))","v":""},{"$f":"SUMIFS(Bogføring!H:H,Bogføring!E:E,\"=\"&$N$5,Bogføring!D:D,\"=\"&A137)","v":0},{"$f":"IF(N137=0,\"\",SUMIFS(Bogføring!$A:$A,Bogføring!$E:$E,\"=\"&$P$5,Bogføring!$D:$D,\"=\"&A137))","v":""},{"$f":"SUMIFS(Bogføring!$H:$H,Bogføring!$G:$G,\"=\"&$P$5,Bogføring!$D:$D,\"=\"&A137)","v":0}]
[135,"Leif Herluf Nielsen","Smålandsvej 25",3700,"Rønne",56957971,"GIRO",null,null,135,{"$f":"IF(L138=0,\"\",INDEX(Bogføring!$A:$A,MATCH(Tabel2[[#This Row],[Medl.nr. :]],Bogføring!$D:$D,0),0))","v":""},{"$f":"SUMIFS(Bogføring!H:H,Bogføring!E:E,\"=\"&$L$5,Bogføring!D:D,\"=\"&A138)","v":0},{"$f":"IF(N138=0,\"\",SUMIFS(Bogføring!A:A,Bogføring!E:E,\"=\"&$N$5,Bogføring!D:D,\"=\"&A138))","v":""},{"$f":"SUMIFS(Bogføring!H:H,Bogføring!E:E,\"=\"&$N$5,Bogføring!D:D,\"=\"&A138)","v":0},{"$f":"IF(N138=0,\"\",SUMIFS(Bogføring!$A:$A,Bogføring!$E:$E,\"=\"&$P$5,Bogføring!$D:$D,\"=\"&A138))","v":""},{"$f":"SUMIFS(Bogføring!$H:$H,Bogføring!$G:$G,\"=\"&$P$5,Bogføring!$D:$D,\"=\"&A138)","v":0}]
[136,"Kurt Mogensen","Voldgade 28",3700,"Rønne",24803842,"GIRO",null,null,136,{"$f":"IF(L139=0,\"\",INDEX(Bogføring!$A:$A,MATCH(Tabel2[[#This Row],[Medl.nr. :]],Bogføring!$D:$D,0),0))","v":""},{"$f":"SUMIFS(Bogføring!H:H,Bogføring!E:E,\"=\"&$L$5,Bogføring!D:D,\"=\"&A139)","v":0},{"$f":"IF(N139=0,\"\",SUMIFS(Bogføring!A:A,Bogføring!E:E,\"=\"&$N$5,Bogføring!D:D,\"=\"&A139))","v":""},{"$f":"SUMIFS(Bogføring!H:H,Bogføring!E:E,\"=\"&$N$5,Bogføring!D:D,\"=\"&A139)","v":0},{"$f":"IF(N139=0,\"\",SUMIFS(Bogføring!$A:$A,Bogføring!$E:$E,\"=\"&$P$5,Bogføring!$D:$D,\"=\"&A139))","v":""},{"$f":"SUMIFS(Bogføring!$H:$H,Bogføring!$G:$G,\"=\"&$P$5,Bogføring!$D:$D,\"=\"&A139)","v":0}]
[137,"Hans Hardo Holmgaard Christensen","Skørpingevej 21 a",4673,"Rødvig",21192109,"GIRO",null,"Bet. af Tina Egholm Jensen",137,{"$f":"IF(L140=0,\"\",INDEX(Bogføring!$A:$A,MATCH(Tabel2[[#This Row],[Medl.nr. :]],Bogføring!$D:$D,0),0))","v":""},{"$f":"SUMIFS(Bogføring!H:H,Bogføring!E:E,\"=\"&$L$5,Bogføring!D:D,\"=\"&A140)","v":0},{"$f":"IF(N140=0,\"\",SUMIFS(Bogføring!A:A,Bogføring!E:E,\"=\"&$N$5,Bogføring!D:D,\"=\"&A140))","v":""},{"$f":"SUMIFS(Bogføring!H:H,Bogføring!E:E,\"=\"&$N$5,Bogføring!D:D,\"=\"&A140)","v":0},{"$f":"IF(N140=0,\"\",SUMIFS(Bogføring!$A:$A,Bogføring!$E:$E,\"=\"&$P$5,Bogføring!$D:$D,\"=\"&A140))","v":""},{"$f":"SUMIFS(Bogføring!$H:$H,Bogføring!$G:$G,\"=\"&$P$5,Bogføring!$D:$D,\"=\"&A140)","v":0}]
[138,"Bente Bojesen-Koefoed","Storegade 67",3700,"Rønne",56950941,"GIRO",null,null,138,{"$f":"IF(L141=0,\"\",INDEX(Bogføring!$A:$A,MATCH(Tabel2[[#This Row],[Medl.nr. :]],Bogføring!$D:$D,0),0))","v":""},{"$f":"SUMIFS(Bogføring!H:H,Bogføring!E:E,\"=\"&$L$5,Bogføring!D:D,\"=\"&A141)","v":0},{"$f":"IF(N141=0,\"\",SUMIFS(Bogføring!A:A,Bogføring!E:E,\"=\"&$N$5,Bogføring!D:D,\"=\"&A141))","v":""},{"$f":"SUMIFS(Bogføring!H:H,Bogføring!E:E,\"=\"&$N$5,Bogføring!D:D,\"=\"&A141)","v":0},{"$f":"IF(N141=0,\"\",SUMIFS(Bogføring!$A:$A,Bogføring!$E:$E,\"=\"&$P$5,Bogføring!$D:$D,\"=\"&A141))","v":""},{"$f":"SUMIFS(Bogføring!$H:$H,Bogføring!$G:$G,\"=\"&$P$5,Bogføring!$D:$D,\"=\"&A141)","v":0}]
[139,"Fritz Olsen","Teglgårdsvej 19",3700,"Rønne",56950217,"GIRO",null,null,139,{"$f":"IF(L142=0,\"\",INDEX(Bogføring!$A:$A,MATCH(Tabel2[[#This Row],[Medl.nr. :]],Bogføring!$D:$D,0),0))","v":""},{"$f":"SUMIFS(Bogføring!H:H,Bogføring!E:E,\"=\"&$L$5,Bogføring!D:D,\"=\"&A142)","v":0},{"$f":"IF(N142=0,\"\",SUMIFS(Bogføring!A:A,Bogføring!E:E,\"=\"&$N$5,Bogføring!D:D,\"=\"&A142))","v":""},{"$f":"SUMIFS(Bogføring!H:H,Bogføring!E:E,\"=\"&$N$5,Bogføring!D:D,\"=\"&A142)","v":0},{"$f":"IF(N142=0,\"\",SUMIFS(Bogføring!$A:$A,Bogføring!$E:$E,\"=\"&$P$5,Bogføring!$D:$D,\"=\"&A142))","v":""},{"$f":"SUMIFS(Bogføring!$H:$H,Bogføring!$G:$G,\"=\"&$P$5,Bogføring!$D:$D,\"=\"&A142)","v":0}]
[140,"Birthe Jepsen","Finsensvej 7C, st.th",2000,"Frederiksberg",29661836,"GIRO",null,null,140,{"$f":"IF(L143=0,\"\",INDEX(Bogføring!$A:$A,MATCH(Tabel2[[#This Row],[Medl.nr. :]],Bogføring!$D:$D,0),0))","v":""},{"$f":"SUMIFS(Bogføring!H:H,Bogføring!E:E,\"=\"&$L$5,Bogføring!D:D,\"=\"&A143)","v":0},{"$f":"IF(N143=0,\"\",SUMIFS(Bogføring!A:A,Bogføring!E:E,\"=\"&$N$5,Bogføring!D:D,\"=\"&A143))","v":""},{"$f":"SUMIFS(Bogføring!H:H,Bogføring!E:E,\"=\"&$N$5,Bogføring!D:D,\"=\"&A143)","v":0},{"$f":"IF(N143=0,\"\",SUMIFS(Bogføring!$A:$A,Bogføring!$E:$E,\"=\"&$P$5,Bogføring!$D:$D,\"=\"&A143))","v":""},{"$f":"SUMIFS(Bogføring!$H:$H,Bogføring!$G:$G,\"=\"&$P$5,Bogføring!$D:$D,\"=\"&A143)","v":0}]
[141,"Niels Holm","Havnebakken 1 A, Lejl. 1",3700,"Rønne",56951638,"GIRO",null,null,141,{"$f":"IF(L144=0,\"\",INDEX(Bogføring!$A:$A,MATCH(Tabel2[[#This Row],[Medl.nr. :]],Bogføring!$D:$D,0),0))","v":""},{"$f":"SUMIFS(Bogføring!H:H,Bogføring!E:E,\"=\"&$L$5,Bogføring!D:D,\"=\"&A144)","v":0},{"$f":"IF(N144=0,\"\",SUMIFS(Bogføring!A:A,Bogføring!E:E,\"=\"&$N$5,Bogføring!D:D,\"=\"&A144))","v":""},{"$f":"SUMIFS(Bogføring!H:H,Bogføring!E:E,\"=\"&$N$5,Bogføring!D:D,\"=\"&A144)","v":0},{"$f":"IF(N144=0,\"\",SUMIFS(Bogføring!$A:$A,Bogføring!$E:$E,\"=\"&$P$5,Bogføring!$D:$D,\"=\"&A144))","v":""},{"$f":"SUMIFS(Bogføring!$H:$H,Bogføring!$G:$G,\"=\"&$P$5,Bogføring!$D:$D,\"=\"&A144)","v":0}]
[142,"Ole Sonne","Sorteengevejen 2, Nylars",3700,"Rønne",30495111,"GIRO",null,null,142,{"$f":"IF(L145=0,\"\",INDEX(Bogføring!$A:$A,MATCH(Tabel2[[#This Row],[Medl.nr. :]],Bogføring!$D:$D,0),0))","v":""},{"$f":"SUMIFS(Bogføring!H:H,Bogføring!E:E,\"=\"&$L$5,Bogføring!D:D,\"=\"&A145)","v":0},{"$f":"IF(N145=0,\"\",SUMIFS(Bogføring!A:A,Bogføring!E:E,\"=\"&$N$5,Bogføring!D:D,\"=\"&A145))","v":""},{"$f":"SUMIFS(Bogføring!H:H,Bogføring!E:E,\"=\"&$N$5,Bogføring!D:D,\"=\"&A145)","v":0},{"$f":"IF(N145=0,\"\",SUMIFS(Bogføring!$A:$A,Bogføring!$E:$E,\"=\"&$P$5,Bogføring!$D:$D,\"=\"&A145))","v":""},{"$f":"SUMIFS(Bogføring!$H:$H,Bogføring!$G:$G,\"=\"&$P$5,Bogføring!$D:$D,\"=\"&A145)","v":0}]
[143,"Peter Aage Henriksen","Overgaden Neden Vandet 5B, st.tv.",1414,"København K",20305977,"Hx@webspeed.dk",null,null,143,{"$f":"IF(L146=0,\"\",INDEX(Bogføring!$A:$A,MATCH(Tabel2[[#This Row],[Medl.nr. :]],Bogføring!$D:$D,0),0))","v":""},{"$f":"SUMIFS(Bogføring!H:H,Bogføring!E:E,\"=\"&$L$5,Bogføring!D:D,\"=\"&A146)","v":0},{"$f":"IF(N146=0,\"\",SUMIFS(Bogføring!A:A,Bogføring!E:E,\"=\"&$N$5,Bogføring!D:D,\"=\"&A146))","v":""},{"$f":"SUMIFS(Bogføring!H:H,Bogføring!E:E,\"=\"&$N$5,Bogføring!D:D,\"=\"&A146)","v":0},{"$f":"IF(N146=0,\"\",SUMIFS(Bogføring!$A:$A,Bogføring!$E:$E,\"=\"&$P$5,Bogføring!$D:$D,\"=\"&A146))","v":""},{"$f":"SUMIFS(Bogføring!$H:$H,Bogføring!$G:$G,\"=\"&$P$5,Bogføring!$D:$D,\"=\"&A146)","v":0}]
[144,"Karsten Rasmussen","Løkkegade 3",3790,"Hasle",56955227,"GIRO-nummeret ikke i brug",null,null,144,{"$f":"IF(L147=0,\"\",INDEX(Bogføring!$A:$A,MATCH(Tabel2[[#This Row],[Medl.nr. :]],Bogføring!$D:$D,0),0))","v":""},{"$f":"SUMIFS(Bogføring!H:H,Bogføring!E:E,\"=\"&$L$5,Bogføring!D:D,\"=\"&A147)","v":0},{"$f":"IF(N147=0,\"\",SUMIFS(Bogføring!A:A,Bogføring!E:E,\"=\"&$N$5,Bogføring!D:D,\"=\"&A147))","v":""},{"$f":"SUMIFS(Bogføring!H:H,Bogføring!E:E,\"=\"&$N$5,Bogføring!D:D,\"=\"&A147)","v":0},{"$f":"IF(N147=0,\"\",SUMIFS(Bogføring!$A:$A,Bogføring!$E:$E,\"=\"&$P$5,Bogføring!$D:$D,\"=\"&A147))","v":""},{"$f":"SUMIFS(Bogføring!$H:$H,Bogføring!$G:$G,\"=\"&$P$5,Bogføring!$D:$D,\"=\"&A147)","v":0}]
[145,"John Pedersen","Rundløkkevejen 2",3720,"Åkirkeby",56974224,"GIRO-nummeret ikke i brug",null,null,145,{"$f":"IF(L148=0,\"\",INDEX(Bogføring!$A:$A,MATCH(Tabel2[[#This Row],[Medl.nr. :]],Bogføring!$D:$D,0),0))","v":""},{"$f":"SUMIFS(Bogføring!H:H,Bogføring!E:E,\"=\"&$L$5,Bogføring!D:D,\"=\"&A148)","v":0},{"$f":"IF(N148=0,\"\",SUMIFS(Bogføring!A:A,Bogføring!E:E,\"=\"&$N$5,Bogføring!D:D,\"=\"&A148))","v":""},{"$f":"SUMIFS(Bogføring!H:H,Bogføring!E:E,\"=\"&$N$5,Bogføring!D:D,\"=\"&A148)","v":0},{"$f":"IF(N148=0,\"\",SUMIFS(Bogføring!$A:$A,Bogføring!$E:$E,\"=\"&$P$5,Bogføring!$D:$D,\"=\"&A148))","v":""},{"$f":"SUMIFS(Bogføring!$H:$H,Bogføring!$G:$G,\"=\"&$P$5,Bogføring!$D:$D,\"=\"&A148)","v":0}]
[146,"Marianne Hansen","Ipsens Have 10",3700,"Rønne",61394505,"Giro",null,null,146,{"$f":"IF(L149=0,\"\",INDEX(Bogføring!$A:$A,MATCH(Tabel2[[#This Row],[Medl.nr. :]],Bogføring!$D:$D,0),0))","v":""},{"$f":"SUMIFS(Bogføring!H:H,Bogføring!E:E,\"=\"&$L$5,Bogføring!D:D,\"=\"&A149)","v":0},{"$f":"IF(N149=0,\"\",SUMIFS(Bogføring!A:A,Bogføring!E:E,\"=\"&$N$5,Bogføring!D:D,\"=\"&A149))","v":""},{"$f":"SUMIFS(Bogføring!H:H,Bogføring!E:E,\"=\"&$N$5,Bogføring!D:D,\"=\"&A149)","v":0},{"$f":"IF(N149=0,\"\",SUMIFS(Bogføring!$A:$A,Bogføring!$E:$E,\"=\"&$P$5,Bogføring!$D:$D,\"=\"&A149))","v":""},{"$f":"SUMIFS(Bogføring!$H:$H,Bogføring!$G:$G,\"=\"&$P$5,Bogføring!$D:$D,\"=\"&A149)","v":0}]
[147,"Michael Christian Kofoed","Langelinie 10",3700,"Rønne ",null,null,null,null,147,{"$f":"IF(L150=0,\"\",INDEX(Bogføring!$A:$A,MATCH(Tabel2[[#This Row],[Medl.nr. :]],Bogføring!$D:$D,0),0))","v":""},{"$f":"SUMIFS(Bogføring!H:H,Bogføring!E:E,\"=\"&$L$5,Bogføring!D:D,\"=\"&A150)","v":0},{"$f":"IF(N150=0,\"\",SUMIFS(Bogføring!A:A,Bogføring!E:E,\"=\"&$N$5,Bogføring!D:D,\"=\"&A150))","v":""},{"$f":"SUMIFS(Bogføring!H:H,Bogføring!E:E,\"=\"&$N$5,Bogføring!D:D,\"=\"&A150)","v":0},{"$f":"IF(N150=0,\"\",SUMIFS(Bogføring!$A:$A,Bogføring!$E:$E,\"=\"&$P$5,Bogføring!$D:$D,\"=\"&A150))","v":""},{"$f":"SUMIFS(Bogføring!$H:$H,Bogføring!$G:$G,\"=\"&$P$5,Bogføring!$D:$D,\"=\"&A150)","v":0}]
[148,"Poul-Erik Kofoed","Slåenvej 31",3700,"Rønne",29253020,"pekofoed@hotmail.dk",null,null,148,{"$f":"IF(L151=0,\"\",INDEX(Bogføring!$A:$A,MATCH(Tabel2[[#This Row],[Medl.nr. :]],Bogføring!$D:$D,0),0))","v":""},{"$f":"SUMIFS(Bogføring!H:H,Bogføring!E:E,\"=\"&$L$5,Bogføring!D:D,\"=\"&A151)","v":0},{"$f":"IF(N151=0,\"\",SUMIFS(Bogføring!A:A,Bogføring!E:E,\"=\"&$N$5,Bogføring!D:D,\"=\"&A151))","v":""},{"$f":"SUMIFS(Bogføring!H:H,Bogføring!E:E,\"=\"&$N$5,Bogføring!D:D,\"=\"&A151)","v":0},{"$f":"IF(N151=0,\"\",SUMIFS(Bogføring!$A:$A,Bogføring!$E:$E,\"=\"&$P$5,Bogføring!$D:$D,\"=\"&A151))","v":""},{"$f":"SUMIFS(Bogføring!$H:$H,Bogføring!$G:$G,\"=\"&$P$5,Bogføring!$D:$D,\"=\"&A151)","v":0}]
[1001,"Rønne Handelsstandsfor. c/o Meny","StoreTorv 11",3700,"Rønne",null,"037619@meny.dk",null,null,1001,{"$f":"IF(L152=0,\"\",INDEX(Bogføring!$A:$A,MATCH(Tabel2[[#This Row],[Medl.nr. :]],Bogføring!$D:$D,0),0))","v":""},{"$f":"SUMIFS(Bogføring!H:H,Bogføring!E:E,\"=\"&$L$5,Bogføring!D:D,\"=\"&A152)","v":0},{"$f":"IF(N152=0,\"\",SUMIFS(Bogføring!A:A,Bogføring!E:E,\"=\"&$N$5,Bogføring!D:D,\"=\"&A152))","v":""},{"$f":"SUMIFS(Bogføring!H:H,Bogføring!E:E,\"=\"&$N$5,Bogføring!D:D,\"=\"&A152)","v":0},{"$f":"IF(N152=0,\"\",SUMIFS(Bogføring!$A:$A,Bogføring!$E:$E,\"=\"&$P$5,Bogføring!$D:$D,\"=\"&A152))","v":""},{"$f":"SUMIFS(Bogføring!$H:$H,Bogføring!$G:$G,\"=\"&$P$5,Bogføring!$D:$D,\"=\"&A152)","v":0}]
[1002,"Kastellets Venner og Historisk Samling c/o Steen Kjær","Skoletoften 1",6430,"Nordborg",null,null,null,"Gl. Hovedvagt, Kastellet 1, 2100 København Ø",1002,{"$f":"IF(L153=0,\"\",INDEX(Bogføring!$A:$A,MATCH(Tabel2[[#This Row],[Medl.nr. :]],Bogføring!$D:$D,0),0))","v":""},{"$f":"SUMIFS(Bogføring!H:H,Bogføring!E:E,\"=\"&$L$5,Bogføring!D:D,\"=\"&A153)","v":0},{"$f":"IF(N153=0,\"\",SUMIFS(Bogføring!A:A,Bogføring!E:E,\"=\"&$N$5,Bogføring!D:D,\"=\"&A153))","v":""},{"$f":"SUMIFS(Bogføring!H:H,Bogføring!E:E,\"=\"&$N$5,Bogføring!D:D,\"=\"&A153)","v":0},{"$f":"IF(N153=0,\"\",SUMIFS(Bogføring!$A:$A,Bogføring!$E:$E,\"=\"&$P$5,Bogføring!$D:$D,\"=\"&A153))","v":""},{"$f":"SUMIFS(Bogføring!$H:$H,Bogføring!$G:$G,\"=\"&$P$5,Bogføring!$D:$D,\"=\"&A153)","v":0}]
[1003,"BH LT-Gilde v/Niels Lausten Brogård","Skolebakken 84",2830,"Virum",null,null,null,"Bidrag Betalt den 3/12/2019",1003,{"$f":"IF(L154=0,\"\",INDEX(Bogføring!$A:$A,MATCH(Tabel2[[#This Row],[Medl.nr. :]],Bogføring!$D:$D,0),0))","v":""},{"$f":"SUMIFS(Bogføring!H:H,Bogføring!E:E,\"=\"&$L$5,Bogføring!D:D,\"=\"&A154)","v":0},{"$f":"IF(N154=0,\"\",SUMIFS(Bogføring!A:A,Bogføring!E:E,\"=\"&$N$5,Bogføring!D:D,\"=\"&A154))","v":""},{"$f":"SUMIFS(Bogføring!H:H,Bogføring!E:E,\"=\"&$N$5,Bogføring!D:D,\"=\"&A154)","v":0},{"$f":"IF(N154=0,\"\",SUMIFS(Bogføring!$A:$A,Bogføring!$E:$E,\"=\"&$P$5,Bogføring!$D:$D,\"=\"&A154))","v":""},{"$f":"SUMIFS(Bogføring!$H:$H,Bogføring!$G:$G,\"=\"&$P$5,Bogføring!$D:$D,\"=\"&A154)","v":0}]
[1004,"EDC BornholmerBo-Kurt Mortensen","Tornegade 1-3",3700,"Rønne",56955683,"371@edc.dk ",2019,null,1004,{"$f":"IF(L155=0,\"\",INDEX(Bogføring!$A:$A,MATCH(Tabel2[[#This Row],[Medl.nr. :]],Bogføring!$D:$D,0),0))","v":""},{"$f":"SUMIFS(Bogføring!H:H,Bogføring!E:E,\"=\"&$L$5,Bogføring!D:D,\"=\"&A155)","v":0},{"$f":"IF(N155=0,\"\",SUMIFS(Bogføring!A:A,Bogføring!E:E,\"=\"&$N$5,Bogføring!D:D,\"=\"&A155))","v":""},{"$f":"SUMIFS(Bogføring!H:H,Bogføring!E:E,\"=\"&$N$5,Bogføring!D:D,\"=\"&A155)","v":0},{"$f":"IF(N155=0,\"\",SUMIFS(Bogføring!$A:$A,Bogføring!$E:$E,\"=\"&$P$5,Bogføring!$D:$D,\"=\"&A155))","v":""},{"$f":"SUMIFS(Bogføring!$H:$H,Bogføring!$G:$G,\"=\"&$P$5,Bogføring!$D:$D,\"=\"&A155)","v":0}]
[1005,"HKKF Hærens Konstabel- og Korporalfor.","Borgergade 101, Postboks 143",8600,"Silkeborg",null,"GIRO",null,null,1005,{"$f":"IF(L156=0,\"\",INDEX(Bogføring!$A:$A,MATCH(Tabel2[[#This Row],[Medl.nr. :]],Bogføring!$D:$D,0),0))","v":""},{"$f":"SUMIFS(Bogføring!H:H,Bogføring!E:E,\"=\"&$L$5,Bogføring!D:D,\"=\"&A156)","v":0},{"$f":"IF(N156=0,\"\",SUMIFS(Bogføring!A:A,Bogføring!E:E,\"=\"&$N$5,Bogføring!D:D,\"=\"&A156))","v":""},{"$f":"SUMIFS(Bogføring!H:H,Bogføring!E:E,\"=\"&$N$5,Bogføring!D:D,\"=\"&A156)","v":0},{"$f":"IF(N156=0,\"\",SUMIFS(Bogføring!$A:$A,Bogføring!$E:$E,\"=\"&$P$5,Bogføring!$D:$D,\"=\"&A156))","v":""},{"$f":"SUMIFS(Bogføring!$H:$H,Bogføring!$G:$G,\"=\"&$P$5,Bogføring!$D:$D,\"=\"&A156)","v":0}]
[1006,"BECK PACK SYSTEM a/s","Sandemandsvej 6",3700,"Rønne",null,"GIRO",null,null,1006,{"$f":"IF(L157=0,\"\",INDEX(Bogføring!$A:$A,MATCH(Tabel2[[#This Row],[Medl.nr. :]],Bogføring!$D:$D,0),0))","v":""},{"$f":"SUMIFS(Bogføring!H:H,Bogføring!E:E,\"=\"&$L$5,Bogføring!D:D,\"=\"&A157)","v":0},{"$f":"IF(N157=0,\"\",SUMIFS(Bogføring!A:A,Bogføring!E:E,\"=\"&$N$5,Bogføring!D:D,\"=\"&A157))","v":""},{"$f":"SUMIFS(Bogføring!H:H,Bogføring!E:E,\"=\"&$N$5,Bogføring!D:D,\"=\"&A157)","v":0},{"$f":"IF(N157=0,\"\",SUMIFS(Bogføring!$A:$A,Bogføring!$E:$E,\"=\"&$P$5,Bogføring!$D:$D,\"=\"&A157))","v":""},{"$f":"SUMIFS(Bogføring!$H:$H,Bogføring!$G:$G,\"=\"&$P$5,Bogføring!$D:$D,\"=\"&A157)","v":0}]
[1008,"Rønne Ejendomshandel","Søndergade 6",3700,"Rønne",56956886,"post@reh.dk",2020,null,1008,{"$f":"IF(L158=0,\"\",INDEX(Bogføring!$A:$A,MATCH(Tabel2[[#This Row],[Medl.nr. :]],Bogføring!$D:$D,0),0))","v":""},{"$f":"SUMIFS(Bogføring!H:H,Bogføring!E:E,\"=\"&$L$5,Bogføring!D:D,\"=\"&A158)","v":0},{"$f":"IF(N158=0,\"\",SUMIFS(Bogføring!A:A,Bogføring!E:E,\"=\"&$N$5,Bogføring!D:D,\"=\"&A158))","v":""},{"$f":"SUMIFS(Bogføring!H:H,Bogføring!E:E,\"=\"&$N$5,Bogføring!D:D,\"=\"&A158)","v":0},{"$f":"IF(N158=0,\"\",SUMIFS(Bogføring!$A:$A,Bogføring!$E:$E,\"=\"&$P$5,Bogføring!$D:$D,\"=\"&A158))","v":""},{"$f":"SUMIFS(Bogføring!$H:$H,Bogføring!$G:$G,\"=\"&$P$5,Bogføring!$D:$D,\"=\"&A158)","v":0}]
[1009,"Danbolig Bornholm","Nørregade 6",3700,"Rønne",56951995,"roenne@danbolig.dk",null,null,1009,{"$f":"IF(L159=0,\"\",INDEX(Bogføring!$A:$A,MATCH(Tabel2[[#This Row],[Medl.nr. :]],Bogføring!$D:$D,0),0))","v":""},{"$f":"SUMIFS(Bogføring!H:H,Bogføring!E:E,\"=\"&$L$5,Bogføring!D:D,\"=\"&A159)","v":0},{"$f":"IF(N159=0,\"\",SUMIFS(Bogføring!A:A,Bogføring!E:E,\"=\"&$N$5,Bogføring!D:D,\"=\"&A159))","v":""},{"$f":"SUMIFS(Bogføring!H:H,Bogføring!E:E,\"=\"&$N$5,Bogføring!D:D,\"=\"&A159)","v":0},{"$f":"IF(N159=0,\"\",SUMIFS(Bogføring!$A:$A,Bogføring!$E:$E,\"=\"&$P$5,Bogføring!$D:$D,\"=\"&A159))","v":""},{"$f":"SUMIFS(Bogføring!$H:$H,Bogføring!$G:$G,\"=\"&$P$5,Bogføring!$D:$D,\"=\"&A159)","v":0}]
[1010,"Danmarks Veteraner Afd. Bornholm v/KS Klaus RIIs Buchholdt","Glentevangen10",3700,"Rønne",20159791,"54atehena@gmail.com",2020,"betalt 2 gange 14/4/20",1010,{"$f":"IF(L160=0,\"\",INDEX(Bogføring!$A:$A,MATCH(Tabel2[[#This Row],[Medl.nr. :]],Bogføring!$D:$D,0),0))","v":""},{"$f":"SUMIFS(Bogføring!H:H,Bogføring!E:E,\"=\"&$L$5,Bogføring!D:D,\"=\"&A160)","v":0},{"$f":"IF(N160=0,\"\",SUMIFS(Bogføring!A:A,Bogføring!E:E,\"=\"&$N$5,Bogføring!D:D,\"=\"&A160))","v":""},{"$f":"SUMIFS(Bogføring!H:H,Bogføring!E:E,\"=\"&$N$5,Bogføring!D:D,\"=\"&A160)","v":0},{"$f":"IF(N160=0,\"\",SUMIFS(Bogføring!$A:$A,Bogføring!$E:$E,\"=\"&$P$5,Bogføring!$D:$D,\"=\"&A160))","v":""},{"$f":"SUMIFS(Bogføring!$H:$H,Bogføring!$G:$G,\"=\"&$P$5,Bogføring!$D:$D,\"=\"&A160)","v":0}]
[null,null,null,null,null,null,null,null,null,"",{"$f":"IF(L161=0,\"\",INDEX(Bogføring!$A:$A,MATCH(Tabel2[[#This Row],[Medl.nr. :]],Bogføring!$D:$D,0),0))","v":""},{"$f":"SUMIFS(Bogføring!H:H,Bogføring!E:E,\"=\"&$L$5,Bogføring!D:D,\"=\"&A161)","v":0},{"$f":"IF(N161=0,\"\",SUMIFS(Bogføring!A:A,Bogføring!E:E,\"=\"&$N$5,Bogføring!D:D,\"=\"&A161))","v":""},{"$f":"SUMIFS(Bogføring!H:H,Bogføring!E:E,\"=\"&$N$5,Bogføring!D:D,\"=\"&A161)","v":0},{"$f":"IF(N161=0,\"\",SUMIFS(Bogføring!$A:$A,Bogføring!$E:$E,\"=\"&$P$5,Bogføring!$D:$D,\"=\"&A161))","v":""},{"$f":"SUMIFS(Bogføring!$H:$H,Bogføring!$G:$G,\"=\"&$P$5,Bogføring!$D:$D,\"=\"&A161)","v":0}]
[null,null,null,null,null,null,null,null,null,"",{"$f":"IF(L162=0,\"\",INDEX(Bogføring!$A:$A,MATCH(Tabel2[[#This Row],[Medl.nr. :]],Bogføring!$D:$D,0),0))","v":""},{"$f":"SUMIFS(Bogføring!H:H,Bogføring!E:E,\"=\"&$L$5,Bogføring!D:D,\"=\"&A162)","v":0},{"$f":"IF(N162=0,\"\",SUMIFS(Bogføring!A:A,Bogføring!E:E,\"=\"&$N$5,Bogføring!D:D,\"=\"&A162))","v":""},{"$f":"SUMIFS(Bogføring!H:H,Bogføring!E:E,\"=\"&$N$5,Bogføring!D:D,\"=\"&A162)","v":0},{"$f":"IF(N162=0,\"\",SUMIFS(Bogføring!$A:$A,Bogføring!$E:$E,\"=\"&$P$5,Bogføring!$D:$D,\"=\"&A162))","v":""},{"$f":"SUMIFS(Bogføring!$H:$H,Bogføring!$G:$G,\"=\"&$P$5,Bogføring!$D:$D,\"=\"&A162)","v":0}]
[null,null,null,null,null,null,null,null,null,"",{"$f":"IF(L163=0,\"\",INDEX(Bogføring!$A:$A,MATCH(Tabel2[[#This Row],[Medl.nr. :]],Bogføring!$D:$D,0),0))","v":""},{"$f":"SUMIFS(Bogføring!H:H,Bogføring!E:E,\"=\"&$L$5,Bogføring!D:D,\"=\"&A163)","v":0},{"$f":"IF(N163=0,\"\",SUMIFS(Bogføring!A:A,Bogføring!E:E,\"=\"&$N$5,Bogføring!D:D,\"=\"&A163))","v":""},{"$f":"SUMIFS(Bogføring!H:H,Bogføring!E:E,\"=\"&$N$5,Bogføring!D:D,\"=\"&A163)","v":0},{"$f":"IF(N163=0,\"\",SUMIFS(Bogføring!$A:$A,Bogføring!$E:$E,\"=\"&$P$5,Bogføring!$D:$D,\"=\"&A163))","v":""},{"$f":"SUMIFS(Bogføring!$H:$H,Bogføring!$G:$G,\"=\"&$P$5,Bogføring!$D:$D,\"=\"&A163)","v":0}]
[null,null,null,null,null,null,null,null,null,"",{"$f":"IF(L164=0,\"\",INDEX(Bogføring!$A:$A,MATCH(Tabel2[[#This Row],[Medl.nr. :]],Bogføring!$D:$D,0),0))","v":""},{"$f":"SUMIFS(Bogføring!H:H,Bogføring!E:E,\"=\"&$L$5,Bogføring!D:D,\"=\"&A164)","v":0},{"$f":"IF(N164=0,\"\",SUMIFS(Bogføring!A:A,Bogføring!E:E,\"=\"&$N$5,Bogføring!D:D,\"=\"&A164))","v":""},{"$f":"SUMIFS(Bogføring!H:H,Bogføring!E:E,\"=\"&$N$5,Bogføring!D:D,\"=\"&A164)","v":0},{"$f":"IF(N164=0,\"\",SUMIFS(Bogføring!$A:$A,Bogføring!$E:$E,\"=\"&$P$5,Bogføring!$D:$D,\"=\"&A164))","v":""},{"$f":"SUMIFS(Bogføring!$H:$H,Bogføring!$G:$G,\"=\"&$P$5,Bogføring!$D:$D,\"=\"&A164)","v":0}]
[null,null,null,null,null,null,null,null,null,"",{"$f":"IF(L165=0,\"\",INDEX(Bogføring!$A:$A,MATCH(Tabel2[[#This Row],[Medl.nr. :]],Bogføring!$D:$D,0),0))","v":""},{"$f":"SUMIFS(Bogføring!H:H,Bogføring!E:E,\"=\"&$L$5,Bogføring!D:D,\"=\"&A165)","v":0},{"$f":"IF(N165=0,\"\",SUMIFS(Bogføring!A:A,Bogføring!E:E,\"=\"&$N$5,Bogføring!D:D,\"=\"&A165))","v":""},{"$f":"SUMIFS(Bogføring!H:H,Bogføring!E:E,\"=\"&$N$5,Bogføring!D:D,\"=\"&A165)","v":0},{"$f":"IF(N165=0,\"\",SUMIFS(Bogføring!$A:$A,Bogføring!$E:$E,\"=\"&$P$5,Bogføring!$D:$D,\"=\"&A165))","v":""},{"$f":"SUMIFS(Bogføring!$H:$H,Bogføring!$G:$G,\"=\"&$P$5,Bogføring!$D:$D,\"=\"&A165)","v":0}]
[null,null,null,null,null,null,null,null,null,{"$f":"IF(A166=\"\",\"\",A166)","v":""},{"$f":"IF(L166=0,\"\",INDEX(Bogføring!$A:$A,MATCH(Tabel2[[#This Row],[Medl.nr. :]],Bogføring!$D:$D,0),0))","v":""},{"$f":"SUMIFS(Bogføring!H:H,Bogføring!E:E,\"=\"&$L$5,Bogføring!D:D,\"=\"&A166)","v":0},{"$f":"IF(N166=0,\"\",SUMIFS(Bogføring!A:A,Bogføring!E:E,\"=\"&$N$5,Bogføring!D:D,\"=\"&A166))","v":""},{"$f":"SUMIFS(Bogføring!H:H,Bogføring!E:E,\"=\"&$N$5,Bogføring!D:D,\"=\"&A166)","v":0},{"$f":"IF(N166=0,\"\",SUMIFS(Bogføring!$A:$A,Bogføring!$E:$E,\"=\"&$P$5,Bogføring!$D:$D,\"=\"&A166))","v":""},{"$f":"SUMIFS(Bogføring!$H:$H,Bogføring!$G:$G,\"=\"&$P$5,Bogføring!$D:$D,\"=\"&A166)","v":0}]
[null,null,null,null,null,null,null,null,null,""]
[null,null,null,null,null,null,null,null,null,""]
[null,null,null,null,null,null,null,null,null,""]
[null,null,null,null,null,null,null,null,null,""]
[null,null,null,null,null,null,null,null,null,""]
[null,null,null,null,null,null,null,null,null,""]
[null,null,null,null,null,null,null,null,null,""]
[null,null,null,null,null,null,null,null,null,""]
[null,null,null,null,null,null,null,null,null,""]
[null,null,null,null,null,null,null,null,null,""]
[null,null,null,null,null,null,null,null,null,""]
[null,null,null,null,null,null,null,null,null,""]
[null,null,null,null,null,null,null,null,null,""]
[null,null,null,null,null,null,null,null,null,""]

{"sheet":"Afv %","index":4,"n_rows":61,"n_cols":10,"rows_kept":61,"cut":false,"hidden":true,"merged":[[0,1,0,9],[6,1,6,10],[7,3,7,4],[7,5,7,6],[7,7,7,8],[4,1,5,9]]}
[null,{"$f":"T!B9","v":"xxxxxxxxxxxxx"}]
[]
[]
[]
[null,{"$f":"\"Afvigelser \"&T!C2","v":"Afvigelser 2022"}]
[]
[null,{"$f":"T!A7","v":"Periode : 01-01-2022 - 16-05-2022"}]
[null,null,null,null,null,"Aktuelt år",null,"Sidste år",null,"Forrige år"]
[null,null,null,null,null,{"$f":"T!C2","v":2022},"afv i %",{"$f":"F9-1","v":2021},"afv i %",{"$f":"F9-2","v":2020}]
[null,"Indtægter"]
[]
[1000,{"$f":"IFERROR(VLOOKUP(A12,Kontoplan!$A$2:$D$31,2,0),\"\")","v":"Entre"},null,null,{"$f":"IFERROR(IF(D12=0,\"\",(D12-H12)/H12),\"\")","v":""},{"$f":"SUMIFS(Bogføring!$H:$H,Bogføring!$A:$A,\">=\"&T!$C$4,Bogføring!$A:$A,\"<=\"&T!$C$5,Bogføring!$F:$F,A12)-SUMIFS(Bogføring!$G:$G,Bogføring!$A:$A,\">=\"&T!$C$4,Bogføring!$A:$A,\"<=\"&T!$C$5,Bogføring!$F:$F,A12)","v":8740},{"$f":"IFERROR((F12-H12)/H12,\"\")","v":-0.95372110878716476},{"$f":"SUMIFS(Bogføring!$H:$H,Bogføring!$A:$A,\">=\"&T!$D$4,Bogføring!$A:$A,\"<=\"&T!$D$5,Bogføring!$F:$F,A12)","v":188855.00000000003},{"$f":"IFERROR((H12-J12)/J12,\"\")","v":""},{"$f":"SUMIFS(Bogføring!$H:$H,Bogføring!$A:$A,\">=\"&T!$E$4,Bogføring!$A:$A,\"<=\"&T!$E$5,Bogføring!$F:$F,A12)","v":0}]
[1010,{"$f":"IFERROR(VLOOKUP(A13,Kontoplan!$A$2:$D$31,2,0),\"\")","v":"Kiosk salg"},null,null,{"$f":"IFERROR(IF(D13=0,\"\",(D13-H13)/H13),\"\")","v":""},{"$f":"SUMIFS(Bogføring!$H:$H,Bogføring!$A:$A,\">=\"&T!$C$4,Bogføring!$A:$A,\"<=\"&T!$C$5,Bogføring!$F:$F,A13)-SUMIFS(Bogføring!$G:$G,Bogføring!$A:$A,\">=\"&T!$C$4,Bogføring!$A:$A,\"<=\"&T!$C$5,Bogføring!$F:$F,A13)","v":75},{"$f":"IFERROR((F13-H13)/H13,\"\")","v":-0.99532470835530718},{"$f":"SUMIFS(Bogføring!$H:$H,Bogføring!$A:$A,\">=\"&T!$D$4,Bogføring!$A:$A,\"<=\"&T!$D$5,Bogføring!$F:$F,A13)-SUMIFS(Bogføring!$G:$G,Bogføring!$A:$A,\">=\"&T!$D$4,Bogføring!$A:$A,\"<=\"&T!$D$5,Bogføring!$F:$F,A13)","v":16041.779999999999},{"$f":"IFERROR((H13-J13)/J13,\"\")","v":""},{"$f":"SUMIFS(Bogføring!$H:$H,Bogføring!$A:$A,\">=\"&T!$E$4,Bogføring!$A:$A,\"<=\"&T!$E$5,Bogføring!$F:$F,A13)","v":0}]
[1020,{"$f":"IFERROR(VLOOKUP(A14,Kontoplan!$A$2:$D$31,2,0),\"\")","v":"Tilskud fra BRK/ drifttilskud"},null,null,{"$f":"IFERROR(IF(D14=0,\"\",(D14-H14)/H14),\"\")","v":""},{"$f":"SUMIFS(Bogføring!$H:$H,Bogføring!$A:$A,\">=\"&T!$C$4,Bogføring!$A:$A,\"<=\"&T!$C$5,Bogføring!$F:$F,A14)-SUMIFS(Bogføring!$G:$G,Bogføring!$A:$A,\">=\"&T!$C$4,Bogføring!$A:$A,\"<=\"&T!$C$5,Bogføring!$F:$F,A14)","v":74021},{"$f":"IFERROR((F14-H14)/H14,\"\")","v":2.1007476068305334E-2},{"$f":"SUMIFS(Bogføring!$H:$H,Bogføring!$A:$A,\">=\"&T!$D$4,Bogføring!$A:$A,\"<=\"&T!$D$5,Bogføring!$F:$F,A14)-SUMIFS(Bogføring!$G:$G,Bogføring!$A:$A,\">=\"&T!$D$4,Bogføring!$A:$A,\"<=\"&T!$D$5,Bogføring!$F:$F,A14)","v":72498},{"$f":"IFERROR((H14-J14)/J14,\"\")","v":""},{"$f":"SUMIFS(Bogføring!$H:$H,Bogføring!$A:$A,\">=\"&T!$E$4,Bogføring!$A:$A,\"<=\"&T!$E$5,Bogføring!$F:$F,A14)","v":0}]
[1030,{"$f":"IFERROR(VLOOKUP(A15,Kontoplan!$A$2:$D$31,2,0),\"\")","v":"Tilskud fra KVB"},null,null,"",{"$f":"SUMIFS(Bogføring!$H:$H,Bogføring!$A:$A,\">=\"&T!$C$4,Bogføring!$A:$A,\"<=\"&T!$C$5,Bogføring!$F:$F,A15)-SUMIFS(Bogføring!$G:$G,Bogføring!$A:$A,\">=\"&T!$C$4,Bogføring!$A:$A,\"<=\"&T!$C$5,Bogføring!$F:$F,A15)","v":20000},{"$f":"IFERROR((F15-H15)/H15,\"\")","v":-0.33333333333333331},{"$f":"SUMIFS(Bogføring!$H:$H,Bogføring!$A:$A,\">=\"&T!$D$4,Bogføring!$A:$A,\"<=\"&T!$D$5,Bogføring!$F:$F,A15)-SUMIFS(Bogføring!$G:$G,Bogføring!$A:$A,\">=\"&T!$D$4,Bogføring!$A:$A,\"<=\"&T!$D$5,Bogføring!$F:$F,A15)","v":30000},{"$f":"IFERROR((H15-J15)/J15,\"\")","v":""},{"$f":"SUMIFS(Bogføring!$H:$H,Bogføring!$A:$A,\">=\"&T!$E$4,Bogføring!$A:$A,\"<=\"&T!$E$5,Bogføring!$F:$F,A15)","v":0}]
[1040,{"$f":"IFERROR(VLOOKUP(A16,Kontoplan!$A$2:$D$31,2,0),\"\")","v":"Fonde/Gaver"},null,null,"",{"$f":"SUMIFS(Bogføring!$H:$H,Bogføring!$A:$A,\">=\"&T!$C$4,Bogføring!$A:$A,\"<=\"&T!$C$5,Bogføring!$F:$F,A16)-SUMIFS(Bogføring!$G:$G,Bogføring!$A:$A,\">=\"&T!$C$4,Bogføring!$A:$A,\"<=\"&T!$C$5,Bogføring!$F:$F,A16)","v":0},-1,{"$f":"SUMIFS(Bogføring!$H:$H,Bogføring!$A:$A,\">=\"&T!$D$4,Bogføring!$A:$A,\"<=\"&T!$D$5,Bogføring!$F:$F,A16)-SUMIFS(Bogføring!$G:$G,Bogføring!$A:$A,\">=\"&T!$D$4,Bogføring!$A:$A,\"<=\"&T!$D$5,Bogføring!$F:$F,A16)","v":30000},{"$f":"IFERROR((H16-J16)/J16,\"\")","v":""},{"$f":"SUMIFS(Bogføring!$H:$H,Bogføring!$A:$A,\">=\"&T!$E$4,Bogføring!$A:$A,\"<=\"&T!$E$5,Bogføring!$F:$F,A16)","v":0}]
[1050,{"$f":"IFERROR(VLOOKUP(A17,Kontoplan!$A$2:$D$31,2,0),\"\")","v":"Aktiviteter"},null,null,"",{"$f":"SUMIFS(Bogføring!$H:$H,Bogføring!$A:$A,\">=\"&T!$C$4,Bogføring!$A:$A,\"<=\"&T!$C$5,Bogføring!$F:$F,A17)-SUMIFS(Bogføring!$G:$G,Bogføring!$A:$A,\">=\"&T!$C$4,Bogføring!$A:$A,\"<=\"&T!$C$5,Bogføring!$F:$F,A17)","v":0},"",{"$f":"SUMIFS(Bogføring!$H:$H,Bogføring!$A:$A,\">=\"&T!$D$4,Bogføring!$A:$A,\"<=\"&T!$D$5,Bogføring!$F:$F,A17)-SUMIFS(Bogføring!$G:$G,Bogføring!$A:$A,\">=\"&T!$D$4,Bogføring!$A:$A,\"<=\"&T!$D$5,Bogføring!$F:$F,A17)","v":0},{"$f":"IFERROR((H17-J17)/J17,\"\")","v":""},{"$f":"SUMIFS(Bogføring!$H:$H,Bogføring!$A:$A,\">=\"&T!$E$4,Bogføring!$A:$A,\"<=\"&T!$E$5,Bogføring!$F:$F,A17)","v":0}]
[1070,{"$f":"IFERROR(VLOOKUP(A18,Kontoplan!$A$2:$D$31,2,0),\"\")","v":"Pengegaver"},null,null,"",{"$f":"SUMIFS(Bogføring!$H:$H,Bogføring!$A:$A,\">=\"&T!$C$4,Bogføring!$A:$A,\"<=\"&T!$C$5,Bogføring!$F:$F,A18)-SUMIFS(Bogføring!$G:$G,Bogføring!$A:$A,\">=\"&T!$C$4,Bogføring!$A:$A,\"<=\"&T!$C$5,Bogføring!$F:$F,A18)","v":0},"",{"$f":"SUMIFS(Bogføring!$H:$H,Bogføring!$A:$A,\">=\"&T!$D$4,Bogføring!$A:$A,\"<=\"&T!$D$5,Bogføring!$F:$F,A18)","v":0},"",{"$f":"SUMIFS(Bogføring!$H:$H,Bogføring!$A:$A,\">=\"&T!$E$4,Bogføring!$A:$A,\"<=\"&T!$E$5,Bogføring!$F:$F,A18)","v":0}]
[1080,{"$f":"IFERROR(VLOOKUP(A19,Kontoplan!$A$2:$D$31,2,0),\"\")","v":"Flaskepant retur"},null,null,"",{"$f":"SUMIFS(Bogføring!$H:$H,Bogføring!$A:$A,\">=\"&T!$C$4,Bogføring!$A:$A,\"<=\"&T!$C$5,Bogføring!$F:$F,A19)-SUMIFS(Bogføring!$G:$G,Bogføring!$A:$A,\">=\"&T!$C$4,Bogføring!$A:$A,\"<=\"&T!$C$5,Bogføring!$F:$F,A19)","v":0},"",{"$f":"SUMIFS(Bogføring!$H:$H,Bogføring!$A:$A,\">=\"&T!$D$4,Bogføring!$A:$A,\"<=\"&T!$D$5,Bogføring!$F:$F,A20)","v":0},"",{"$f":"SUMIFS(Bogføring!$H:$H,Bogføring!$A:$A,\">=\"&T!$E$4,Bogføring!$A:$A,\"<=\"&T!$E$5,Bogføring!$F:$F,A20)","v":0}]
[1090,{"$f":"IFERROR(VLOOKUP(A20,Kontoplan!$A$2:$D$31,2,0),\"\")","v":"Kassedifferance"},null,null,"",{"$f":"SUMIFS(Bogføring!$H:$H,Bogføring!$A:$A,\">=\"&T!$C$4,Bogføring!$A:$A,\"<=\"&T!$C$5,Bogføring!$F:$F,A20)-SUMIFS(Bogføring!$G:$G,Bogføring!$A:$A,\">=\"&T!$C$4,Bogføring!$A:$A,\"<=\"&T!$C$5,Bogføring!$F:$F,A20)","v":0},"",{"$f":"SUMIFS(Bogføring!$H:$H,Bogføring!$A:$A,\">=\"&T!$D$4,Bogføring!$A:$A,\"<=\"&T!$D$5,Bogføring!$F:$F,A21)","v":0},"",{"$f":"SUMIFS(Bogføring!$H:$H,Bogføring!$A:$A,\">=\"&T!$E$4,Bogføring!$A:$A,\"<=\"&T!$E$5,Bogføring!$F:$F,A21)","v":0}]
[null,{"$f":"IFERROR(VLOOKUP(A21,Kontoplan!$A$2:$D$31,2,0),\"\")","v":""},null,null,"",{"$f":"SUMIFS(Bogføring!$H:$H,Bogføring!$A:$A,\">=\"&T!$C$4,Bogføring!$A:$A,\"<=\"&T!$C$5,Bogføring!$F:$F,A21)-SUMIFS(Bogføring!$G:$G,Bogføring!$A:$A,\">=\"&T!$C$4,Bogføring!$A:$A,\"<=\"&T!$C$5,Bogføring!$F:$F,A21)","v":0},"",{"$f":"SUMIFS(Bogføring!$H:$H,Bogføring!$A:$A,\">=\"&T!$D$4,Bogføring!$A:$A,\"<=\"&T!$D$5,Bogføring!$F:$F,A22)","v":0},"",{"$f":"SUMIFS(Bogføring!$H:$H,Bogføring!$A:$A,\">=\"&T!$E$4,Bogføring!$A:$A,\"<=\"&T!$E$5,Bogføring!$F:$F,A22)","v":0}]
[null,{"$f":"IFERROR(VLOOKUP(A22,Kontoplan!$A$2:$D$31,2,0),\"\")","v":""},null,null,"",{"$f":"SUMIFS(Bogføring!$H:$H,Bogføring!$A:$A,\">=\"&T!$C$4,Bogføring!$A:$A,\"<=\"&T!$C$5,Bogføring!$F:$F,A22)-SUMIFS(Bogføring!$G:$G,Bogføring!$A:$A,\">=\"&T!$C$4,Bogføring!$A:$A,\"<=\"&T!$C$5,Bogføring!$F:$F,A22)","v":0},-1,{"$f":"SUMIFS(Bogføring!$H:$H,Bogføring!$A:$A,\">=\"&T!$D$4,Bogføring!$A:$A,\"<=\"&T!$D$5,Bogføring!$F:$F,A23)","v":6538.1900000000005},"",{"$f":"SUMIFS(Bogføring!$H:$H,Bogføring!$A:$A,\">=\"&T!$E$4,Bogføring!$A:$A,\"<=\"&T!$E$5,Bogføring!$F:$F,A23)","v":0}]
[1130,{"$f":"IFERROR(VLOOKUP(A23,Kontoplan!$A$2:$D$31,2,0),\"\")","v":"Diverse Indtægter"},null,null,"",{"$f":"SUMIFS(Bogføring!$H:$H,Bogføring!$A:$A,\">=\"&T!$C$4,Bogføring!$A:$A,\"<=\"&T!$C$5,Bogføring!$F:$F,A23)-SUMIFS(Bogføring!$G:$G,Bogføring!$A:$A,\">=\"&T!$C$4,Bogføring!$A:$A,\"<=\"&T!$C$5,Bogføring!$F:$F,A23)","v":532.1},"",{"$f":"SUMIFS(Bogføring!$H:$H,Bogføring!$A:$A,\">=\"&T!$D$4,Bogføring!$A:$A,\"<=\"&T!$D$5,Bogføring!$F:$F,A24)","v":0},"",{"$f":"SUMIFS(Bogføring!$H:$H,Bogføring!$A:$A,\">=\"&T!$E$4,Bogføring!$A:$A,\"<=\"&T!$E$5,Bogføring!$F:$F,A24)","v":0}]
[null,{"$f":"IFERROR(VLOOKUP(A24,Kontoplan!$A$2:$D$31,2,0),\"\")","v":""},null,null,"",{"$f":"SUMIFS(Bogføring!$H:$H,Bogføring!$A:$A,\">=\"&T!$C$4,Bogføring!$A:$A,\"<=\"&T!$C$5,Bogføring!$F:$F,A24)-SUMIFS(Bogføring!$G:$G,Bogføring!$A:$A,\">=\"&T!$C$4,Bogføring!$A:$A,\"<=\"&T!$C$5,Bogføring!$F:$F,A24)","v":0},"",{"$f":"SUMIFS(Bogføring!$H:$H,Bogføring!$A:$A,\">=\"&T!$D$4,Bogføring!$A:$A,\"<=\"&T!$D$5,Bogføring!$F:$F,#REF!)","v":0},"",{"$f":"SUMIFS(Bogføring!$H:$H,Bogføring!$A:$A,\">=\"&T!$E$4,Bogføring!$A:$A,\"<=\"&T!$E$5,Bogføring!$F:$F,#REF!)","v":0}]
[null,{"$f":"IFERROR(VLOOKUP(A25,Kontoplan!$A$2:$D$31,2,0),\"\")","v":""},null,null,"",{"$f":"SUMIFS(Bogføring!$H:$H,Bogføring!$A:$A,\">=\"&T!$C$4,Bogføring!$A:$A,\"<=\"&T!$C$5,Bogføring!$F:$F,A25)-SUMIFS(Bogføring!$G:$G,Bogføring!$A:$A,\">=\"&T!$C$4,Bogføring!$A:$A,\"<=\"&T!$C$5,Bogføring!$F:$F,A25)","v":0},"",{"$f":"SUMIFS(Bogføring!$H:$H,Bogføring!$A:$A,\">=\"&T!$D$4,Bogføring!$A:$A,\"<=\"&T!$D$5,Bogføring!$F:$F,A25)","v":0},"",{"$f":"SUMIFS(Bogføring!$H:$H,Bogføring!$A:$A,\">=\"&T!$E$4,Bogføring!$A:$A,\"<=\"&T!$E$5,Bogføring!$F:$F,A25)","v":0}]
[null,null,null,null,null,null,""]
[null,"Indtægter i alt",null,null,"",{"$f":"SUM(F12:F25)","v":103368.1},-0.69945277418445806,{"$f":"SUM(H12:H25)","v":343932.97000000003},{"$f":"IFERROR((H27-J27)/H27,\"\")","v":1},{"$f":"SUM(J12:J25)","v":0}]
[null,null,null,null,{"$f":"IFERROR((D28-F28)/D28,\"\")","v":""},null,{"$f":"IFERROR((F28-H28)/F28,\"\")","v":""},null,{"$f":"IFERROR((H28-J28)/H28,\"\")","v":""}]
[null,"Udgifter",null,null,{"$f":"IFERROR((D29-F29)/D29,\"\")","v":""},null,{"$f":"IFERROR((F29-H29)/F29,\"\")","v":""},null,{"$f":"IFERROR((H29-J29)/H29,\"\")","v":""}]
[null,null,null,null,{"$f":"IFERROR((D30-F30)/D30,\"\")","v":""},null,{"$f":"IFERROR((F30-H30)/F30,\"\")","v":""},null,{"$f":"IFERROR((H30-J30)/H30,\"\")","v":""}]
[2000,{"$f":"IFERROR(VLOOKUP(A31,Kontoplan!$A$2:$D$31,2,0),\"\")","v":""},null,null,{"$f":"IFERROR(IF(D31=0,\"\",(D31-H31)/H31),\"\")","v":""},{"$f":"SUMIFS(Bogføring!$G:$G,Bogføring!$A:$A,\">=\"&T!$C$4,Bogføring!$A:$A,\"<=\"&T!$C$5,Bogføring!$F:$F,A31)-SUMIFS(Bogføring!$H:$H,Bogføring!$A:$A,\">=\"&T!$C$4,Bogføring!$A:$A,\"<=\"&T!$C$5,Bogføring!$F:$F,A31)","v":109.5},{"$f":"IFERROR((F31-H31)/H31,\"\")","v":-0.81756993152624824},{"$f":"SUMIFS(Bogføring!$G:$G,Bogføring!$A:$A,\">=\"&T!$D$4,Bogføring!$A:$A,\"<=\"&T!$D$5,Bogføring!$F:$F,A31)","v":600.23},{"$f":"IFERROR((H31-J31)/J31,\"\")","v":""},{"$f":"SUMIFS(Bogføring!$G:$G,Bogføring!$A:$A,\">=\"&T!$E$4,Bogføring!$A:$A,\"<=\"&T!$E$5,Bogføring!$F:$F,A31)","v":0}]
[2010,{"$f":"IFERROR(VLOOKUP(A32,Kontoplan!$A$2:$D$31,2,0),\"\")","v":""},null,null,{"$f":"IFERROR(IF(D32=0,\"\",(D32-H32)/H32),\"\")","v":""},{"$f":"SUMIFS(Bogføring!$G:$G,Bogføring!$A:$A,\">=\"&T!$C$4,Bogføring!$A:$A,\"<=\"&T!$C$5,Bogføring!$F:$F,A32)-SUMIFS(Bogføring!$H:$H,Bogføring!$A:$A,\">=\"&T!$C$4,Bogføring!$A:$A,\"<=\"&T!$C$5,Bogføring!$F:$F,A32)","v":27.5},{"$f":"IFERROR((F32-H32)/H32,\"\")","v":-0.98761729795933073},{"$f":"SUMIFS(Bogføring!$G:$G,Bogføring!$A:$A,\">=\"&T!$D$4,Bogføring!$A:$A,\"<=\"&T!$D$5,Bogføring!$F:$F,A32)","v":2220.84},{"$f":"IFERROR((H32-J32)/J32,\"\")","v":""},{"$f":"SUMIFS(Bogføring!$G:$G,Bogføring!$A:$A,\">=\"&T!$E$4,Bogføring!$A:$A,\"<=\"&T!$E$5,Bogføring!$F:$F,A32)","v":0}]
[2020,{"$f":"IFERROR(VLOOKUP(A33,Kontoplan!$A$2:$D$31,2,0),\"\")","v":""},null,null,"",{"$f":"SUMIFS(Bogføring!$G:$G,Bogføring!$A:$A,\">=\"&T!$C$4,Bogføring!$A:$A,\"<=\"&T!$C$5,Bogføring!$F:$F,A33)-SUMIFS(Bogføring!$H:$H,Bogføring!$A:$A,\">=\"&T!$C$4,Bogføring!$A:$A,\"<=\"&T!$C$5,Bogføring!$F:$F,A33)","v":0},-1,{"$f":"SUMIFS(Bogføring!$G:$G,Bogføring!$A:$A,\">=\"&T!$D$4,Bogføring!$A:$A,\"<=\"&T!$D$5,Bogføring!$F:$F,A33)","v":25000},"",{"$f":"SUMIFS(Bogføring!$G:$G,Bogføring!$A:$A,\">=\"&T!$E$4,Bogføring!$A:$A,\"<=\"&T!$E$5,Bogføring!$F:$F,A33)","v":0}]
[2025,{"$f":"IFERROR(VLOOKUP(A34,Kontoplan!$A$2:$D$31,2,0),\"\")","v":""},null,null,"",{"$f":"SUMIFS(Bogføring!$G:$G,Bogføring!$A:$A,\">=\"&T!$C$4,Bogføring!$A:$A,\"<=\"&T!$C$5,Bogføring!$F:$F,A34)-SUMIFS(Bogføring!$H:$H,Bogføring!$A:$A,\">=\"&T!$C$4,Bogføring!$A:$A,\"<=\"&T!$C$5,Bogføring!$F:$F,A34)","v":490.63},-0.54688769855929065,{"$f":"SUMIFS(Bogføring!$G:$G,Bogføring!$A:$A,\">=\"&T!$D$4,Bogføring!$A:$A,\"<=\"&T!$D$5,Bogføring!$F:$F,A34)","v":1082.7999999999997},"",{"$f":"SUMIFS(Bogføring!$G:$G,Bogføring!$A:$A,\">=\"&T!$E$4,Bogføring!$A:$A,\"<=\"&T!$E$5,Bogføring!$F:$F,A34)","v":0}]
[2030,{"$f":"IFERROR(VLOOKUP(A35,Kontoplan!$A$2:$D$31,2,0),\"\")","v":""},null,null,"",{"$f":"SUMIFS(Bogføring!$G:$G,Bogføring!$A:$A,\">=\"&T!$C$4,Bogføring!$A:$A,\"<=\"&T!$C$5,Bogføring!$F:$F,A35)-SUMIFS(Bogføring!$H:$H,Bogføring!$A:$A,\">=\"&T!$C$4,Bogføring!$A:$A,\"<=\"&T!$C$5,Bogføring!$F:$F,A35)","v":329.7},-0.99414253103419248,{"$f":"SUMIFS(Bogføring!$G:$G,Bogføring!$A:$A,\">=\"&T!$D$4,Bogføring!$A:$A,\"<=\"&T!$D$5,Bogføring!$F:$F,A35)","v":56287.11},"",{"$f":"SUMIFS(Bogføring!$G:$G,Bogføring!$A:$A,\">=\"&T!$E$4,Bogføring!$A:$A,\"<=\"&T!$E$5,Bogføring!$F:$F,A35)","v":0}]
[2040,{"$f":"IFERROR(VLOOKUP(A36,Kontoplan!$A$2:$D$31,2,0),\"\")","v":""},null,null,"",{"$f":"SUMIFS(Bogføring!$G:$G,Bogføring!$A:$A,\">=\"&T!$C$4,Bogføring!$A:$A,\"<=\"&T!$C$5,Bogføring!$F:$F,A36)-SUMIFS(Bogføring!$H:$H,Bogføring!$A:$A,\">=\"&T!$C$4,Bogføring!$A:$A,\"<=\"&T!$C$5,Bogføring!$F:$F,A36)","v":27955.019999999997},-0.23317393347339474,{"$f":"SUMIFS(Bogføring!$G:$G,Bogføring!$A:$A,\">=\"&T!$D$4,Bogføring!$A:$A,\"<=\"&T!$D$5,Bogføring!$F:$F,A36)","v":36455.490000000005},"",{"$f":"SUMIFS(Bogføring!$G:$G,Bogføring!$A:$A,\">=\"&T!$E$4,Bogføring!$A:$A,\"<=\"&T!$E$5,Bogføring!$F:$F,A36)","v":0}]
[2055,{"$f":"IFERROR(VLOOKUP(A37,Kontoplan!$A$2:$D$31,2,0),\"\")","v":""},null,null,"",{"$f":"SUMIFS(Bogføring!$G:$G,Bogføring!$A:$A,\">=\"&T!$C$4,Bogføring!$A:$A,\"<=\"&T!$C$5,Bogføring!$F:$F,A37)-SUMIFS(Bogføring!$H:$H,Bogføring!$A:$A,\">=\"&T!$C$4,Bogføring!$A:$A,\"<=\"&T!$C$5,Bogføring!$F:$F,A37)","v":0},-1,{"$f":"SUMIFS(Bogføring!$G:$G,Bogføring!$A:$A,\">=\"&T!$D$4,Bogføring!$A:$A,\"<=\"&T!$D$5,Bogføring!$F:$F,A37)","v":693.65},"",{"$f":"SUMIFS(Bogføring!$G:$G,Bogføring!$A:$A,\">=\"&T!$E$4,Bogføring!$A:$A,\"<=\"&T!$E$5,Bogføring!$F:$F,A37)","v":0}]
[2060,{"$f":"IFERROR(VLOOKUP(A38,Kontoplan!$A$2:$D$31,2,0),\"\")","v":""},null,null,"",{"$f":"SUMIFS(Bogføring!$G:$G,Bogføring!$A:$A,\">=\"&T!$C$4,Bogføring!$A:$A,\"<=\"&T!$C$5,Bogføring!$F:$F,A38)-SUMIFS(Bogføring!$H:$H,Bogføring!$A:$A,\">=\"&T!$C$4,Bogføring!$A:$A,\"<=\"&T!$C$5,Bogføring!$F:$F,A38)","v":2230.96},-0.86695125653104521,{"$f":"SUMIFS(Bogføring!$G:$G,Bogføring!$A:$A,\">=\"&T!$D$4,Bogføring!$A:$A,\"<=\"&T!$D$5,Bogføring!$F:$F,A38)","v":16767.989999999998},"",{"$f":"SUMIFS(Bogføring!$G:$G,Bogføring!$A:$A,\">=\"&T!$E$4,Bogføring!$A:$A,\"<=\"&T!$E$5,Bogføring!$F:$F,A38)","v":0}]
[2065,{"$f":"IFERROR(VLOOKUP(A39,Kontoplan!$A$2:$D$31,2,0),\"\")","v":""},null,null,"",{"$f":"SUMIFS(Bogføring!$G:$G,Bogføring!$A:$A,\">=\"&T!$C$4,Bogføring!$A:$A,\"<=\"&T!$C$5,Bogføring!$F:$F,A39)-SUMIFS(Bogføring!$H:$H,Bogføring!$A:$A,\">=\"&T!$C$4,Bogføring!$A:$A,\"<=\"&T!$C$5,Bogføring!$F:$F,A39)","v":11386.63},-0.68006591637386904,{"$f":"SUMIFS(Bogføring!$G:$G,Bogføring!$A:$A,\">=\"&T!$D$4,Bogføring!$A:$A,\"<=\"&T!$D$5,Bogføring!$F:$F,A39)","v":35590.550000000003},"",{"$f":"SUMIFS(Bogføring!$G:$G,Bogføring!$A:$A,\">=\"&T!$E$4,Bogføring!$A:$A,\"<=\"&T!$E$5,Bogføring!$F:$F,A39)","v":0}]
[2070,{"$f":"IFERROR(VLOOKUP(A40,Kontoplan!$A$2:$D$31,2,0),\"\")","v":""},null,null,"",{"$f":"SUMIFS(Bogføring!$G:$G,Bogføring!$A:$A,\">=\"&T!$C$4,Bogføring!$A:$A,\"<=\"&T!$C$5,Bogføring!$F:$F,A40)-SUMIFS(Bogføring!$H:$H,Bogføring!$A:$A,\">=\"&T!$C$4,Bogføring!$A:$A,\"<=\"&T!$C$5,Bogføring!$F:$F,A40)","v":0},{"$f":"IFERROR((F40-H40)/H40,\"\")","v":-1},{"$f":"SUMIFS(Bogføring!$G:$G,Bogføring!$A:$A,\">=\"&T!$D$4,Bogføring!$A:$A,\"<=\"&T!$D$5,Bogføring!$F:$F,A40)","v":1462.5},"",{"$f":"SUMIFS(Bogføring!$G:$G,Bogføring!$A:$A,\">=\"&T!$E$4,Bogføring!$A:$A,\"<=\"&T!$E$5,Bogføring!$F:$F,A40)","v":0}]
[2090,{"$f":"IFERROR(VLOOKUP(A41,Kontoplan!$A$2:$D$31,2,0),\"\")","v":""},null,null,"",{"$f":"SUMIFS(Bogføring!$G:$G,Bogføring!$A:$A,\">=\"&T!$C$4,Bogføring!$A:$A,\"<=\"&T!$C$5,Bogføring!$F:$F,A41)-SUMIFS(Bogføring!$H:$H,Bogføring!$A:$A,\">=\"&T!$C$4,Bogføring!$A:$A,\"<=\"&T!$C$5,Bogføring!$F:$F,A41)","v":100},-0.96153846153846156,{"$f":"SUMIFS(Bogføring!$G:$G,Bogføring!$A:$A,\">=\"&T!$D$4,Bogføring!$A:$A,\"<=\"&T!$D$5,Bogføring!$F:$F,A41)","v":2600},"",{"$f":"SUMIFS(Bogføring!$G:$G,Bogføring!$A:$A,\">=\"&T!$E$4,Bogføring!$A:$A,\"<=\"&T!$E$5,Bogføring!$F:$F,A41)","v":0}]
[2100,{"$f":"IFERROR(VLOOKUP(A42,Kontoplan!$A$2:$D$31,2,0),\"\")","v":""},null,null,"",{"$f":"SUMIFS(Bogføring!$G:$G,Bogføring!$A:$A,\">=\"&T!$C$4,Bogføring!$A:$A,\"<=\"&T!$C$5,Bogføring!$F:$F,A42)-SUMIFS(Bogføring!$H:$H,Bogføring!$A:$A,\">=\"&T!$C$4,Bogføring!$A:$A,\"<=\"&T!$C$5,Bogføring!$F:$F,A42)","v":1405.25},-0.17832689170462454,{"$f":"SUMIFS(Bogføring!$G:$G,Bogføring!$A:$A,\">=\"&T!$D$4,Bogføring!$A:$A,\"<=\"&T!$D$5,Bogføring!$F:$F,A42)","v":1710.23},"",{"$f":"SUMIFS(Bogføring!$G:$G,Bogføring!$A:$A,\">=\"&T!$E$4,Bogføring!$A:$A,\"<=\"&T!$E$5,Bogføring!$F:$F,A42)","v":0}]
[2140,{"$f":"IFERROR(VLOOKUP(A43,Kontoplan!$A$2:$D$31,2,0),\"\")","v":""},null,null,"",{"$f":"SUMIFS(Bogføring!$G:$G,Bogføring!$A:$A,\">=\"&T!$C$4,Bogføring!$A:$A,\"<=\"&T!$C$5,Bogføring!$F:$F,A43)-SUMIFS(Bogføring!$H:$H,Bogføring!$A:$A,\">=\"&T!$C$4,Bogføring!$A:$A,\"<=\"&T!$C$5,Bogføring!$F:$F,A43)","v":0},-1,{"$f":"SUMIFS(Bogføring!$G:$G,Bogføring!$A:$A,\">=\"&T!$D$4,Bogføring!$A:$A,\"<=\"&T!$D$5,Bogføring!$F:$F,A43)","v":545},"",{"$f":"SUMIFS(Bogføring!$G:$G,Bogføring!$A:$A,\">=\"&T!$E$4,Bogføring!$A:$A,\"<=\"&T!$E$5,Bogføring!$F:$F,A43)","v":0}]
[2110,{"$f":"IFERROR(VLOOKUP(A44,Kontoplan!$A$2:$D$31,2,0),\"\")","v":""},null,null,"",{"$f":"SUMIFS(Bogføring!$G:$G,Bogføring!$A:$A,\">=\"&T!$C$4,Bogføring!$A:$A,\"<=\"&T!$C$5,Bogføring!$F:$F,A44)-SUMIFS(Bogføring!$H:$H,Bogføring!$A:$A,\">=\"&T!$C$4,Bogføring!$A:$A,\"<=\"&T!$C$5,Bogføring!$F:$F,A44)","v":1483.4},-0.75643155979692223,{"$f":"SUMIFS(Bogføring!$G:$G,Bogføring!$A:$A,\">=\"&T!$D$4,Bogføring!$A:$A,\"<=\"&T!$D$5,Bogføring!$F:$F,A44)","v":6090.28},"",{"$f":"SUMIFS(Bogføring!$G:$G,Bogføring!$A:$A,\">=\"&T!$E$4,Bogføring!$A:$A,\"<=\"&T!$E$5,Bogføring!$F:$F,A44)","v":0}]
[2120,{"$f":"IFERROR(VLOOKUP(A45,Kontoplan!$A$2:$D$31,2,0),\"\")","v":""},null,null,"",{"$f":"SUMIFS(Bogføring!$G:$G,Bogføring!$A:$A,\">=\"&T!$C$4,Bogføring!$A:$A,\"<=\"&T!$C$5,Bogføring!$F:$F,A45)-SUMIFS(Bogføring!$H:$H,Bogføring!$A:$A,\">=\"&T!$C$4,Bogføring!$A:$A,\"<=\"&T!$C$5,Bogføring!$F:$F,A45)","v":0},-1,{"$f":"SUMIFS(Bogføring!$G:$G,Bogføring!$A:$A,\">=\"&T!$D$4,Bogføring!$A:$A,\"<=\"&T!$D$5,Bogføring!$F:$F,A45)","v":947.14},"",{"$f":"SUMIFS(Bogføring!$G:$G,Bogføring!$A:$A,\">=\"&T!$E$4,Bogføring!$A:$A,\"<=\"&T!$E$5,Bogføring!$F:$F,A45)","v":0}]
[2165,{"$f":"IFERROR(VLOOKUP(A46,Kontoplan!$A$2:$D$31,2,0),\"\")","v":""},null,null,"",{"$f":"SUMIFS(Bogføring!$G:$G,Bogføring!$A:$A,\">=\"&T!$C$4,Bogføring!$A:$A,\"<=\"&T!$C$5,Bogføring!$F:$F,A46)-SUMIFS(Bogføring!$H:$H,Bogføring!$A:$A,\">=\"&T!$C$4,Bogføring!$A:$A,\"<=\"&T!$C$5,Bogføring!$F:$F,A46)","v":3785.94},-0.73935528998044098,{"$f":"SUMIFS(Bogføring!$G:$G,Bogføring!$A:$A,\">=\"&T!$D$4,Bogføring!$A:$A,\"<=\"&T!$D$5,Bogføring!$F:$F,A46)","v":14525.29},"",{"$f":"SUMIFS(Bogføring!$G:$G,Bogføring!$A:$A,\">=\"&T!$E$4,Bogføring!$A:$A,\"<=\"&T!$E$5,Bogføring!$F:$F,A46)","v":0}]
[2170,{"$f":"IFERROR(VLOOKUP(A47,Kontoplan!$A$2:$D$31,2,0),\"\")","v":""},null,null,"",{"$f":"SUMIFS(Bogføring!$G:$G,Bogføring!$A:$A,\">=\"&T!$C$4,Bogføring!$A:$A,\"<=\"&T!$C$5,Bogføring!$F:$F,A47)-SUMIFS(Bogføring!$H:$H,Bogføring!$A:$A,\">=\"&T!$C$4,Bogføring!$A:$A,\"<=\"&T!$C$5,Bogføring!$F:$F,A47)","v":306.10000000000002},"",{"$f":"SUMIFS(Bogføring!$G:$G,Bogføring!$A:$A,\">=\"&T!$D$4,Bogføring!$A:$A,\"<=\"&T!$D$5,Bogføring!$F:$F,A47)","v":0},"",{"$f":"SUMIFS(Bogføring!$G:$G,Bogføring!$A:$A,\">=\"&T!$E$4,Bogføring!$A:$A,\"<=\"&T!$E$5,Bogføring!$F:$F,A47)","v":0}]
[2180,{"$f":"IFERROR(VLOOKUP(A48,Kontoplan!$A$2:$D$31,2,0),\"\")","v":""},null,null,null,{"$f":"SUMIFS(Bogføring!$G:$G,Bogføring!$A:$A,\">=\"&T!$C$4,Bogføring!$A:$A,\"<=\"&T!$C$5,Bogføring!$F:$F,A48)-SUMIFS(Bogføring!$H:$H,Bogføring!$A:$A,\">=\"&T!$C$4,Bogføring!$A:$A,\"<=\"&T!$C$5,Bogføring!$F:$F,A48)","v":0},"",{"$f":"SUMIFS(Bogføring!$G:$G,Bogføring!$A:$A,\">=\"&T!$D$4,Bogføring!$A:$A,\"<=\"&T!$D$5,Bogføring!$F:$F,A48)","v":0},{"$f":"IFERROR((H48-J48)/J48,\"\")","v":""},{"$f":"SUMIFS(Bogføring!$G:$G,Bogføring!$A:$A,\">=\"&T!$E$4,Bogføring!$A:$A,\"<=\"&T!$E$5,Bogføring!$F:$F,A48)","v":0}]
[2190,{"$f":"IFERROR(VLOOKUP(A49,Kontoplan!$A$2:$D$31,2,0),\"\")","v":""},null,null,"",{"$f":"SUMIFS(Bogføring!$G:$G,Bogføring!$A:$A,\">=\"&T!$C$4,Bogføring!$A:$A,\"<=\"&T!$C$5,Bogføring!$F:$F,A49)-SUMIFS(Bogføring!$H:$H,Bogføring!$A:$A,\">=\"&T!$C$4,Bogføring!$A:$A,\"<=\"&T!$C$5,Bogføring!$F:$F,A49)","v":0},{"$f":"IFERROR((F49-H49)/H49,\"\")","v":-1},{"$f":"SUMIFS(Bogføring!$G:$G,Bogføring!$A:$A,\">=\"&T!$D$4,Bogføring!$A:$A,\"<=\"&T!$D$5,Bogføring!$F:$F,A49)","v":9777.3999999999978},"",{"$f":"SUMIFS(Bogføring!$G:$G,Bogføring!$A:$A,\">=\"&T!$E$4,Bogføring!$A:$A,\"<=\"&T!$E$5,Bogføring!$F:$F,A49)","v":0}]
[2200,{"$f":"IFERROR(VLOOKUP(A50,Kontoplan!$A$2:$D$31,2,0),\"\")","v":""},null,null,"",{"$f":"SUMIFS(Bogføring!$G:$G,Bogføring!$A:$A,\">=\"&T!$C$4,Bogføring!$A:$A,\"<=\"&T!$C$5,Bogføring!$F:$F,A50)-SUMIFS(Bogføring!$H:$H,Bogføring!$A:$A,\">=\"&T!$C$4,Bogføring!$A:$A,\"<=\"&T!$C$5,Bogføring!$F:$F,A50)","v":0},-1,{"$f":"SUMIFS(Bogføring!$G:$G,Bogføring!$A:$A,\">=\"&T!$D$4,Bogføring!$A:$A,\"<=\"&T!$D$5,Bogføring!$F:$F,A50)","v":2250},"",{"$f":"SUMIFS(Bogføring!$G:$G,Bogføring!$A:$A,\">=\"&T!$E$4,Bogføring!$A:$A,\"<=\"&T!$E$5,Bogføring!$F:$F,A50)","v":0}]
[3100,{"$f":"IFERROR(VLOOKUP(A51,Kontoplan!$A$2:$D$31,2,0),\"\")","v":""},null,null,"",{"$f":"SUMIFS(Bogføring!$G:$G,Bogføring!$A:$A,\">=\"&T!$C$4,Bogføring!$A:$A,\"<=\"&T!$C$5,Bogføring!$F:$F,A51)-SUMIFS(Bogføring!$H:$H,Bogføring!$A:$A,\">=\"&T!$C$4,Bogføring!$A:$A,\"<=\"&T!$C$5,Bogføring!$F:$F,A51)","v":0},-1,{"$f":"SUMIFS(Bogføring!$G:$G,Bogføring!$A:$A,\">=\"&T!$D$4,Bogføring!$A:$A,\"<=\"&T!$D$5,Bogføring!$F:$F,A51)","v":37480.11},"",{"$f":"SUMIFS(Bogføring!$G:$G,Bogføring!$A:$A,\">=\"&T!$E$4,Bogføring!$A:$A,\"<=\"&T!$E$5,Bogføring!$F:$F,A51)","v":0}]
[3110,{"$f":"IFERROR(VLOOKUP(A52,Kontoplan!$A$2:$D$31,2,0),\"\")","v":""},null,null,"",{"$f":"SUMIFS(Bogføring!$G:$G,Bogføring!$A:$A,\">=\"&T!$C$4,Bogføring!$A:$A,\"<=\"&T!$C$5,Bogføring!$F:$F,A52)-SUMIFS(Bogføring!$H:$H,Bogføring!$A:$A,\">=\"&T!$C$4,Bogføring!$A:$A,\"<=\"&T!$C$5,Bogføring!$F:$F,A52)","v":40800},-0.57290094159640204,{"$f":"SUMIFS(Bogføring!$G:$G,Bogføring!$A:$A,\">=\"&T!$D$4,Bogføring!$A:$A,\"<=\"&T!$D$5,Bogføring!$F:$F,A52)","v":95528.189999999988},"",{"$f":"SUMIFS(Bogføring!$G:$G,Bogføring!$A:$A,\">=\"&T!$E$4,Bogføring!$A:$A,\"<=\"&T!$E$5,Bogføring!$F:$F,A52)","v":0}]
[3120,{"$f":"IFERROR(VLOOKUP(A53,Kontoplan!$A$2:$D$31,2,0),\"\")","v":""},null,null,"",{"$f":"SUMIFS(Bogføring!$G:$G,Bogføring!$A:$A,\">=\"&T!$C$4,Bogføring!$A:$A,\"<=\"&T!$C$5,Bogføring!$F:$F,A53)-SUMIFS(Bogføring!$H:$H,Bogføring!$A:$A,\">=\"&T!$C$4,Bogføring!$A:$A,\"<=\"&T!$C$5,Bogføring!$F:$F,A53)","v":820.3},-0.65830087684585425,{"$f":"SUMIFS(Bogføring!$G:$G,Bogføring!$A:$A,\">=\"&T!$D$4,Bogføring!$A:$A,\"<=\"&T!$D$5,Bogføring!$F:$F,A53)","v":2400.6499999999996},"",{"$f":"SUMIFS(Bogføring!$G:$G,Bogføring!$A:$A,\">=\"&T!$E$4,Bogføring!$A:$A,\"<=\"&T!$E$5,Bogføring!$F:$F,A53)","v":0}]
[null,{"$f":"IFERROR(VLOOKUP(A54,Kontoplan!$A$2:$D$31,2,0),\"\")","v":""},null,null,"",{"$f":"SUMIFS(Bogføring!$G:$G,Bogføring!$A:$A,\">=\"&T!$C$4,Bogføring!$A:$A,\"<=\"&T!$C$5,Bogføring!$F:$F,A54)-SUMIFS(Bogføring!$H:$H,Bogføring!$A:$A,\">=\"&T!$C$4,Bogføring!$A:$A,\"<=\"&T!$C$5,Bogføring!$F:$F,A54)","v":0},"",{"$f":"SUMIFS(Bogføring!$G:$G,Bogføring!$A:$A,\">=\"&T!$D$4,Bogføring!$A:$A,\"<=\"&T!$D$5,Bogføring!$F:$F,A54)","v":0},"",{"$f":"SUMIFS(Bogføring!$G:$G,Bogføring!$A:$A,\">=\"&T!$E$4,Bogføring!$A:$A,\"<=\"&T!$E$5,Bogføring!$F:$F,A54)","v":0}]
[null,{"$f":"IFERROR(VLOOKUP(A55,Kontoplan!$A$2:$D$31,2,0),\"\")","v":""},null,null,"",{"$f":"SUMIFS(Bogføring!$G:$G,Bogføring!$A:$A,\">=\"&T!$C$4,Bogføring!$A:$A,\"<=\"&T!$C$5,Bogføring!$F:$F,A55)-SUMIFS(Bogføring!$H:$H,Bogføring!$A:$A,\">=\"&T!$C$4,Bogføring!$A:$A,\"<=\"&T!$C$5,Bogføring!$F:$F,A55)","v":0},"",{"$f":"SUMIFS(Bogføring!$G:$G,Bogføring!$A:$A,\">=\"&T!$D$4,Bogføring!$A:$A,\"<=\"&T!$D$5,Bogføring!$F:$F,A55)","v":0},"",{"$f":"SUMIFS(Bogføring!$G:$G,Bogføring!$A:$A,\">=\"&T!$E$4,Bogføring!$A:$A,\"<=\"&T!$E$5,Bogføring!$F:$F,A55)","v":0}]
[null,{"$f":"IFERROR(VLOOKUP(A56,Kontoplan!$A$2:$D$31,2,0),\"\")","v":""},null,null,"",{"$f":"SUMIFS(Bogføring!$G:$G,Bogføring!$A:$A,\">=\"&T!$C$4,Bogføring!$A:$A,\"<=\"&T!$C$5,Bogføring!$F:$F,A56)-SUMIFS(Bogføring!$H:$H,Bogføring!$A:$A,\">=\"&T!$C$4,Bogføring!$A:$A,\"<=\"&T!$C$5,Bogføring!$F:$F,A56)","v":0},"",{"$f":"SUMIFS(Bogføring!$G:$G,Bogføring!$A:$A,\">=\"&T!$D$4,Bogføring!$A:$A,\"<=\"&T!$D$5,Bogføring!$F:$F,A56)","v":0},"",{"$f":"SUMIFS(Bogføring!$G:$G,Bogføring!$A:$A,\">=\"&T!$E$4,Bogføring!$A:$A,\"<=\"&T!$E$5,Bogføring!$F:$F,A56)","v":0}]
[null,null,null,null,null,null,"",null,""]
[null,"Udgifter i alt",null,null,"",{"$f":"SUM(F31:F57)","v":91230.930000000008},-0.7393517057604172,{"$f":"SUM(H31:H57)","v":350015.45},"",{"$f":"SUM(J31:J57)","v":0}]
[null,null,null,null,null,null,null,null,""]
[null,{"$f":"IF(F60<0,\"Årets resultat, Underskud\",\"Årets resultat, Overskud\")","v":"Årets resultat, Overskud"},null,null,"",{"$f":"F27-F58","v":12137.169999999998},{"$f":"IFERROR((F60-H60)/H60,\"\")","v":-2.9954311399297713},{"$f":"H27-H58","v":-6082.4799999999814},"",{"$f":"J27-J58","v":0}]
[null,null,null,null,{"$f":"IFERROR((D61-F61)/D61,\"\")","v":""},null,{"$f":"IFERROR((F61-H61)/F61,\"\")","v":""},null,{"$f":"IFERROR((H61-J61)/H61,\"\")","v":""}]

{"sheet":"Kontoplan (2)","index":5,"n_rows":78,"n_cols":9,"rows_kept":78,"cut":false,"hidden":true,"merged":[]}
["Konto","Kontobeskrivelse","Saldo","Kommentarer","Fra","Til"]
[1000,"Entre",{"$f":"SUMIFS(Bogføring!$H:$H,Bogføring!$A:$A,\">=\"&T!$C$4,Bogføring!$A:$A,\"<=\"&T!$C$5,Bogføring!$F:$F,A2)-SUMIFS(Bogføring!$G:$G,Bogføring!$A:$A,\">=\"&T!$C$4,Bogføring!$A:$A,\"<=\"&T!$C$5,Bogføring!$F:$F,A2)","v":8740},{"$f":"SUM(C3:C10)","v":0}]
[1001,"Voksne",{"$f":"SUMIFS(Bogføring!$H:$H,Bogføring!$A:$A,\">=\"&T!$C$4,Bogføring!$A:$A,\"<=\"&T!$C$5,Bogføring!$F:$F,A3)-SUMIFS(Bogføring!$G:$G,Bogføring!$A:$A,\">=\"&T!$C$4,Bogføring!$A:$A,\"<=\"&T!$C$5,Bogføring!$F:$F,A3)","v":0},null,null,null,null,null,14603.17]
[1002,"Pensionister",{"$f":"SUMIFS(Bogføring!$H:$H,Bogføring!$A:$A,\">=\"&T!$C$4,Bogføring!$A:$A,\"<=\"&T!$C$5,Bogføring!$F:$F,A4)-SUMIFS(Bogføring!$G:$G,Bogføring!$A:$A,\">=\"&T!$C$4,Bogføring!$A:$A,\"<=\"&T!$C$5,Bogføring!$F:$F,A4)","v":0}]
[1003,"Børn 6/16",{"$f":"SUMIFS(Bogføring!$H:$H,Bogføring!$A:$A,\">=\"&T!$C$4,Bogføring!$A:$A,\"<=\"&T!$C$5,Bogføring!$F:$F,A5)-SUMIFS(Bogføring!$G:$G,Bogføring!$A:$A,\">=\"&T!$C$4,Bogføring!$A:$A,\"<=\"&T!$C$5,Bogføring!$F:$F,A5)","v":0}]
[1004,"Børn u/6",{"$f":"SUMIFS(Bogføring!$H:$H,Bogføring!$A:$A,\">=\"&T!$C$4,Bogføring!$A:$A,\"<=\"&T!$C$5,Bogføring!$F:$F,A6)-SUMIFS(Bogføring!$G:$G,Bogføring!$A:$A,\">=\"&T!$C$4,Bogføring!$A:$A,\"<=\"&T!$C$5,Bogføring!$F:$F,A6)","v":0}]
[1005,"skoler",{"$f":"SUMIFS(Bogføring!$H:$H,Bogføring!$A:$A,\">=\"&T!$C$4,Bogføring!$A:$A,\"<=\"&T!$C$5,Bogføring!$F:$F,A7)-SUMIFS(Bogføring!$G:$G,Bogføring!$A:$A,\">=\"&T!$C$4,Bogføring!$A:$A,\"<=\"&T!$C$5,Bogføring!$F:$F,A7)","v":0}]
[1006,"BH skoler",{"$f":"SUMIFS(Bogføring!$H:$H,Bogføring!$A:$A,\">=\"&T!$C$4,Bogføring!$A:$A,\"<=\"&T!$C$5,Bogføring!$F:$F,A8)-SUMIFS(Bogføring!$G:$G,Bogføring!$A:$A,\">=\"&T!$C$4,Bogføring!$A:$A,\"<=\"&T!$C$5,Bogføring!$F:$F,A8)","v":0}]
[1007,"Grupper",{"$f":"SUMIFS(Bogføring!$H:$H,Bogføring!$A:$A,\">=\"&T!$C$4,Bogføring!$A:$A,\"<=\"&T!$C$5,Bogføring!$F:$F,A9)-SUMIFS(Bogføring!$G:$G,Bogføring!$A:$A,\">=\"&T!$C$4,Bogføring!$A:$A,\"<=\"&T!$C$5,Bogføring!$F:$F,A9)","v":0}]
[1008,"Militær ID",{"$f":"SUMIFS(Bogføring!$H:$H,Bogføring!$A:$A,\">=\"&T!$C$4,Bogføring!$A:$A,\"<=\"&T!$C$5,Bogføring!$F:$F,A10)-SUMIFS(Bogføring!$G:$G,Bogføring!$A:$A,\">=\"&T!$C$4,Bogføring!$A:$A,\"<=\"&T!$C$5,Bogføring!$F:$F,A10)","v":0}]
[1010,"Kiosk salg",{"$f":"SUMIFS(Bogføring!$H:$H,Bogføring!$A:$A,\">=\"&T!$C$4,Bogføring!$A:$A,\"<=\"&T!$C$5,Bogføring!$F:$F,A11)-SUMIFS(Bogføring!$G:$G,Bogføring!$A:$A,\">=\"&T!$C$4,Bogføring!$A:$A,\"<=\"&T!$C$5,Bogføring!$F:$F,A11)","v":75}]
[1011,"Sodavand",{"$f":"SUMIFS(Bogføring!$H:$H,Bogføring!$A:$A,\">=\"&T!$C$4,Bogføring!$A:$A,\"<=\"&T!$C$5,Bogføring!$F:$F,A12)-SUMIFS(Bogføring!$G:$G,Bogføring!$A:$A,\">=\"&T!$C$4,Bogføring!$A:$A,\"<=\"&T!$C$5,Bogføring!$F:$F,A12)","v":0}]
[1012,"kort",{"$f":"SUMIFS(Bogføring!$H:$H,Bogføring!$A:$A,\">=\"&T!$C$4,Bogføring!$A:$A,\"<=\"&T!$C$5,Bogføring!$F:$F,A13)-SUMIFS(Bogføring!$G:$G,Bogføring!$A:$A,\">=\"&T!$C$4,Bogføring!$A:$A,\"<=\"&T!$C$5,Bogføring!$F:$F,A13)","v":0}]
[1013,"Bælter",{"$f":"SUMIFS(Bogføring!$H:$H,Bogføring!$A:$A,\">=\"&T!$C$4,Bogføring!$A:$A,\"<=\"&T!$C$5,Bogføring!$F:$F,A14)-SUMIFS(Bogføring!$G:$G,Bogføring!$A:$A,\">=\"&T!$C$4,Bogføring!$A:$A,\"<=\"&T!$C$5,Bogføring!$F:$F,A14)","v":0}]
[1014,"Færdige Tinsoldater",{"$f":"SUMIFS(Bogføring!$H:$H,Bogføring!$A:$A,\">=\"&T!$C$4,Bogføring!$A:$A,\"<=\"&T!$C$5,Bogføring!$F:$F,A15)-SUMIFS(Bogføring!$G:$G,Bogføring!$A:$A,\">=\"&T!$C$4,Bogføring!$A:$A,\"<=\"&T!$C$5,Bogføring!$F:$F,A15)","v":0}]
[1015]
[1020,"Tilskud BRK",{"$f":"SUMIFS(Bogføring!$H:$H,Bogføring!$A:$A,\">=\"&T!$C$4,Bogføring!$A:$A,\"<=\"&T!$C$5,Bogføring!$F:$F,A17)-SUMIFS(Bogføring!$G:$G,Bogføring!$A:$A,\">=\"&T!$C$4,Bogføring!$A:$A,\"<=\"&T!$C$5,Bogføring!$F:$F,A17)","v":74021}]
[1030,"Tilskud KVB",{"$f":"SUMIFS(Bogføring!$H:$H,Bogføring!$A:$A,\">=\"&T!$C$4,Bogføring!$A:$A,\"<=\"&T!$C$5,Bogføring!$F:$F,A18)-SUMIFS(Bogføring!$G:$G,Bogføring!$A:$A,\">=\"&T!$C$4,Bogføring!$A:$A,\"<=\"&T!$C$5,Bogføring!$F:$F,A18)","v":20000}]
[1040,"Fonde/Gaver",{"$f":"SUMIFS(Bogføring!$H:$H,Bogføring!$A:$A,\">=\"&T!$C$4,Bogføring!$A:$A,\"<=\"&T!$C$5,Bogføring!$F:$F,A19)-SUMIFS(Bogføring!$G:$G,Bogføring!$A:$A,\">=\"&T!$C$4,Bogføring!$A:$A,\"<=\"&T!$C$5,Bogføring!$F:$F,A19)","v":0}]
[1050,"Aktiviteter",{"$f":"SUMIFS(Bogføring!$H:$H,Bogføring!$A:$A,\">=\"&T!$C$4,Bogføring!$A:$A,\"<=\"&T!$C$5,Bogføring!$F:$F,A20)-SUMIFS(Bogføring!$G:$G,Bogføring!$A:$A,\">=\"&T!$C$4,Bogføring!$A:$A,\"<=\"&T!$C$5,Bogføring!$F:$F,A20)","v":0}]
[1060,null,{"$f":"SUMIFS(Bogføring!$H:$H,Bogføring!$A:$A,\">=\"&T!$C$4,Bogføring!$A:$A,\"<=\"&T!$C$5,Bogføring!$F:$F,A21)-SUMIFS(Bogføring!$G:$G,Bogføring!$A:$A,\">=\"&T!$C$4,Bogføring!$A:$A,\"<=\"&T!$C$5,Bogføring!$F:$F,A21)","v":0}]
[1070,"Pengegaver",{"$f":"SUMIFS(Bogføring!$H:$H,Bogføring!$A:$A,\">=\"&T!$C$4,Bogføring!$A:$A,\"<=\"&T!$C$5,Bogføring!$F:$F,A22)-SUMIFS(Bogføring!$G:$G,Bogføring!$A:$A,\">=\"&T!$C$4,Bogføring!$A:$A,\"<=\"&T!$C$5,Bogføring!$F:$F,A22)","v":0}]
[1080,"Flaskepant retur",{"$f":"SUMIFS(Bogføring!$H:$H,Bogføring!$A:$A,\">=\"&T!$C$4,Bogføring!$A:$A,\"<=\"&T!$C$5,Bogføring!$F:$F,A23)-SUMIFS(Bogføring!$G:$G,Bogføring!$A:$A,\">=\"&T!$C$4,Bogføring!$A:$A,\"<=\"&T!$C$5,Bogføring!$F:$F,A23)","v":0}]
[1090,"Kassedifferance",{"$f":"SUMIFS(Bogføring!$H:$H,Bogføring!$A:$A,\">=\"&T!$C$4,Bogføring!$A:$A,\"<=\"&T!$C$5,Bogføring!$F:$F,A24)-SUMIFS(Bogføring!$G:$G,Bogføring!$A:$A,\">=\"&T!$C$4,Bogføring!$A:$A,\"<=\"&T!$C$5,Bogføring!$F:$F,A24)","v":0}]
[1100,null,{"$f":"SUMIFS(Bogføring!$H:$H,Bogføring!$A:$A,\">=\"&T!$C$4,Bogføring!$A:$A,\"<=\"&T!$C$5,Bogføring!$F:$F,A25)-SUMIFS(Bogføring!$G:$G,Bogføring!$A:$A,\">=\"&T!$C$4,Bogføring!$A:$A,\"<=\"&T!$C$5,Bogføring!$F:$F,A25)","v":0}]
[1110,null,{"$f":"SUMIFS(Bogføring!$H:$H,Bogføring!$A:$A,\">=\"&T!$C$4,Bogføring!$A:$A,\"<=\"&T!$C$5,Bogføring!$F:$F,A26)-SUMIFS(Bogføring!$G:$G,Bogføring!$A:$A,\">=\"&T!$C$4,Bogføring!$A:$A,\"<=\"&T!$C$5,Bogføring!$F:$F,A26)","v":2.9}]
[1120,null,{"$f":"SUMIFS(Bogføring!$H:$H,Bogføring!$A:$A,\">=\"&T!$C$4,Bogføring!$A:$A,\"<=\"&T!$C$5,Bogføring!$F:$F,A27)-SUMIFS(Bogføring!$G:$G,Bogføring!$A:$A,\">=\"&T!$C$4,Bogføring!$A:$A,\"<=\"&T!$C$5,Bogføring!$F:$F,A27)","v":11493.46}]
[1130,"Diverse Indtægter",{"$f":"SUMIFS(Bogføring!$H:$H,Bogføring!$A:$A,\">=\"&T!$C$4,Bogføring!$A:$A,\"<=\"&T!$C$5,Bogføring!$F:$F,A28)-SUMIFS(Bogføring!$G:$G,Bogføring!$A:$A,\">=\"&T!$C$4,Bogføring!$A:$A,\"<=\"&T!$C$5,Bogføring!$F:$F,A28)","v":532.1},null,null,null,{"$f":"SUM(C2:C28)","v":114864.45999999999}]
[2000,"Bankgebyr+iZ",{"$f":"SUMIFS(Bogføring!$G:$G,Bogføring!$A:$A,\">=\"&T!$C$4,Bogføring!$A:$A,\"<=\"&T!$C$5,Bogføring!$F:$F,A29)-SUMIFS(Bogføring!$H:$H,Bogføring!$A:$A,\">=\"&T!$C$4,Bogføring!$A:$A,\"<=\"&T!$C$5,Bogføring!$F:$F,A29)","v":109.5}]
[2010,"Visma ",{"$f":"SUMIFS(Bogføring!$G:$G,Bogføring!$A:$A,\">=\"&T!$C$4,Bogføring!$A:$A,\"<=\"&T!$C$5,Bogføring!$F:$F,A30)-SUMIFS(Bogføring!$H:$H,Bogføring!$A:$A,\">=\"&T!$C$4,Bogføring!$A:$A,\"<=\"&T!$C$5,Bogføring!$F:$F,A30)","v":27.5}]
[2020,"Revision",{"$f":"SUMIFS(Bogføring!$G:$G,Bogføring!$A:$A,\">=\"&T!$C$4,Bogføring!$A:$A,\"<=\"&T!$C$5,Bogføring!$F:$F,A31)-SUMIFS(Bogføring!$H:$H,Bogføring!$A:$A,\">=\"&T!$C$4,Bogføring!$A:$A,\"<=\"&T!$C$5,Bogføring!$F:$F,A31)","v":0}]
[2030,"Bygnings vedligehold",{"$f":"SUMIFS(Bogføring!$G:$G,Bogføring!$A:$A,\">=\"&T!$C$4,Bogføring!$A:$A,\"<=\"&T!$C$5,Bogføring!$F:$F,A32)-SUMIFS(Bogføring!$H:$H,Bogføring!$A:$A,\">=\"&T!$C$4,Bogføring!$A:$A,\"<=\"&T!$C$5,Bogføring!$F:$F,A32)","v":329.7}]
[2040,"El, Vand og Varme",{"$f":"SUMIFS(Bogføring!$G:$G,Bogføring!$A:$A,\">=\"&T!$C$4,Bogføring!$A:$A,\"<=\"&T!$C$5,Bogføring!$F:$F,A33)-SUMIFS(Bogføring!$H:$H,Bogføring!$A:$A,\">=\"&T!$C$4,Bogføring!$A:$A,\"<=\"&T!$C$5,Bogføring!$F:$F,A33)","v":27955.019999999997}]
[2050,"Deltagelse i GF i Andre Foren.",{"$f":"SUMIFS(Bogføring!$G:$G,Bogføring!$A:$A,\">=\"&T!$C$4,Bogføring!$A:$A,\"<=\"&T!$C$5,Bogføring!$F:$F,A34)-SUMIFS(Bogføring!$H:$H,Bogføring!$A:$A,\">=\"&T!$C$4,Bogføring!$A:$A,\"<=\"&T!$C$5,Bogføring!$F:$F,A34)","v":0}]
[2055,"Indkøb af øl + vand",{"$f":"SUMIFS(Bogføring!$G:$G,Bogføring!$A:$A,\">=\"&T!$C$4,Bogføring!$A:$A,\"<=\"&T!$C$5,Bogføring!$F:$F,A35)-SUMIFS(Bogføring!$H:$H,Bogføring!$A:$A,\">=\"&T!$C$4,Bogføring!$A:$A,\"<=\"&T!$C$5,Bogføring!$F:$F,A35)","v":0}]
[2060,"Internet, mobiltelefon, Forsik.",{"$f":"SUMIFS(Bogføring!$G:$G,Bogføring!$A:$A,\">=\"&T!$C$4,Bogføring!$A:$A,\"<=\"&T!$C$5,Bogføring!$F:$F,A36)-SUMIFS(Bogføring!$H:$H,Bogføring!$A:$A,\">=\"&T!$C$4,Bogføring!$A:$A,\"<=\"&T!$C$5,Bogføring!$F:$F,A36)","v":2230.96}]
[2065,"Udstilling",{"$f":"SUMIFS(Bogføring!$G:$G,Bogføring!$A:$A,\">=\"&T!$C$4,Bogføring!$A:$A,\"<=\"&T!$C$5,Bogføring!$F:$F,A37)-SUMIFS(Bogføring!$H:$H,Bogføring!$A:$A,\">=\"&T!$C$4,Bogføring!$A:$A,\"<=\"&T!$C$5,Bogføring!$F:$F,A37)","v":11386.63}]
[2070,"Tin og sortkrudt",{"$f":"SUMIFS(Bogføring!$G:$G,Bogføring!$A:$A,\">=\"&T!$C$4,Bogføring!$A:$A,\"<=\"&T!$C$5,Bogføring!$F:$F,A38)-SUMIFS(Bogføring!$H:$H,Bogføring!$A:$A,\">=\"&T!$C$4,Bogføring!$A:$A,\"<=\"&T!$C$5,Bogføring!$F:$F,A38)","v":0}]
[2075,"Gaver",{"$f":"SUMIFS(Bogføring!$G:$G,Bogføring!$A:$A,\">=\"&T!$C$4,Bogføring!$A:$A,\"<=\"&T!$C$5,Bogføring!$F:$F,A39)-SUMIFS(Bogføring!$H:$H,Bogføring!$A:$A,\">=\"&T!$C$4,Bogføring!$A:$A,\"<=\"&T!$C$5,Bogføring!$F:$F,A39)","v":170}]
[2090,"Kontigent til andre Foreninger",{"$f":"SUMIFS(Bogføring!$G:$G,Bogføring!$A:$A,\">=\"&T!$C$4,Bogføring!$A:$A,\"<=\"&T!$C$5,Bogføring!$F:$F,A40)-SUMIFS(Bogføring!$H:$H,Bogføring!$A:$A,\">=\"&T!$C$4,Bogføring!$A:$A,\"<=\"&T!$C$5,Bogføring!$F:$F,A40)","v":100}]
[2100,"Forplejning til møder/Rejser",{"$f":"SUMIFS(Bogføring!$G:$G,Bogføring!$A:$A,\">=\"&T!$C$4,Bogføring!$A:$A,\"<=\"&T!$C$5,Bogføring!$F:$F,A41)-SUMIFS(Bogføring!$H:$H,Bogføring!$A:$A,\">=\"&T!$C$4,Bogføring!$A:$A,\"<=\"&T!$C$5,Bogføring!$F:$F,A41)","v":1405.25}]
[2110,"Kontorhold - Porto - IT",{"$f":"SUMIFS(Bogføring!$G:$G,Bogføring!$A:$A,\">=\"&T!$C$4,Bogføring!$A:$A,\"<=\"&T!$C$5,Bogføring!$F:$F,A42)-SUMIFS(Bogføring!$H:$H,Bogføring!$A:$A,\">=\"&T!$C$4,Bogføring!$A:$A,\"<=\"&T!$C$5,Bogføring!$F:$F,A42)","v":1483.4}]
[2120,"Hjemmeside",{"$f":"SUMIFS(Bogføring!$G:$G,Bogføring!$A:$A,\">=\"&T!$C$4,Bogføring!$A:$A,\"<=\"&T!$C$5,Bogføring!$F:$F,A43)-SUMIFS(Bogføring!$H:$H,Bogføring!$A:$A,\">=\"&T!$C$4,Bogføring!$A:$A,\"<=\"&T!$C$5,Bogføring!$F:$F,A43)","v":0}]
[2130,"Annoncer",{"$f":"SUMIFS(Bogføring!$G:$G,Bogføring!$A:$A,\">=\"&T!$C$4,Bogføring!$A:$A,\"<=\"&T!$C$5,Bogføring!$F:$F,A44)-SUMIFS(Bogføring!$H:$H,Bogføring!$A:$A,\">=\"&T!$C$4,Bogføring!$A:$A,\"<=\"&T!$C$5,Bogføring!$F:$F,A44)","v":2318.75}]
[2140,"Kassedifferance",{"$f":"SUMIFS(Bogføring!$G:$G,Bogføring!$A:$A,\">=\"&T!$C$4,Bogføring!$A:$A,\"<=\"&T!$C$5,Bogføring!$F:$F,A45)-SUMIFS(Bogføring!$H:$H,Bogføring!$A:$A,\">=\"&T!$C$4,Bogføring!$A:$A,\"<=\"&T!$C$5,Bogføring!$F:$F,A45)","v":0}]
[2150,"Øreafrundning",{"$f":"SUMIFS(Bogføring!$G:$G,Bogføring!$A:$A,\">=\"&T!$C$4,Bogføring!$A:$A,\"<=\"&T!$C$5,Bogføring!$F:$F,A46)-SUMIFS(Bogføring!$H:$H,Bogføring!$A:$A,\">=\"&T!$C$4,Bogføring!$A:$A,\"<=\"&T!$C$5,Bogføring!$F:$F,A46)","v":0}]
[2160,"Rejser",{"$f":"SUMIFS(Bogføring!$G:$G,Bogføring!$A:$A,\">=\"&T!$C$4,Bogføring!$A:$A,\"<=\"&T!$C$5,Bogføring!$F:$F,A47)-SUMIFS(Bogføring!$H:$H,Bogføring!$A:$A,\">=\"&T!$C$4,Bogføring!$A:$A,\"<=\"&T!$C$5,Bogføring!$F:$F,A47)","v":0}]
[2165,"G4S tyverialarm",{"$f":"SUMIFS(Bogføring!$G:$G,Bogføring!$A:$A,\">=\"&T!$C$4,Bogføring!$A:$A,\"<=\"&T!$C$5,Bogføring!$F:$F,A48)-SUMIFS(Bogføring!$H:$H,Bogføring!$A:$A,\">=\"&T!$C$4,Bogføring!$A:$A,\"<=\"&T!$C$5,Bogføring!$F:$F,A48)","v":3785.94}]
[2170,"Afholdelse af GF",{"$f":"SUMIFS(Bogføring!$G:$G,Bogføring!$A:$A,\">=\"&T!$C$4,Bogføring!$A:$A,\"<=\"&T!$C$5,Bogføring!$F:$F,A49)-SUMIFS(Bogføring!$H:$H,Bogføring!$A:$A,\">=\"&T!$C$4,Bogføring!$A:$A,\"<=\"&T!$C$5,Bogføring!$F:$F,A49)","v":306.10000000000002}]
[2180,"Bestyrelses møder",{"$f":"SUMIFS(Bogføring!$G:$G,Bogføring!$A:$A,\">=\"&T!$C$4,Bogføring!$A:$A,\"<=\"&T!$C$5,Bogføring!$F:$F,A50)-SUMIFS(Bogføring!$H:$H,Bogføring!$A:$A,\">=\"&T!$C$4,Bogføring!$A:$A,\"<=\"&T!$C$5,Bogføring!$F:$F,A50)","v":0}]
[2190,"Diverse Udgifter",{"$f":"SUMIFS(Bogføring!$G:$G,Bogføring!$A:$A,\">=\"&T!$C$4,Bogføring!$A:$A,\"<=\"&T!$C$5,Bogføring!$F:$F,A51)-SUMIFS(Bogføring!$H:$H,Bogføring!$A:$A,\">=\"&T!$C$4,Bogføring!$A:$A,\"<=\"&T!$C$5,Bogføring!$F:$F,A51)","v":0}]
[2200,"Kontingenter overført til KVB",{"$f":"SUMIFS(Bogføring!$G:$G,Bogføring!$A:$A,\">=\"&T!$C$4,Bogføring!$A:$A,\"<=\"&T!$C$5,Bogføring!$F:$F,A52)-SUMIFS(Bogføring!$H:$H,Bogføring!$A:$A,\">=\"&T!$C$4,Bogføring!$A:$A,\"<=\"&T!$C$5,Bogføring!$F:$F,A52)","v":0}]
[3100,"Lønomkostninger",{"$f":"SUMIFS(Bogføring!$G:$G,Bogføring!$A:$A,\">=\"&T!$C$4,Bogføring!$A:$A,\"<=\"&T!$C$5,Bogføring!$F:$F,A53)-SUMIFS(Bogføring!$H:$H,Bogføring!$A:$A,\">=\"&T!$C$4,Bogføring!$A:$A,\"<=\"&T!$C$5,Bogføring!$F:$F,A53)","v":0}]
[3110,"Løn inkl. feriepenge",{"$f":"SUMIFS(Bogføring!$G:$G,Bogføring!$A:$A,\">=\"&T!$C$4,Bogføring!$A:$A,\"<=\"&T!$C$5,Bogføring!$F:$F,A54)-SUMIFS(Bogføring!$H:$H,Bogføring!$A:$A,\">=\"&T!$C$4,Bogføring!$A:$A,\"<=\"&T!$C$5,Bogføring!$F:$F,A54)","v":40800}]
[3120,"ATP",{"$f":"SUMIFS(Bogføring!$G:$G,Bogføring!$A:$A,\">=\"&T!$C$4,Bogføring!$A:$A,\"<=\"&T!$C$5,Bogføring!$F:$F,A55)-SUMIFS(Bogføring!$H:$H,Bogføring!$A:$A,\">=\"&T!$C$4,Bogføring!$A:$A,\"<=\"&T!$C$5,Bogføring!$F:$F,A55)","v":820.3}]
[3130,"Am",{"$f":"SUMIFS(Bogføring!$G:$G,Bogføring!$A:$A,\">=\"&T!$C$4,Bogføring!$A:$A,\"<=\"&T!$C$5,Bogføring!$F:$F,A56)-SUMIFS(Bogføring!$H:$H,Bogføring!$A:$A,\">=\"&T!$C$4,Bogføring!$A:$A,\"<=\"&T!$C$5,Bogføring!$F:$F,A56)","v":3664}]
[3140,"Lønsum",{"$f":"SUMIFS(Bogføring!$G:$G,Bogføring!$A:$A,\">=\"&T!$C$4,Bogføring!$A:$A,\"<=\"&T!$C$5,Bogføring!$F:$F,A57)-SUMIFS(Bogføring!$H:$H,Bogføring!$A:$A,\">=\"&T!$C$4,Bogføring!$A:$A,\"<=\"&T!$C$5,Bogføring!$F:$F,A57)","v":0}]
[null,null,{"$f":"SUMIFS(Bogføring!$G:$G,Bogføring!$A:$A,\">=\"&T!$C$4,Bogføring!$A:$A,\"<=\"&T!$C$5,Bogføring!$F:$F,A58)-SUMIFS(Bogføring!$H:$H,Bogføring!$A:$A,\">=\"&T!$C$4,Bogføring!$A:$A,\"<=\"&T!$C$5,Bogføring!$F:$F,A58)","v":0}]
[null,null,{"$f":"SUMIFS(Bogføring!$G:$G,Bogføring!$A:$A,\">=\"&T!$C$4,Bogføring!$A:$A,\"<=\"&T!$C$5,Bogføring!$F:$F,A59)-SUMIFS(Bogføring!$H:$H,Bogføring!$A:$A,\">=\"&T!$C$4,Bogføring!$A:$A,\"<=\"&T!$C$5,Bogføring!$F:$F,A59)","v":0},null,null,null,{"$f":"SUM(C29:C57)","v":96893.05}]
[null,null,null,null,null,null,{"$f":"G28-G59","v":17971.409999999989}]
[12310,"Bank konto",{"$f":"SUMIFS(Bogføring!$G:$G,Bogføring!$A:$A,\">=\"&T!$C$4,Bogføring!$A:$A,\"<=\"&T!$C$5,Bogføring!$F:$F,A61)-SUMIFS(Bogføring!$H:$H,Bogføring!$A:$A,\">=\"&T!$C$4,Bogføring!$A:$A,\"<=\"&T!$C$5,Bogføring!$F:$F,A61)","v":21291.5}]
[12320,"Kasse",{"$f":"SUMIFS(Bogføring!$G:$G,Bogføring!$A:$A,\">=\"&T!$C$4,Bogføring!$A:$A,\"<=\"&T!$C$5,Bogføring!$F:$F,A62)-SUMIFS(Bogføring!$H:$H,Bogføring!$A:$A,\">=\"&T!$C$4,Bogføring!$A:$A,\"<=\"&T!$C$5,Bogføring!$F:$F,A62)","v":4736}]
[12330,"Egenkapital",{"$f":"SUMIFS(Bogføring!$H:$H,Bogføring!$A:$A,\">=\"&T!$C$4,Bogføring!$A:$A,\"<=\"&T!$C$5,Bogføring!$F:$F,A63)-SUMIFS(Bogføring!$G:$G,Bogføring!$A:$A,\">=\"&T!$C$4,Bogføring!$A:$A,\"<=\"&T!$C$5,Bogføring!$F:$F,A63)+G60","v":19981.249999999989}]
[null,null,{"$f":"SUMIFS(Bogføring!$H:$H,Bogføring!$A:$A,\">=\"&T!$C$4,Bogføring!$A:$A,\"<=\"&T!$C$5,Bogføring!$F:$F,A64)-SUMIFS(Bogføring!$G:$G,Bogføring!$A:$A,\">=\"&T!$C$4,Bogføring!$A:$A,\"<=\"&T!$C$5,Bogføring!$F:$F,A64)+F57","v":0}]
[12360,"Skyldig A-skat",{"$f":"SUMIFS(Bogføring!$H:$H,Bogføring!$A:$A,\">=\"&T!$C$4,Bogføring!$A:$A,\"<=\"&T!$C$5,Bogføring!$F:$F,A65)-SUMIFS(Bogføring!$G:$G,Bogføring!$A:$A,\">=\"&T!$C$4,Bogføring!$A:$A,\"<=\"&T!$C$5,Bogføring!$F:$F,A65)+F58","v":4219}]
[12361,"Skyldig AM ",{"$f":"SUMIFS(Bogføring!$H:$H,Bogføring!$A:$A,\">=\"&T!$C$4,Bogføring!$A:$A,\"<=\"&T!$C$5,Bogføring!$F:$F,A66)-SUMIFS(Bogføring!$G:$G,Bogføring!$A:$A,\">=\"&T!$C$4,Bogføring!$A:$A,\"<=\"&T!$C$5,Bogføring!$F:$F,A66)+F59","v":797}]
[12362,"Skyldig ATP",{"$f":"SUMIFS(Bogføring!$H:$H,Bogføring!$A:$A,\">=\"&T!$C$4,Bogføring!$A:$A,\"<=\"&T!$C$5,Bogføring!$F:$F,A67)-SUMIFS(Bogføring!$G:$G,Bogføring!$A:$A,\">=\"&T!$C$4,Bogføring!$A:$A,\"<=\"&T!$C$5,Bogføring!$F:$F,A67)+F60","v":378.60000000000008}]
[12364,"Skyldige Feriepenge",{"$f":"SUMIFS(Bogføring!$H:$H,Bogføring!$A:$A,\">=\"&T!$C$4,Bogføring!$A:$A,\"<=\"&T!$C$5,Bogføring!$F:$F,A68)-SUMIFS(Bogføring!$G:$G,Bogføring!$A:$A,\">=\"&T!$C$4,Bogføring!$A:$A,\"<=\"&T!$C$5,Bogføring!$F:$F,A68)+F61","v":800}]
[]
[]
[12370,"Forudbetalt kontingent",{"$f":"SUMIFS(Bogføring!$H:$H,Bogføring!$A:$A,\">=\"&T!$C$4,Bogføring!$A:$A,\"<=\"&T!$C$5,Bogføring!$F:$F,A71)-SUMIFS(Bogføring!$G:$G,Bogføring!$A:$A,\">=\"&T!$C$4,Bogføring!$A:$A,\"<=\"&T!$C$5,Bogføring!$F:$F,A71)+F62","v":0}]
[12380,"Banklån",{"$f":"SUMIFS(Bogføring!$H:$H,Bogføring!$A:$A,\">=\"&T!$C$4,Bogføring!$A:$A,\"<=\"&T!$C$5,Bogføring!$F:$F,A72)-SUMIFS(Bogføring!$G:$G,Bogføring!$A:$A,\">=\"&T!$C$4,Bogføring!$A:$A,\"<=\"&T!$C$5,Bogføring!$F:$F,A72)+F62","v":0}]
[12390,"Andre Lån",{"$f":"SUMIFS(Bogføring!$H:$H,Bogføring!$A:$A,\">=\"&T!$C$4,Bogføring!$A:$A,\"<=\"&T!$C$5,Bogføring!$F:$F,A73)-SUMIFS(Bogføring!$G:$G,Bogføring!$A:$A,\">=\"&T!$C$4,Bogføring!$A:$A,\"<=\"&T!$C$5,Bogføring!$F:$F,A73)+F63","v":0}]
[12400,"Kreditorer samler konto",{"$f":"SUM(C71:C73)","v":0},null,12370,12390]
[null,null,{"$f":"SUM(C66:C74)","v":1975.6000000000001}]
[12410,"Tilgodehavende Kontingenter",{"$f":"SUMIFS(Bogføring!$H:$H,Bogføring!$A:$A,\">=\"&T!$C$4,Bogføring!$A:$A,\"<=\"&T!$C$5,Bogføring!$F:$F,A76)-SUMIFS(Bogføring!$G:$G,Bogføring!$A:$A,\">=\"&T!$C$4,Bogføring!$A:$A,\"<=\"&T!$C$5,Bogføring!$F:$F,A76)+F72","v":0}]
[12420,"Lån til Forsvarsmuseumet",{"$f":"SUMIFS(Bogføring!$G:$G,Bogføring!$A:$A,\">=\"&T!$C$4,Bogføring!$A:$A,\"<=\"&T!$C$5,Bogføring!$F:$F,A77)-SUMIFS(Bogføring!$H:$H,Bogføring!$A:$A,\">=\"&T!$C$4,Bogføring!$A:$A,\"<=\"&T!$C$5,Bogføring!$F:$F,A77)+F73","v":0}]
[12500,"Debitorer samler konto",{"$f":"SUM(C76:C77)","v":0},null,12410,12420]

{"sheet":"Udgiftsbilag","index":6,"n_rows":24,"n_cols":9,"rows_kept":24,"cut":false,"hidden":true,"merged":[[10,6,11,7],[10,8,11,9],[12,2,12,3],[12,6,14,7],[12,8,14,9],[14,2,14,3],[8,6,9,9],[1,2,1,4],[2,2,2,4],[6,1,6,2],[6,8,6,9]]}
[]
[]
[null,null,"Bornholms Forsvarsmuseum"]
[]
[]
[]
[null,"Udgifts bilag.",null,null,null,null,"Bilags nr.:"]
[]
[null,null,null,null,null,null,"Kontering"]
[]
[null,null,null,null,null,null,"D",null,"K"]
[]
[null,"Dato:"]
[]
[null,"Beløb:"]
[]
[null,"Formål:"]
[]
[]
[]
[]
[null,"Betalt til : "]
[]
[null,"Underskrift:"]

{"sheet":"T","index":7,"n_rows":34,"n_cols":20,"rows_kept":34,"cut":false,"hidden":false,"merged":[[28,0,28,4],[29,0,29,5],[25,0,25,4],[14,1,14,4],[22,0,22,6],[16,1,16,4],[12,1,12,4],[6,2,6,4],[19,0,19,6],[3,7,3,9],[5,12,5,13],[12,8,12,9],[5,14,5,15],[10,7,10,9],[5,18,5,19],[8,1,8,4],[8,7,8,9],[5,16,5,17],[6,7,6,9],[10,1,10,4],[5,10,5,11]]}
[]
["Regnskabs år ",{"$f":"C2+1","v":2023},2022,{"$f":"C2-1","v":2021},{"$f":"C2-2","v":2020},{"$f":"D2-2","v":2019},null,"cellen C2","her indtastes det indeværende regnskabs år"]
[null,{"$f":"IF(YEAR(B4)<>YEAR(B5),YEAR(B4)&\"-\"&YEAR(B5),YEAR(B4))","v":2023},{"$f":"IF(YEAR(C4)<>YEAR(C5),YEAR(C4)&\"-\"&YEAR(C5),YEAR(C4))","v":2022},{"$f":"IF(YEAR(D4)<>YEAR(D5),YEAR(D4)&\"-\"&YEAR(D5),YEAR(D4))","v":2021},{"$f":"IF(YEAR(E4)<>YEAR(E5),YEAR(E4)&\"-\"&YEAR(E5),YEAR(E4))","v":2020},{"$f":"IF(YEAR(F4)<>YEAR(F5),YEAR(F4)&\"-\"&YEAR(F5),YEAR(F4))","v":2019}]
["Regnskabsårets start ",{"$f":"DATE(B2-I5,$L$5,$K$5)","v":"2023-01-01"},{"$f":"DATE(C2-I5,$L$5,$K$5)","v":"2022-01-01"},{"$f":"DATE(D2-I5,$L$5,$K$5)","v":"2021-01-01"},{"$f":"DATE(E2-I5,$L$5,$K$5)","v":"2020-01-01"},{"$f":"DATE(F2-I5,$L$5,$K$5)","v":"2019-01-01"},null,"Regnskabs året starter :",null,null,"dag","måned"]
["Regnskabs årets slut",{"$f":"N7","v":"2023-12-31"},{"$f":"L7","v":"2022-12-31"},{"$f":"P7","v":"2021-12-31"},{"$f":"R7","v":"2020-12-31"},{"$f":"T7","v":"2019-12-31"},null,null,0,null,1,1]
[null,null,null,null,null,null,null,null,null,null,"Aktuelt år",null,"Budget år",null,"realiseret år",null,"realiseret år",null,"realiseret år"]
[{"$f":"\"Periode : \"&TEXT(C4,\"dd-mm-åååå\")&\" - \"&TEXT(IF(TODAY()>C5,C5,TODAY()),\"dd-mm-åååå\")","v":"Periode : 01-01-2022 - 16-05-2022"},null,"version 1.00.009.047",null,null,null,null,"Regnskabs året slutter :",null,null,{"$f":"C4-1","v":"2021-12-31"},{"$f":"DATE(YEAR(K7)+1,MONTH(K7),DAY(K7))","v":"2022-12-31"},{"$f":"B4-1","v":"2022-12-31"},{"$f":"DATE(YEAR(M7)+1,MONTH(M7),DAY(M7))","v":"2023-12-31"},{"$f":"D4-1","v":"2020-12-31"},{"$f":"DATE(YEAR(O7)+1,MONTH(O7),DAY(O7))","v":"2021-12-31"},{"$f":"E4-1","v":"2019-12-31"},{"$f":"DATE(YEAR(Q7)+1,MONTH(Q7),DAY(Q7))","v":"2020-12-31"},{"$f":"F4-1","v":"2018-12-31"},{"$f":"DATE(YEAR(S7)+1,MONTH(S7),DAY(S7))","v":"2019-12-31"}]
[]
["Foreningens navn:","xxxxxxxxxxxxx",null,null,null,null,null,"Revisionspåtegning: (1-3)",null,null,1,"0= tomt felt"]
[]
["Kasserer :","Kasserer",null,null,null,null,null,"Næste medl. Nr. :",null,null,109]
[]
["Bilagskontollant :","xxxx xxxx",null,null,null,null,null,"SE-NR : ",88739817]
[]
["Bilagskontollant :","xxxxx xx"]
[]
["Mail til Revisor :","xxx"]
[]
["Revisionspåtegning: 1"]
["Regnskabet er d.d. revideret. Beholdningkonti er fundet til stede. Bogføringen er kontrollet. \nRevisionen gav anledning til flg. Bemærkning"]
[]
["Revisionspåtegning: 2"]
["Kalenderårsregnskabet med resultatopgørese og balance er gennemgået og afstemt af\ngeneralforsamlingsvante revisorer samt jf. foreningens lov/vedtægt\nmed bogføringsbekendtgørelsen som vejledning.\nFra statustidspunktet og til revisionsdatoen er der ikke kendskab til forhold, som vil kunne forrykke\nvurderingen af regnskabet, som giver et retvisende billede.\n\n"]
[]
["Revisionspåtegning: 3"]
["Årsregnskabet med bilag, resultat, balance og udtog er gennemgået og afstemt af\nde valgte revisorer.\nGennemgangen har ikke givet anledning til bemærkninger."]
[]
["Bemærkninger:"]
["Regnskabet er det 6. i Bornholmske Dragoner, og på baggrund af 74 betalende medlemmer.\nDer er 14 restancer."]
[]
[]
[]
[]
[2021]

{"sheet":"Regnskab GF2","index":8,"n_rows":31,"n_cols":7,"rows_kept":31,"cut":false,"hidden":true,"merged":[[1,1,1,7],[20,1,20,6],[35,1,35,7]]}
[]
[null,"REGNSKAB FOR 3. ORDINÆRE GENERALFORSAMLING 13.01.18. "]
[]
[null,null,"Antal",null,"Indtægt","Udgift","Resultat"]
[null,"Kuv. Gule ærter/Stroganof",null,150]
[null,"øl",null,10]
[null,"Kaffe, småkager"]
[null,"12 Morgenmad inkl. bestyrelse"]
[null,"Værelser (10 enheder)",null,75]
[null,"Duge, servietter m.m."]
[null,"Salg af øl",null,20]
[null,"Salg af snaps",null,20]
[null,"Salg af vand",null,10]
[null,"Salg af mærker",null,50]
[null,null,null,null,null,0]
[null,null,null,null,null,0]
[null,null,null,null,null,0]
[null,"Gave til ",null,null,null,0]
[null,"I alt",null,null,{"$f":"SUM(E5:E18)","v":0},{"$f":"SUM(F5:F18)","v":0},{"$f":"E19-F19","v":0}]
[]
[null,"Salget på denne generalforsamling har vist sig at passe perfekt - det stemmer på øren - og det er dejligt. Ved optælling af beholdning af øl og snaps, er der 30 øl og lidt snaps, til næste arrangement."]
[]
[]
[null,null,null,null,"Indtægt","Udgift","TOTAL"]
[null,"Kontant fra festen indsat i bank"]
[]
[null,"Salg af 11 klister/stofmærker"]
[null,"Salg af 79 øl og 27 snaps = 106"]
[null,"Salg af 8 vand"]
[null,"I alt"]
[null,"Overskud",null,null,null,null,{"$f":"G25-G30","v":0}]

{"sheet":"vejlend.","index":9,"n_rows":46,"n_cols":5,"rows_kept":46,"cut":false,"hidden":true,"merged":[]}
["HUSK:"]
["Ved årsskifte / regnskabsårsafslutning."]
[]
["PRINT:","DETTE ÅR:"]
[null,"Bogføring hele året"]
[null,"Kontoplan"]
[null,"Regnskab"]
[null,"1. Kontoudtog fra banken hele året (fra 1/1 til 31/12)"]
[null,"2. Kontoudtog fra banken hele året (fra 1/1 til 31/12)"]
[]
["PRINT:","NYT ÅR:"]
[null,"Bogføring for nyt år"]
[null,"Kontoplan"]
[null,"1. Kontoudtog fra banken nyt år (fra 1/1 -  ….)"]
[null,"2. Kontoudtog fra banken nyt år (fra 1/1 -  ….)"]
[]
["Mail til REVISOR:","Sende mail med vedhæftet:"]
[null,"Bogføring dette år"]
[null,"Bogføring nyt år"]
[null,"Tid for besøg med bilag"]
[null,"Evt.  -  bemærkninger til året"]
[]
["Til REVISOR:","Alle bilag"]
[null,"Alle udtog"]
[null,"Alle kontoudtog / bankkontoudtog"]
[null,"Alle opgørelser"]
[null,"Evt. køb/salg"]
[null,"evt. +???"]
[]
[]
["ÅRSSKIFTE","Ændre til nyt år på ÅR p.t."]
[null,"BEMÆRK:"]
[null,"år 1 = budget / næste år",null,null,"rettes efter aktuelt år"]
["nyt år","år 2 = aktuelt år / dette år",null,null,"KUN aktuelt år indtastes"]
[null,"år 3 = sidste år realiseret",null,null,"rettes efter aktuelt år"]
[null,"år 4 = forrige år realiseret",null,null,"rettes efter aktuelt år"]
[]
["nyt år","Rette ARK Bogføring: B55 til ny dato"]
[null,"(rette ARK Bogføring: B45 til ny dato)"]
[]
["BUDGET:","indtastes i Bogføring med næste års dato"]
[null,"(evt. i hovedtal) - nyt regnskabsår + 1 år.."]
[]
[]
["NB.","Afslutningsposter i tilhørende år (31/12 / ultimo)"]
[null,"Åbningsposter fra tilhørende år (1/1 / primo)"]

{"sheet":"Udmeldelser","index":10,"n_rows":11,"n_cols":9,"rows_kept":11,"cut":false,"hidden":true,"merged":[]}
["Medl.nr. :","NAVN","ADRESSE ","POSTNR","By","TELEFON","E-MAIL","Udmeldt ","Bemærkning:"]
[1,"Finn Bræstrup Karlsen","Vimmelskaftet 14",3700,"Rønne",null,"fjkarlsen@gmail.com"]
[2,"Lone Kure","Harbovej 40A",3700,"Rønne",null,"lonekure2014@gmail.com"]
[3,"Ole og Olga Drobova Andersen","Vesterbro 10",3720,"Åkirkeby",null,"ole_andersen@hotmail.com"]
[4,"Ole Koefoed Marker","Piberegård, Bodernevej 17",3720,"Åkirkeby",null,null,null,"DØD-oplyst 13.09.19."]
[5,"Birgit Andersen","Mulebyvej 2",3700,"Rønne",null,"birgitkure@gmail.com"]
[6,"Birthe Juel-Jensen","Egeløkken 3",3700,"Rønne",56961052,null,null,"Død - jan 2020"]
[7,"Sven Munch og Pyllis Holm","Morbærstien 5",3700,"Rønne",null,null,null,"Død - feb 2020"]
[29,"Nina Vibe","Charlottevej 7, Muleby",3700,"Rønne",null,"ninavibe@live.dk","2020-04-07"]
[133,"Jonna Jensen","Spodsbjergvej 127",5900,"Rudkøbing",20311031,"GIRO",2019]
[1007,"MALERFIRMAET Borg Aps","Åkirkebyvej 66",3700,"Rønne",null," info@malerborg.dk"]

{"sheet":"Om","index":11,"n_rows":71,"n_cols":3,"rows_kept":71,"cut":false,"hidden":true,"merged":[]}
[null,"Dette regneark er lavet efter en ide fra Excelgaard.dk"]
[null,"Revideret af Bjarne Hansen "]
[]
[null,"Besøg excelgaard.dk"]
[]
[null,"START med DATAår + kontoplan"]
[null,"Jeg vil gerne knytte en kommentar til det regneark, som Bjarne H. har lagt op..."]
[]
[null,"Fra: EXCELGAARD:  19/4-2018:"]
[null,"1. Bemærk, at man skal kende til, og benytte det dobbelt bogføringssystem, med debit og kredit posteringer."]
[null,"2. En \"fed\" ting ved systemet, er, at man kan benytte bogføringen løbende år efter år, og i princippet aldrig behøver opstarte et nyt bogføringsark, selvom man starter et nyt regnskabsår - ja, faktisk er det meningen, at man blot skal forsætte, og så på 'Regnskab' arket, skal man benytter '=SUM.HVISSER()' til både, at afgrænse på konto og datoer (regnskabsår)."]
[null,"(Bjarne er netop opstartet på regnearket, og afgrænser, lige nu, blot på konto, men, når der skiftes regnskabsår, skal formlerne lige udvides til datoer også"]
[null,"3. Er man rigtigt snu, så laver man et felt til indtastning af regnskabsår på ARK: \"ÅR p.t.\", og dermed kan man altid hente et bestemt regnskabsår, med sammenligningsregnskab, selvom årene går."]
[null,"4. Man kan let udvide bogføringsarket til også, at indeholde dimensioner - hvis man f.eks. tilføjer en kolonne, der hedder 'Faktua', kan man altid indtast både egne og leverandørers faktura nummer, og fremover hurtigt finde dem, ved hjælp af filteret."]
[null,"5. Og, det er jo kun fantasien, der bestemmer, hvilke dimensioner man ønsker på posteringerne, f.eks. 'Køretøj', 'Medarbejder', 'Afdeling', 'Formål', 'Bærer', 'Kunde', 'Medlem', 'Leverandør', o.s.v.."]
[]
[null,"Kilde:"]
[null,"Udarbejdet af: Excelgaard 2016"]
[null,"Tilrettet af: Bjarne Hansen 2018"]
[null,"+ønsker m.m. fra: InfoTAL / H.C. 04/2018 (via DRF)"]
[]
[null,"Dette program er velegnet til "]
[null,"mindre regnskaber for foreninger o.l."]
[]
[null,"Skal der være konti med moms, så se evt. på: www.dinero.dk"]
[null,"(u/beregning u/revisionsmodul - ellers gebyr pr. md.)"]
[]
[null,"BOGFØRING: - (vejledning) - ARK: Bogføring"]
[null,"ART:                Debet                    Kredit"]
[null,"drift                 udgift                     indtægt"]
[null,"status              ejer                        skylder"]
[]
[null,"egenkapital     negativ                   positiv"]
[null,"resultat           positiv                    negativ"]
[]
[]
[]
["ÅRSSKIFTE","Ændre til nyt år på ÅR p.t."]
[null,"BEMÆRK:"]
[null,"år 1 = budget / næste år","rettes efter aktuelt år"]
[null,"år 2 = aktuelt år / dette år","KUN aktuelt år indtastes"]
[null,"år 3 = sidste år realiseret","rettes efter aktuelt år"]
[null,"år 4 = forrige år realiseret","rettes efter aktuelt år"]
[]
["BUDGET:","indtastes i Bogføring med næste års dato"]
[null,"(evt. i hovedtal)"]
[]
[]
["NB.","Afslutningsposter i tilhørende år (31/12 / ultimo)"]
[null,"Åbningsposter fra tilhørende år (1/1 / primo)"]
[]
[]
["(daglig)","ARK: Bogføring= posteriger e/bilag o.l. (kasse) m/saldokontrol"]
[null,"ARK: vejledn.= vejledning"]
["(opstart)","ARK: Kontoplan= opret/oprettede konti"]
[null,"ARK: Regnskab= de bogførte bilag/poster på konti"]
["(årligt)","ARK: ÅR p.t.= til oprettelse af aktuelt regnskabsår"]
[null,"ARK: Om= beskrivelse af funktioner"]
[null,"ARK: Afv %= er BUDGET + aktuelt år og de sidste 2 år - med sammenligning/afvigelse"]
[null,"            (Budget oprettes i Bogføring - se vejledning)"]
[null,"FORMLER:  MÅ IKKE ÆNDRES - så virker regnearket ikke.."]
[]
[null,"Revisionspåtegning:"]
[null,"Tilrettes efter revisorernes eget valg  (kun forslag på ARK: Regnskab)"]
[]
[null,"KONTROL:"]
[null,"Bankkonti afstemmes løbende på ARK: Bogføring øverst efter E1 og E2 (saldo)"]
[]
[null,"LÅSTE CELLER:"]
[null,"Der er ikke låste celler - det kan frit oprettes e/ønske"]
[null,"Frys ruder kan udvides e/ønske"]

{"sheet":"Kontokort","index":12,"n_rows":39,"n_cols":12,"rows_kept":39,"cut":false,"hidden":false,"merged":[[1,8,1,9]]}
[]
[null,null,null,null,null,null,null,null,null,null,null,"Her på arket har jeg vist eksempler på, hvordan du kan undgå"]
["KONTOKORT",null,null,null,null,null,null,null,null,null,null,"Flet og Centrer."]
["Kontonavn:",{"$f":"VLOOKUP(J4,Kontoplan!A2:B94,2,0)","v":"Lønninger incl ATP -AM"},null,null,null,null,null,null,null,3110,null,"Indtast kun kontonummeret. Teksten \"Konto\""]
["År",null,null,null,null,null,null,null,"Side",null,null,"fremkommer via formatering."]
["Dato",null,"Bilag nr.","Tekst","Medl nr","Årstal","Debet","Kredit","D/K","Saldo",null,"Sammenflettede celler er noget af det værste bras,"]
[{"$f":"_xlfn._xlws.FILTER(d[Dato],(d[Konto]=Kontokort!J4)*(d[Dato]>=T!C4)*(d[Dato]<=T!C5),\"\")","v":"2022-01-28"},null,{"$f":"_xlfn._xlws.FILTER(d[Bilag],(d[Konto]=Kontokort!J4)*(d[Dato]>=T!C4)*(d[Dato]<=T!C5),\"\")","v":15},{"$f":"_xlfn._xlws.FILTER(d[Tekst],(d[Konto]=Kontokort!J4)*(d[Dato]>=T!C4)*(d[Dato]<=T!C5),\"\")","v":0},null,null,{"$f":"_xlfn._xlws.FILTER(d[[Debet]:[Kredit]],(d[Konto]=Kontokort!J4)*(d[Dato]>=T!C4)*(d[Dato]<=T!C5),\"\")","v":10000},0,null,{"$f":"IF(A7,SUM(G$7:G7)-SUM(H$7:H7),\"\")","v":10000},null,"hvilket filen her er et afskrækkende eksempel på."]
["2022-01-28",null,15,0,null,null,200,0,null,{"$f":"IF(A8,SUM(G$7:G8)-SUM(H$7:H8),\"\")","v":10200},null,"Brug Center Across Selection i stedet for."]
["2022-02-25",null,27,0,null,null,10000,0,null,{"$f":"IF(A9,SUM(G$7:G9)-SUM(H$7:H9),\"\")","v":20200},null,"(Format, Format Cells, Alignment, Center Across Selection)."]
["2022-02-25",null,27,0,null,null,200,0,null,{"$f":"IF(A10,SUM(G$7:G10)-SUM(H$7:H10),\"\")","v":20400}]
["2022-03-30",null,40,0,null,null,10000,0,null,{"$f":"IF(A11,SUM(G$7:G11)-SUM(H$7:H11),\"\")","v":30400},null,"Dansk: Formatér; Formatér celler, Vandret: Centrer over markeringen."]
["2022-03-30",null,40,0,null,null,200,0,null,{"$f":"IF(A12,SUM(G$7:G12)-SUM(H$7:H12),\"\")","v":30600}]
["2022-04-28",null,55,0,null,null,10000,0,null,{"$f":"IF(A13,SUM(G$7:G13)-SUM(H$7:H13),\"\")","v":40600},null,"Hvis du vil undgå de mange tastetryk kan du optage en makro"]
["2022-04-28",null,55,0,null,null,200,0,null,{"$f":"IF(A14,SUM(G$7:G14)-SUM(H$7:H14),\"\")","v":40800},null,"og oprette en knap på det der hedder \"Hurtig adgang\" over båndet."]
[null,null,null,null,null,null,null,null,null,{"$f":"IF(A15,SUM(G$7:G15)-SUM(H$7:H15),\"\")","v":""},null,"Det er ikke nødvendigt at oprette hjælpekolonne A i ark Bogføring."]
[null,null,null,null,null,null,null,null,null,{"$f":"IF(A16,SUM(G$7:G16)-SUM(H$7:H16),\"\")","v":""},null,"I din oprindelige fil har du sammenflettede celler i ark Kontokort "]
[null,null,null,null,null,null,null,null,null,{"$f":"IF(A17,SUM(G$7:G17)-SUM(H$7:H17),\"\")","v":""},null,"i række 46 og flere herunder, hvilket er det der giver problemet med "]
[null,null,null,null,null,null,null,null,null,{"$f":"IF(A18,SUM(G$7:G18)-SUM(H$7:H18),\"\")","v":""},null,"overløb. Her ser du et af de mange problemer der er med flettede."]
[null,null,null,null,null,null,null,null,null,{"$f":"IF(A19,SUM(G$7:G19)-SUM(H$7:H19),\"\")","v":""},null,"celler. Undgå dem for næsten enhver pris."]
[null,null,null,null,null,null,null,null,null,{"$f":"IF(A20,SUM(G$7:G20)-SUM(H$7:H20),\"\")","v":""},null,"Jeg har lavet Bogføring!A6:J950 til en Excel Tabel og har kaldt den d"]
[null,null,null,null,null,null,null,null,null,{"$f":"IF(A21,SUM(G$7:G21)-SUM(H$7:H21),\"\")","v":""},null,"(hvilket kan gøres i Navnestyring). Det er mere end 10 år siden Excel"]
[null,null,null,null,null,null,null,null,null,{"$f":"IF(A22,SUM(G$7:G22)-SUM(H$7:H22),\"\")","v":""},null,"Tabeller blev introduceret. Lær at bruge dem - de har mange fordele,"]
[null,null,null,null,null,null,null,null,null,{"$f":"IF(A23,SUM(G$7:G23)-SUM(H$7:H23),\"\")","v":""},null,"Blandt andet det der hedder \"Strukturerede Referencer\" som  jeg har "]
[null,null,null,null,null,null,null,null,null,{"$f":"IF(A24,SUM(G$7:G24)-SUM(H$7:H24),\"\")","v":""},null,"brugt i formlerne nu. Herved udvider tabellen d i ark Bogføring sig "]
[null,null,null,null,null,null,null,null,null,{"$f":"IF(A25,SUM(G$7:G25)-SUM(H$7:H25),\"\")","v":""},null,"automatisk efterhånden som du fylder nye data ind."]
[null,null,null,null,null,null,null,null,null,{"$f":"IF(A26,SUM(G$7:G26)-SUM(H$7:H26),\"\")","v":""}]
[null,null,null,null,null,null,null,null,null,{"$f":"IF(A27,SUM(G$7:G27)-SUM(H$7:H27),\"\")","v":""}]
[null,null,null,null,null,null,null,null,null,{"$f":"IF(A28,SUM(G$7:G28)-SUM(H$7:H28),\"\")","v":""}]
[null,null,null,null,null,null,null,null,null,{"$f":"IF(A29,SUM(G$7:G29)-SUM(H$7:H29),\"\")","v":""}]
[null,null,null,null,null,null,null,null,null,{"$f":"IF(A30,SUM(G$7:G30)-SUM(H$7:H30),\"\")","v":""}]
[null,null,null,null,null,null,null,null,null,{"$f":"IF(A31,SUM(G$7:G31)-SUM(H$7:H31),\"\")","v":""}]
[null,null,null,null,null,null,null,null,null,{"$f":"IF(A32,SUM(G$7:G32)-SUM(H$7:H32),\"\")","v":""}]
[null,null,null,null,null,null,null,null,null,{"$f":"IF(A33,SUM(G$7:G33)-SUM(H$7:H33),\"\")","v":""}]
[null,null,null,null,null,null,null,null,null,{"$f":"IF(A34,SUM(G$7:G34)-SUM(H$7:H34),\"\")","v":""}]
[null,null,null,null,null,null,null,null,null,{"$f":"IF(A35,SUM(G$7:G35)-SUM(H$7:H35),\"\")","v":""}]
[null,null,null,null,null,null,null,null,null,{"$f":"IF(A36,SUM(G$7:G36)-SUM(H$7:H36),\"\")","v":""}]
[null,null,null,null,null,null,null,null,null,{"$f":"IF(A37,SUM(G$7:G37)-SUM(H$7:H37),\"\")","v":""}]
[null,null,null,null,null,null,null,null,null,{"$f":"IF(A38,SUM(G$7:G38)-SUM(H$7:H38),\"\")","v":""}]
[null,null,null,null,null,null,null,null,null,{"$f":"IF(A39,SUM(G$7:G39)-SUM(H$7:H39),\"\")","v":""}]

{"sheet":"T2","index":13,"n_rows":43,"n_cols":23,"rows_kept":43,"cut":false,"hidden":false,"merged":[[39,0,39,4],[42,0,42,4],[43,0,43,5],[24,1,24,4],[26,1,26,4],[28,1,28,4],[30,1,30,4],[33,0,33,4],[36,0,36,4],[22,1,22,4],[6,2,6,4],[6,7,6,9],[8,1,8,4],[8,7,8,9],[10,1,10,4],[10,7,10,9],[12,1,12,4],[14,1,14,4],[16,1,16,4],[18,1,18,4],[20,1,20,4],[12,7,12,9],[12,10,12,13],[5,18,5,19],[3,7,3,9],[5,10,5,11],[5,12,5,13],[5,14,5,15],[5,16,5,17]]}
[null,null,null,null,null,null,null,null,null,null,null,null,null,null,null,null,null,null,null,null,null,null,"Formand/Sekretær"]
["Regnskabs år ",{"$f":"C2+1","v":2023},2022,{"$f":"C2-1","v":2021},{"$f":"C2-2","v":2020},{"$f":"D2-2","v":2019},null,"cellen C2","her indtastes det indeværende regnskabs år",null,null,null,null,null,null,null,null,null,null,null,null,null,"Næstformand"]
[null,{"$f":"IF(YEAR(B4)<>YEAR(B5),YEAR(B4)&\"-\"&YEAR(B5),YEAR(B4))","v":2023},{"$f":"IF(YEAR(C4)<>YEAR(C5),YEAR(C4)&\"-\"&YEAR(C5),YEAR(C4))","v":2022},{"$f":"IF(YEAR(D4)<>YEAR(D5),YEAR(D4)&\"-\"&YEAR(D5),YEAR(D4))","v":2021},{"$f":"IF(YEAR(E4)<>YEAR(E5),YEAR(E4)&\"-\"&YEAR(E5),YEAR(E4))","v":2020},{"$f":"IF(YEAR(F4)<>YEAR(F5),YEAR(F4)&\"-\"&YEAR(F5),YEAR(F4))","v":2019},null,null,null,null,null,null,null,null,null,null,null,null,null,null,null,null,"Web ansvarlig"]
["Regnskabsårets start ",{"$f":"DATE(B2-I5,$L$5,$K$5)","v":"2023-01-01"},{"$f":"DATE(C2-I5,$L$5,$K$5)","v":"2022-01-01"},{"$f":"DATE(D2-I5,$L$5,$K$5)","v":"2021-01-01"},{"$f":"DATE(E2-I5,$L$5,$K$5)","v":"2020-01-01"},{"$f":"DATE(F2-I5,$L$5,$K$5)","v":"2019-01-01"},null,"Regnskabs året starter :",null,null,"dag","måned",null,null,null,null,null,null,null,null,null,null,"Forbindelsesp. til AK"]
["Regnskabs årets slut",{"$f":"N7","v":"2023-12-31"},{"$f":"L7","v":"2022-12-31"},{"$f":"P7","v":"2021-12-31"},{"$f":"R7","v":"2020-12-31"},{"$f":"T7","v":"2019-12-31"},null,null,0,null,1,1,null,null,null,null,null,null,null,null,null,null,"Ad hoc"]
[null,null,null,null,null,null,null,null,null,null,"Aktuelt år",null,"Budget år",null,"realiseret år",null,"realiseret år",null,"realiseret år",null,null,null,"Suppleant"]
[{"$f":"\"Periode : \"&TEXT(C4, \"dd-mm-åååå\")& \" - \"&TEXT(C5,\"dd-mm-åååå\")","v":"Periode : 01-01-2022 - 31-12-2022"},null,"version 2020.00.02.00",null,null,null,null,"Regnskabs året slutter :",null,null,{"$f":"C4-1","v":"2021-12-31"},{"$f":"DATE(YEAR(K7)+1,MONTH(K7),DAY(K7))","v":"2022-12-31"},{"$f":"B4-1","v":"2022-12-31"},{"$f":"DATE(YEAR(M7)+1,MONTH(M7),DAY(M7))","v":"2023-12-31"},{"$f":"D4-1","v":"2020-12-31"},{"$f":"DATE(YEAR(O7)+1,MONTH(O7),DAY(O7))","v":"2021-12-31"},{"$f":"E4-1","v":"2019-12-31"},{"$f":"DATE(YEAR(Q7)+1,MONTH(Q7),DAY(Q7))","v":"2020-12-31"},{"$f":"F4-1","v":"2018-12-31"},{"$f":"DATE(YEAR(S7)+1,MONTH(S7),DAY(S7))","v":"2019-12-31"},null,null,"Bilagskontrollant"]
[null,null,null,null,null,null,null,null,null,null,null,null,null,null,null,null,null,null,null,null,null,null,"Kasserer"]
["Foreningens navn:","TEST regnskab",null,null,null,null,null,"Revisionspåtegning: (1-3)",null,null,1,"0= tomt felt"]
[]
["Foreningens adresse : ","xxxxxxxxx",null,null,null,null,null,"Næste medl. Nr. :",null,null,147]
[]
["Foreningens Postnr & By : ","xxxxxxxxxx",null,null,null,null,null,"Kommune : ",null,null,"Bornholms Regionskommune"]
[]
["Formand : ","Formand"]
[]
["Kasserer :","Kassere"]
[]
["Bestyrelses medlem  : ","Bestyrelses medlem 1"]
[]
["Bestyrelses medlem  : ","Bestyrelses medlem 2"]
[]
["Bestyrelses medlem  : ","Bestyrelses medlem 3"]
[]
["Foreningens CVR-nr.  : ","xxxxxxxxx"]
[]
["Resiosor : ","xxxxxxxxx"]
[]
["Bilagskontollant :","xxxxxxxx"]
[]
["Mail til Revisor :","xxx"]
[]
["Revisionspåtegning: 1"]
["Regnskabet er d.d. revideret. Beholdningkonti er fundet til stede. Bogføringen er kontrollet. \nRevisionen gav anledning til flg. Bemærkning"]
[]
["Revisionspåtegning: 2"]
["Kalenderårsregnskabet med resultatopgørese og balance er gennemgået og afstemt af\ngeneralforsamlingsvante revisorer samt jf. foreningens lov/vedtægt\nmed bogføringsbekendtgørelsen som vejledning.\nFra statustidspunktet og til revisionsdatoen er der ikke kendskab til forhold, som vil kunne forrykke\nvurderingen af regnskabet, som giver et retvisende billede.\n\n"]
[]
["Revisionspåtegning: 3"]
["Årsregnskabet med bilag, resultat, balance og udtog er gennemgået og afstemt af\nde valgte revisorer.\nGennemgangen har ikke givet anledning til bemærkninger."]
[]
["Bemærkninger:"]
["Regnskabet er d.d. revideret. Beholdningkonti er fundet til stede. Bogføringen er kontrollet. \nRevisionen gav anledning til flg. Bemærkning"]

{"sheet":"Restanceliste","index":14,"n_rows":7,"n_cols":5,"rows_kept":7,"cut":false,"hidden":true,"merged":[[5,1,5,6],[4,0,4,6]]}
[]
[]
[]
[]
["der laves en funktion der danner restancelisten ved tryk på en knap\nhvis der findes en liste kommer der en msgbox om man ønsker at overskrive den"]
[null,"Hentes fra medlemslisten udfra A kolonnen med lopslag"]
["Medlems nr.:","Navn","Adresse","postnr","by"]