{"text_format":"1","workbook":"xlsx","n_sheets":15,"sheets":["Bogføring","Kontoplan","Regnskab GF","Medlemsliste","Afv %","Kontoplan (2)","Udgiftsbilag","T","Regnskab GF2","vejlend.","Udmeldelser","Om","Kontokort","T2","Restanceliste"],"not_rendered":{"charts":0,"images":7,"macros":1,"external_links":1,"defined_names":10,"comments":0,"pivot_tables":0},"unopened":[],"bounds":{"document_bytes":16777216,"sheet_cells":100000,"rows_first":2000,"rows_last":500,"rows_between":2000,"halvings":0,"cell_chars":16384,"cell_head_chars":4096},"cells_cut":0,"cells_raw":0,"read":"whole","date_system":"1900"}

{"sheet":"Bogføring","index":0,"n_rows":2624,"n_cols":10,"rows_kept":2624,"cut":false,"hidden":false,"merged":[]}
[]
[]
[null,12310,"Bankbeholdning",{"$f":"SUMIFS(Bogføring!$G:$G,Bogføring!$A:$A,\">=\"&T!$C$4,Bogføring!$A:$A,\"<=\"&T!$C$5,Bogføring!$F:$F,B3)-SUMIFS(Bogføring!$H:$H,Bogføring!$A:$A,\">=\"&T!$C$4,Bogføring!$A:$A,\"<=\"&T!$C$5,Bogføring!$F:$F,B3)","v":21291.5}]
[null,12320,"Kassebeholdning",{"$f":"SUMIFS(Bogføring!$G:$G,Bogføring!$A:$A,\">=\"&T!$C$4,Bogføring!$A:$A,\"<=\"&T!$C$5,Bogføring!$F:$F,B4)-SUMIFS(Bogføring!$H:$H,Bogføring!$A:$A,\">=\"&T!$C$4,Bogføring!$A:$A,\"<=\"&T!$C$5,Bogføring!$F:$F,B4)","v":4736},null,null,null,null,null,{"$f":"T!C7&\" / Bjarne Hansen\"","v":"version 1.00.009.047 / Bjarne Hansen"}]
["Dato","Bilag","Tekst","Medl. Nr.","Årstal","Konto","Debet","Kredit","Kontobeskrivelse","Kommentarer"]
["2021-01-01",null,"Åbningsbalance, Overført Saldi",null,null,12310,63030.82,null,{"$f":"IF(F6=\"\",\"\",IF(ISERROR(VLOOKUP(F6,Kontoplan!A:D,2,0)),\"Konto findes ikke!\",VLOOKUP(F6,Kontoplan!A:D,2,0)))","v":"Bank konto"}]
["2021-01-01",null,"Åbningsbalance, Overført Saldi",null,null,12320,2118,null,{"$f":"IF(F7=\"\",\"\",IF(ISERROR(VLOOKUP(F7,Kontoplan!A:D,2,0)),\"Konto findes ikke!\",VLOOKUP(F7,Kontoplan!A:D,2,0)))","v":"Kasse"}]
["2021-01-01",null,"Åbningsbalance, Overført Saldi",null,null,12330,null,65148.82,{"$f":"IF(F8=\"\",\"\",IF(ISERROR(VLOOKUP(F8,Kontoplan!A:D,2,0)),\"Konto findes ikke!\",VLOOKUP(F8,Kontoplan!A:D,2,0)))","v":"Egenkapital"}]
["2021-01-04",1,null,null,null,12310,null,377.75,{"$f":"IF(F9=\"\",\"\",IF(ISERROR(VLOOKUP(F9,Kontoplan!A:D,2,0)),\"Konto findes ikke!\",VLOOKUP(F9,Kontoplan!A:D,2,0)))","v":"Bank konto"}]
["2021-01-04",1,null,null,null,2060,377.75,null,{"$f":"IF(F10=\"\",\"\",IF(ISERROR(VLOOKUP(F10,Kontoplan!A:D,2,0)),\"Konto findes ikke!\",VLOOKUP(F10,Kontoplan!A:D,2,0)))","v":"Internet, mobiltelefon, Forsik."}]
{"$rows_left_out":2615}
{"sheet":"Kontoplan","index":1,"n_rows":93,"n_cols":10,"rows_kept":93,"cut":false,"hidden":true,"merged":[]}
["Konto","Kontobeskrivelse","Saldo","Kommentarer","Fra","Til"]
[1000,"Entre",{"$f":"SUMIFS(Bogføring!$H:$H,Bogføring!$A:$A,\">=\"&T!$C$4,Bogføring!$A:$A,\"<=\"&T!$C$5,Bogføring!$F:$F,A2)-SUMIFS(Bogføring!$G:$G,Bogføring!$A:$A,\">=\"&T!$C$4,Bogføring!$A:$A,\"<=\"&T!$C$5,Bogføring!$F:$F,A2)","v":8740},null,null,null,null,1000,null,"Entre"]
[1010,"Kiosk salg",{"$f":"SUMIFS(Bogføring!$H:$H,Bogføring!$A:$A,\">=\"&T!$C$4,Bogføring!$A:$A,\"<=\"&T!$C$5,Bogføring!$F:$F,A3)-SUMIFS(Bogføring!$G:$G,Bogføring!$A:$A,\">=\"&T!$C$4,Bogføring!$A:$A,\"<=\"&T!$C$5,Bogføring!$F:$F,A3)","v":75},null,null,null,null,1010,null,"Voksne"]
[1020,"Tilskud fra BRK/ drifttilskud",{"$f":"SUMIFS(Bogføring!$H:$H,Bogføring!$A:$A,\">=\"&T!$C$4,Bogføring!$A:$A,\"<=\"&T!$C$5,Bogføring!$F:$F,A4)-SUMIFS(Bogføring!$G:$G,Bogføring!$A:$A,\">=\"&T!$C$4,Bogføring!$A:$A,\"<=\"&T!$C$5,Bogføring!$F:$F,A4)","v":74021},null,null,null,null,1020,null,"Pensionister"]
[1025,"Tilskud fra BRK ",{"$f":"SUMIFS(Bogføring!$H:$H,Bogføring!$A:$A,\">=\"&T!$C$4,Bogføring!$A:$A,\"<=\"&T!$C$5,Bogføring!$F:$F,A5)-SUMIFS(Bogføring!$G:$G,Bogføring!$A:$A,\">=\"&T!$C$4,Bogføring!$A:$A,\"<=\"&T!$C$5,Bogføring!$F:$F,A5)","v":15000},null,null,null,null,1030,null,"Børn 6-16"]
[1030,"Tilskud fra KVB",{"$f":"SUMIFS(Bogføring!$H:$H,Bogføring!$A:$A,\">=\"&T!$C$4,Bogføring!$A:$A,\"<=\"&T!$C$5,Bogføring!$F:$F,A6)-SUMIFS(Bogføring!$G:$G,Bogføring!$A:$A,\">=\"&T!$C$4,Bogføring!$A:$A,\"<=\"&T!$C$5,Bogføring!$F:$F,A6)","v":20000},null,null,null,null,1040,null,"Soldater/veteraner"]
[1040,"Fonde/Gaver",{"$f":"SUMIFS(Bogføring!$H:$H,Bogføring!$A:$A,\">=\"&T!$C$4,Bogføring!$A:$A,\"<=\"&T!$C$5,Bogføring!$F:$F,A7)-SUMIFS(Bogføring!$G:$G,Bogføring!$A:$A,\">=\"&T!$C$4,Bogføring!$A:$A,\"<=\"&T!$C$5,Bogføring!$F:$F,A7)","v":0},null,null,null,null,1050,null,"Skoler"]
[1050,"Aktiviteter",{"$f":"SUMIFS(Bogføring!$H:$H,Bogføring!$A:$A,\">=\"&T!$C$4,Bogføring!$A:$A,\"<=\"&T!$C$5,Bogføring!$F:$F,A8)-SUMIFS(Bogføring!$G:$G,Bogføring!$A:$A,\">=\"&T!$C$4,Bogføring!$A:$A,\"<=\"&T!$C$5,Bogføring!$F:$F,A8)","v":0},null,null,null,null,1060,null,"Grupper"]
[1060,"Bog salg",{"$f":"SUMIFS(Bogføring!$H:$H,Bogføring!$A:$A,\">=\"&T!$C$4,Bogføring!$A:$A,\"<=\"&T!$C$5,Bogføring!$F:$F,A9)-SUMIFS(Bogføring!$G:$G,Bogføring!$A:$A,\">=\"&T!$C$4,Bogføring!$A:$A,\"<=\"&T!$C$5,Bogføring!$F:$F,A9)","v":0},null,null,null,null,1070,null,"Guide"]
[1070,"Pengegaver",{"$f":"SUMIFS(Bogføring!$H:$H,Bogføring!$A:$A,\">=\"&T!$C$4,Bogføring!$A:$A,\"<=\"&T!$C$5,Bogføring!$F:$F,A10)-SUMIFS(Bogføring!$G:$G,Bogføring!$A:$A,\">=\"&T!$C$4,Bogføring!$A:$A,\"<=\"&T!$C$5,Bogføring!$F:$F,A10)","v":0},null,null,null,null,1080,null,"Tilskud fra BRK/ drifttilskud"]
{"$rows_left_out":84}
{"sheet":"Regnskab GF","index":2,"n_rows":46,"n_cols":6,"rows_kept":46,"cut":false,"hidden":true,"merged":[[1,0,1,6],[35,0,35,6],[20,0,20,5]]}
[]
["REGNSKAB FOR 3. ORDINÆRE GENERALFORSAMLING 13.01.18. "]
[]
[null,null,null,"Indtægt","Udgift","Resultat"]
["41 Kuv. Gule ærter/Stroganof",null,null,6450,3772]
["41 øl",null,null,null,430]
["Kaffe, småkager",null,null,null,64]
["12 Morgenmad inkl. bestyrelse",null,null,470,410]
["Værelser (10 enheder)",null,null,1125,784.16]
["Duge, servietter m.m.",null,null,null,611]
{"$rows_left_out":37}
{"sheet":"Medlemsliste","index":3,"n_rows":180,"n_cols":30,"rows_kept":180,"cut":false,"hidden":true,"merged":[[5,39,5,41],[7,39,7,41],[0,0,3,8],[3,9,4,9],[0,9,0,10],[1,9,1,10],[2,9,2,10],[3,39,3,41],[4,39,4,41],[0,12,2,12]]}
[{"$f":"\"Medlemsliste for \"&T!B9","v":"Medlemsliste for xxxxxxxxxxxxx"},null,null,null,null,null,null,null,null," Antal medlemmer : ",null,{"$f":"COUNT(A5:A189)","v":155},null,{"$f":"COUNT($A:$A)","v":155},null,{"$f":"COUNT($A:$A)","v":155},null,{"$f":"COUNT($A:$A)","v":155},null,{"$f":"COUNT($A:$A)","v":155}]
[null,null,null,null,null,null,null,null,null," Betalende medlemmer : ",null,{"$f":"COUNTIF(L6:L190,\">0\")+1","v":1},null,{"$f":"COUNTIF(M:M,\">0\")","v":0},null,{"$f":"COUNTIF(O:O,\">0\")","v":0},null,{"$f":"COUNTIF(Q:Q,\">0\")","v":0},null,{"$f":"COUNTIF(S:S,\">0\")","v":0}]
[null,null,null,null,null,null,null,null,null,"Rest : ",null,{"$f":"L1-L2-3","v":151},null,{"$f":"N1-N2","v":155},null,{"$f":"P1-P2","v":155},null,{"$f":"R1-R2","v":155},null,{"$f":"T1-T2","v":155}]
[null,null,null,null,null,null,null,null,null,"Medl.nr. :",null,{"$f":"DATE(L5,4,1)","v":"2020-04-01"},null,{"$f":"DATE(N5,4,1)","v":"2021-04-01"},null,"2022-04-01",null,"2023-04-01",null,"2024-04-01",null,"2025-04-01",null,"2026-04-01",null,"2027-04-01",null,"2028-04-01",null,"2029-04-01"]
["Medl.nr. :","NAVN","ADRESSE ","POSTNR","By","TELEFON","E-MAIL","Indmeldt","Bemærkning:",null,"Bet. Dato",2020,"Bet. Dato",2021,null,2022,null,2023,null,2024,null,2025,null,2026,null,2027,null,2028,null,2029]
[1,"Jens P. Christoffersson ","Højvangsparken 8 st. 1.",3700,"Rønne",40373460,"jp.stoffer.555@gmail.com",null,"Formand, Medlem af FU ",{"$f":"IF(A6=\"\",\"\",A6)","v":1},{"$f":"IF(L6=0,\"\",INDEX(Bogføring!$A:$A,MATCH(Tabel2[[#This Row],[Medl.nr. :]],Bogføring!$D:$D,0),0))","v":""},{"$f":"SUMIFS(Bogføring!H:H,Bogføring!E:E,\"=\"&$L$5,Bogføring!D:D,\"=\"&A6)","v":0},{"$f":"IF(N6=0,\"\",SUMIFS(Bogføring!$A:$A,Bogføring!$E:$E,\"=\"&$N$5,Bogføring!$D:$D,\"=\"&A6))","v":""},{"$f":"SUMIFS(Bogføring!H:H,Bogføring!E:E,\"=\"&$N$5,Bogføring!D:D,\"=\"&A6)","v":0},{"$f":"IF(P6=0,\"\",SUMIFS(Bogføring!$A:$A,Bogføring!$E:$E,\"=\"&$P$5,Bogføring!$D:$D,\"=\"&A6))","v":""},{"$f":"SUMIFS(Bogføring!$H:$H,Bogføring!$E:$E,\"=\"&$P$5,Bogføring!$D:$D,\"=\"&A6)","v":0},{"$f":"IF(R6=0,\"\",SUMIFS(Bogføring!$A:$A,Bogføring!$E:$E,\"=\"&$R$5,Bogføring!$D:$D,\"=\"&A6))","v":""},{"$f":"SUMIFS(Bogføring!$H:$H,Bogføring!$E:$E,\"=\"&$R$5,Bogføring!$D:$D,\"=\"&A6)","v":0},{"$f":"IF(T6=0,\"\",SUMIFS(Bogføring!$A:$A,Bogføring!$E:$E,\"=\"&$T$5,Bogføring!$D:$D,\"=\"&A6))","v":""},{"$f":"SUMIFS(Bogføring!$H:$H,Bogføring!$E:$E,\"=\"&$T$5,Bogføring!$D:$D,\"=\"&A6)","v":0},null,{"$f":"SUMIFS(Bogføring!$H:$H,Bogføring!$E:$E,\"=\"&$V$5,Bogføring!$D:$D,\"=\"&A6)","v":0},null,{"$f":"SUMIFS(Bogføring!$H:$H,Bogføring!$E:$E,\"=\"&$X$5,Bogføring!$D:$D,\"=\"&A6)","v":0},null,{"$f":"SUMIFS(Bogføring!$H:$H,Bogføring!$E:$E,\"=\"&$Z$5,Bogføring!$D:$D,\"=\"&A6)","v":0},null,{"$f":"SUMIFS(Bogføring!$H:$H,Bogføring!$E:$E,\"=\"&$AB$5,Bogføring!$D:$D,\"=\"&A6)","v":0},null,{"$f":"SUMIFS(Bogføring!$H:$H,Bogføring!$E:$E,\"=\"&$AD$5,Bogføring!$D:$D,\"=\"&A6)","v":0}]
[2,"Jens Chr. Skaarup","Hedningestræde 1",3700,"Rønne",21240945,"bjskaarup@gmail.com",null,"Næstformand, Medlem af FU",2,{"$f":"IF(L7=0,\"\",INDEX(Bogføring!$A:$A,MATCH(Tabel2[[#This Row],[Medl.nr. :]],Bogføring!$D:$D,0),0))","v":""},{"$f":"SUMIFS(Bogføring!H:H,Bogføring!E:E,\"=\"&$L$5,Bogføring!D:D,\"=\"&A7)","v":0},{"$f":"IF(N7=0,\"\",SUMIFS(Bogføring!A:A,Bogføring!E:E,\"=\"&$N$5,Bogføring!D:D,\"=\"&A7))","v":""},{"$f":"SUMIFS(Bogføring!H:H,Bogføring!E:E,\"=\"&$N$5,Bogføring!D:D,\"=\"&A7)","v":0},{"$f":"IF(N7=0,\"\",SUMIFS(Bogføring!$A:$A,Bogføring!$E:$E,\"=\"&$P$5,Bogføring!$D:$D,\"=\"&A7))","v":""},{"$f":"SUMIFS(Bogføring!$H:$H,Bogføring!$E:$E,\"=\"&$P$5,Bogføring!$D:$D,\"=\"&A7)","v":0}]
[3,"Jens Ole Ipsen Fassel","Smedegård, Kirkedalsvej 17, Rutsker",3700,"Rønne",56969798,"f@ssel.dk",null,"Bestyrelsesmedlem",3,{"$f":"IF(L8=0,\"\",INDEX(Bogføring!$A:$A,MATCH(Tabel2[[#This Row],[Medl.nr. :]],Bogføring!$D:$D,0),0))","v":""},{"$f":"SUMIFS(Bogføring!H:H,Bogføring!E:E,\"=\"&$L$5,Bogføring!D:D,\"=\"&A8)","v":0},{"$f":"IF(N8=0,\"\",SUMIFS(Bogføring!A:A,Bogføring!E:E,\"=\"&$N$5,Bogføring!D:D,\"=\"&A8))","v":""},{"$f":"SUMIFS(Bogføring!H:H,Bogføring!E:E,\"=\"&$N$5,Bogføring!D:D,\"=\"&A8)","v":0},{"$f":"IF(N8=0,\"\",SUMIFS(Bogføring!$A:$A,Bogføring!$E:$E,\"=\"&$P$5,Bogføring!$D:$D,\"=\"&A8))","v":""},{"$f":"SUMIFS(Bogføring!$H:$H,Bogføring!$E:$E,\"=\"&$P$5,Bogføring!$D:$D,\"=\"&A8)","v":0}]
[4,"Finn Kjerulff Hansen","Sigurdsgade 13",3700,"Rønne",30254320,"fkh.segen@gmail.com",null,"Sekretær, Medlem af FU",4,{"$f":"IF(L9=0,\"\",INDEX(Bogføring!$A:$A,MATCH(Tabel2[[#This Row],[Medl.nr. :]],Bogføring!$D:$D,0),0))","v":""},{"$f":"SUMIFS(Bogføring!H:H,Bogføring!E:E,\"=\"&$L$5,Bogføring!D:D,\"=\"&A9)","v":0},{"$f":"IF(N9=0,\"\",SUMIFS(Bogføring!A:A,Bogføring!E:E,\"=\"&$N$5,Bogføring!D:D,\"=\"&A9))","v":""},{"$f":"SUMIFS(Bogføring!H:H,Bogføring!E:E,\"=\"&$N$5,Bogføring!D:D,\"=\"&A9)","v":0},{"$f":"IF(N9=0,\"\",SUMIFS(Bogføring!$A:$A,Bogføring!$E:$E,\"=\"&$P$5,Bogføring!$D:$D,\"=\"&A9))","v":""},{"$f":"SUMIFS(Bogføring!$H:$H,Bogføring!$E:$E,\"=\"&$P$5,Bogføring!$D:$D,\"=\"&A9)","v":0}]
[5,"Stefan Erik Asp","Thorkildsvej 43, 2. th.",3700,"Rønne",23820033,"stefan_easp@hotmail.com",null,"Web&Marketing, Medlem af FU",5,{"$f":"IF(L10=0,\"\",INDEX(Bogføring!$A:$A,MATCH(Tabel2[[#This Row],[Medl.nr. :]],Bogføring!$D:$D,0),0))","v":""},{"$f":"SUMIFS(Bogføring!H:H,Bogføring!E:E,\"=\"&$L$5,Bogføring!D:D,\"=\"&A10)","v":0},{"$f":"IF(N10=0,\"\",SUMIFS(Bogføring!A:A,Bogføring!E:E,\"=\"&$N$5,Bogføring!D:D,\"=\"&A10))","v":""},{"$f":"SUMIFS(Bogføring!H:H,Bogføring!E:E,\"=\"&$N$5,Bogføring!D:D,\"=\"&A10)","v":0},{"$f":"IF(N10=0,\"\",SUMIFS(Bogføring!$A:$A,Bogføring!$E:$E,\"=\"&$P$5,Bogføring!$D:$D,\"=\"&A10))","v":""},{"$f":"SUMIFS(Bogføring!$H:$H,Bogføring!$E:$E,\"=\"&$P$5,Bogføring!$D:$D,\"=\"&A10)","v":0}]
{"$rows_left_out":171}
{"sheet":"Afv %","index":4,"n_rows":61,"n_cols":10,"rows_kept":61,"cut":false,"hidden":true,"merged":[[0,1,0,9],[6,1,6,10],[7,3,7,4],[7,5,7,6],[7,7,7,8],[4,1,5,9]]}
[null,{"$f":"T!B9","v":"xxxxxxxxxxxxx"}]
[]
[]
[]
[null,{"$f":"\"Afvigelser \"&T!C2","v":"Afvigelser 2022"}]
[]
[null,{"$f":"T!A7","v":"Periode : 01-01-2022 - 16-05-2022"}]
[null,null,null,null,null,"Aktuelt år",null,"Sidste år",null,"Forrige år"]
[null,null,null,null,null,{"$f":"T!C2","v":2022},"afv i %",{"$f":"F9-1","v":2021},"afv i %",{"$f":"F9-2","v":2020}]
[null,"Indtægter"]
{"$rows_left_out":52}
{"sheet":"Kontoplan (2)","index":5,"n_rows":78,"n_cols":9,"rows_kept":78,"cut":false,"hidden":true,"merged":[]}
["Konto","Kontobeskrivelse","Saldo","Kommentarer","Fra","Til"]
[1000,"Entre",{"$f":"SUMIFS(Bogføring!$H:$H,Bogføring!$A:$A,\">=\"&T!$C$4,Bogføring!$A:$A,\"<=\"&T!$C$5,Bogføring!$F:$F,A2)-SUMIFS(Bogføring!$G:$G,Bogføring!$A:$A,\">=\"&T!$C$4,Bogføring!$A:$A,\"<=\"&T!$C$5,Bogføring!$F:$F,A2)","v":8740},{"$f":"SUM(C3:C10)","v":0}]
[1001,"Voksne",{"$f":"SUMIFS(Bogføring!$H:$H,Bogføring!$A:$A,\">=\"&T!$C$4,Bogføring!$A:$A,\"<=\"&T!$C$5,Bogføring!$F:$F,A3)-SUMIFS(Bogføring!$G:$G,Bogføring!$A:$A,\">=\"&T!$C$4,Bogføring!$A:$A,\"<=\"&T!$C$5,Bogføring!$F:$F,A3)","v":0},null,null,null,null,null,14603.17]
[1002,"Pensionister",{"$f":"SUMIFS(Bogføring!$H:$H,Bogføring!$A:$A,\">=\"&T!$C$4,Bogføring!$A:$A,\"<=\"&T!$C$5,Bogføring!$F:$F,A4)-SUMIFS(Bogføring!$G:$G,Bogføring!$A:$A,\">=\"&T!$C$4,Bogføring!$A:$A,\"<=\"&T!$C$5,Bogføring!$F:$F,A4)","v":0}]
[1003,"Børn 6/16",{"$f":"SUMIFS(Bogføring!$H:$H,Bogføring!$A:$A,\">=\"&T!$C$4,Bogføring!$A:$A,\"<=\"&T!$C$5,Bogføring!$F:$F,A5)-SUMIFS(Bogføring!$G:$G,Bogføring!$A:$A,\">=\"&T!$C$4,Bogføring!$A:$A,\"<=\"&T!$C$5,Bogføring!$F:$F,A5)","v":0}]
[1004,"Børn u/6",{"$f":"SUMIFS(Bogføring!$H:$H,Bogføring!$A:$A,\">=\"&T!$C$4,Bogføring!$A:$A,\"<=\"&T!$C$5,Bogføring!$F:$F,A6)-SUMIFS(Bogføring!$G:$G,Bogføring!$A:$A,\">=\"&T!$C$4,Bogføring!$A:$A,\"<=\"&T!$C$5,Bogføring!$F:$F,A6)","v":0}]
[1005,"skoler",{"$f":"SUMIFS(Bogføring!$H:$H,Bogføring!$A:$A,\">=\"&T!$C$4,Bogføring!$A:$A,\"<=\"&T!$C$5,Bogføring!$F:$F,A7)-SUMIFS(Bogføring!$G:$G,Bogføring!$A:$A,\">=\"&T!$C$4,Bogføring!$A:$A,\"<=\"&T!$C$5,Bogføring!$F:$F,A7)","v":0}]
[1006,"BH skoler",{"$f":"SUMIFS(Bogføring!$H:$H,Bogføring!$A:$A,\">=\"&T!$C$4,Bogføring!$A:$A,\"<=\"&T!$C$5,Bogføring!$F:$F,A8)-SUMIFS(Bogføring!$G:$G,Bogføring!$A:$A,\">=\"&T!$C$4,Bogføring!$A:$A,\"<=\"&T!$C$5,Bogføring!$F:$F,A8)","v":0}]
[1007,"Grupper",{"$f":"SUMIFS(Bogføring!$H:$H,Bogføring!$A:$A,\">=\"&T!$C$4,Bogføring!$A:$A,\"<=\"&T!$C$5,Bogføring!$F:$F,A9)-SUMIFS(Bogføring!$G:$G,Bogføring!$A:$A,\">=\"&T!$C$4,Bogføring!$A:$A,\"<=\"&T!$C$5,Bogføring!$F:$F,A9)","v":0}]
[1008,"Militær ID",{"$f":"SUMIFS(Bogføring!$H:$H,Bogføring!$A:$A,\">=\"&T!$C$4,Bogføring!$A:$A,\"<=\"&T!$C$5,Bogføring!$F:$F,A10)-SUMIFS(Bogføring!$G:$G,Bogføring!$A:$A,\">=\"&T!$C$4,Bogføring!$A:$A,\"<=\"&T!$C$5,Bogføring!$F:$F,A10)","v":0}]
{"$rows_left_out":69}
{"sheet":"Udgiftsbilag","index":6,"n_rows":24,"n_cols":9,"rows_kept":24,"cut":false,"hidden":true,"merged":[[10,6,11,7],[10,8,11,9],[12,2,12,3],[12,6,14,7],[12,8,14,9],[14,2,14,3],[8,6,9,9],[1,2,1,4],[2,2,2,4],[6,1,6,2],[6,8,6,9]]}
[]
[]
[null,null,"Bornholms Forsvarsmuseum"]
[]
[]
[]
[null,"Udgifts bilag.",null,null,null,null,"Bilags nr.:"]
[]
[null,null,null,null,null,null,"Kontering"]
[]
{"$rows_left_out":15}
{"sheet":"T","index":7,"n_rows":34,"n_cols":20,"rows_kept":34,"cut":false,"hidden":false,"merged":[[28,0,28,4],[29,0,29,5],[25,0,25,4],[14,1,14,4],[22,0,22,6],[16,1,16,4],[12,1,12,4],[6,2,6,4],[19,0,19,6],[3,7,3,9],[5,12,5,13],[12,8,12,9],[5,14,5,15],[10,7,10,9],[5,18,5,19],[8,1,8,4],[8,7,8,9],[5,16,5,17],[6,7,6,9],[10,1,10,4],[5,10,5,11]]}
[]
["Regnskabs år ",{"$f":"C2+1","v":2023},2022,{"$f":"C2-1","v":2021},{"$f":"C2-2","v":2020},{"$f":"D2-2","v":2019},null,"cellen C2","her indtastes det indeværende regnskabs år"]
[null,{"$f":"IF(YEAR(B4)<>YEAR(B5),YEAR(B4)&\"-\"&YEAR(B5),YEAR(B4))","v":2023},{"$f":"IF(YEAR(C4)<>YEAR(C5),YEAR(C4)&\"-\"&YEAR(C5),YEAR(C4))","v":2022},{"$f":"IF(YEAR(D4)<>YEAR(D5),YEAR(D4)&\"-\"&YEAR(D5),YEAR(D4))","v":2021},{"$f":"IF(YEAR(E4)<>YEAR(E5),YEAR(E4)&\"-\"&YEAR(E5),YEAR(E4))","v":2020},{"$f":"IF(YEAR(F4)<>YEAR(F5),YEAR(F4)&\"-\"&YEAR(F5),YEAR(F4))","v":2019}]
["Regnskabsårets start ",{"$f":"DATE(B2-I5,$L$5,$K$5)","v":"2023-01-01"},{"$f":"DATE(C2-I5,$L$5,$K$5)","v":"2022-01-01"},{"$f":"DATE(D2-I5,$L$5,$K$5)","v":"2021-01-01"},{"$f":"DATE(E2-I5,$L$5,$K$5)","v":"2020-01-01"},{"$f":"DATE(F2-I5,$L$5,$K$5)","v":"2019-01-01"},null,"Regnskabs året starter :",null,null,"dag","måned"]
["Regnskabs årets slut",{"$f":"N7","v":"2023-12-31"},{"$f":"L7","v":"2022-12-31"},{"$f":"P7","v":"2021-12-31"},{"$f":"R7","v":"2020-12-31"},{"$f":"T7","v":"2019-12-31"},null,null,0,null,1,1]
[null,null,null,null,null,null,null,null,null,null,"Aktuelt år",null,"Budget år",null,"realiseret år",null,"realiseret år",null,"realiseret år"]
[{"$f":"\"Periode : \"&TEXT(C4,\"dd-mm-åååå\")&\" - \"&TEXT(IF(TODAY()>C5,C5,TODAY()),\"dd-mm-åååå\")","v":"Periode : 01-01-2022 - 16-05-2022"},null,"version 1.00.009.047",null,null,null,null,"Regnskabs året slutter :",null,null,{"$f":"C4-1","v":"2021-12-31"},{"$f":"DATE(YEAR(K7)+1,MONTH(K7),DAY(K7))","v":"2022-12-31"},{"$f":"B4-1","v":"2022-12-31"},{"$f":"DATE(YEAR(M7)+1,MONTH(M7),DAY(M7))","v":"2023-12-31"},{"$f":"D4-1","v":"2020-12-31"},{"$f":"DATE(YEAR(O7)+1,MONTH(O7),DAY(O7))","v":"2021-12-31"},{"$f":"E4-1","v":"2019-12-31"},{"$f":"DATE(YEAR(Q7)+1,MONTH(Q7),DAY(Q7))","v":"2020-12-31"},{"$f":"F4-1","v":"2018-12-31"},{"$f":"DATE(YEAR(S7)+1,MONTH(S7),DAY(S7))","v":"2019-12-31"}]
[]
["Foreningens navn:","xxxxxxxxxxxxx",null,null,null,null,null,"Revisionspåtegning: (1-3)",null,null,1,"0= tomt felt"]
[]
{"$rows_left_out":25}
{"sheet":"Regnskab GF2","index":8,"n_rows":31,"n_cols":7,"rows_kept":31,"cut":false,"hidden":true,"merged":[[1,1,1,7],[20,1,20,6],[35,1,35,7]]}
[]
[null,"REGNSKAB FOR 3. ORDINÆRE GENERALFORSAMLING 13.01.18. "]
[]
[null,null,"Antal",null,"Indtægt","Udgift","Resultat"]
[null,"Kuv. Gule ærter/Stroganof",null,150]
[null,"øl",null,10]
[null,"Kaffe, småkager"]
[null,"12 Morgenmad inkl. bestyrelse"]
[null,"Værelser (10 enheder)",null,75]
[null,"Duge, servietter m.m."]
{"$rows_left_out":22}
{"sheet":"vejlend.","index":9,"n_rows":46,"n_cols":5,"rows_kept":46,"cut":false,"hidden":true,"merged":[]}
["HUSK:"]
["Ved årsskifte / regnskabsårsafslutning."]
[]
["PRINT:","DETTE ÅR:"]
[null,"Bogføring hele året"]
[null,"Kontoplan"]
[null,"Regnskab"]
[null,"1. Kontoudtog fra banken hele året (fra 1/1 til 31/12)"]
[null,"2. Kontoudtog fra banken hele året (fra 1/1 til 31/12)"]
[]
{"$rows_left_out":37}
{"sheet":"Udmeldelser","index":10,"n_rows":11,"n_cols":9,"rows_kept":11,"cut":false,"hidden":true,"merged":[]}
["Medl.nr. :","NAVN","ADRESSE ","POSTNR","By","TELEFON","E-MAIL","Udmeldt ","Bemærkning:"]
[1,"Finn Bræstrup Karlsen","Vimmelskaftet 14",3700,"Rønne",null,"fjkarlsen@gmail.com"]
[2,"Lone Kure","Harbovej 40A",3700,"Rønne",null,"lonekure2014@gmail.com"]
[3,"Ole og Olga Drobova Andersen","Vesterbro 10",3720,"Åkirkeby",null,"ole_andersen@hotmail.com"]
[4,"Ole Koefoed Marker","Piberegård, Bodernevej 17",3720,"Åkirkeby",null,null,null,"DØD-oplyst 13.09.19."]
[5,"Birgit Andersen","Mulebyvej 2",3700,"Rønne",null,"birgitkure@gmail.com"]
[6,"Birthe Juel-Jensen","Egeløkken 3",3700,"Rønne",56961052,null,null,"Død - jan 2020"]
[7,"Sven Munch og Pyllis Holm","Morbærstien 5",3700,"Rønne",null,null,null,"Død - feb 2020"]
[29,"Nina Vibe","Charlottevej 7, Muleby",3700,"Rønne",null,"ninavibe@live.dk","2020-04-07"]
[133,"Jonna Jensen","Spodsbjergvej 127",5900,"Rudkøbing",20311031,"GIRO",2019]
{"$rows_left_out":2}
{"sheet":"Om","index":11,"n_rows":71,"n_cols":3,"rows_kept":71,"cut":false,"hidden":true,"merged":[]}
[null,"Dette regneark er lavet efter en ide fra Excelgaard.dk"]
[null,"Revideret af Bjarne Hansen "]
[]
[null,"Besøg excelgaard.dk"]
[]
[null,"START med DATAår + kontoplan"]
[null,"Jeg vil gerne knytte en kommentar til det regneark, som Bjarne H. har lagt op..."]
[]
[null,"Fra: EXCELGAARD:  19/4-2018:"]
[null,"1. Bemærk, at man skal kende til, og benytte det dobbelt bogføringssystem, med debit og kredit posteringer."]
{"$rows_left_out":62}
{"sheet":"Kontokort","index":12,"n_rows":39,"n_cols":12,"rows_kept":39,"cut":false,"hidden":false,"merged":[[1,8,1,9]]}
[]
[null,null,null,null,null,null,null,null,null,null,null,"Her på arket har jeg vist eksempler på, hvordan du kan undgå"]
["KONTOKORT",null,null,null,null,null,null,null,null,null,null,"Flet og Centrer."]
["Kontonavn:",{"$f":"VLOOKUP(J4,Kontoplan!A2:B94,2,0)","v":"Lønninger incl ATP -AM"},null,null,null,null,null,null,null,3110,null,"Indtast kun kontonummeret. Teksten \"Konto\""]
["År",null,null,null,null,null,null,null,"Side",null,null,"fremkommer via formatering."]
["Dato",null,"Bilag nr.","Tekst","Medl nr","Årstal","Debet","Kredit","D/K","Saldo",null,"Sammenflettede celler er noget af det værste bras,"]
[{"$f":"_xlfn._xlws.FILTER(d[Dato],(d[Konto]=Kontokort!J4)*(d[Dato]>=T!C4)*(d[Dato]<=T!C5),\"\")","v":"2022-01-28"},null,{"$f":"_xlfn._xlws.FILTER(d[Bilag],(d[Konto]=Kontokort!J4)*(d[Dato]>=T!C4)*(d[Dato]<=T!C5),\"\")","v":15},{"$f":"_xlfn._xlws.FILTER(d[Tekst],(d[Konto]=Kontokort!J4)*(d[Dato]>=T!C4)*(d[Dato]<=T!C5),\"\")","v":0},null,null,{"$f":"_xlfn._xlws.FILTER(d[[Debet]:[Kredit]],(d[Konto]=Kontokort!J4)*(d[Dato]>=T!C4)*(d[Dato]<=T!C5),\"\")","v":10000},0,null,{"$f":"IF(A7,SUM(G$7:G7)-SUM(H$7:H7),\"\")","v":10000},null,"hvilket filen her er et afskrækkende eksempel på."]
["2022-01-28",null,15,0,null,null,200,0,null,{"$f":"IF(A8,SUM(G$7:G8)-SUM(H$7:H8),\"\")","v":10200},null,"Brug Center Across Selection i stedet for."]
["2022-02-25",null,27,0,null,null,10000,0,null,{"$f":"IF(A9,SUM(G$7:G9)-SUM(H$7:H9),\"\")","v":20200},null,"(Format, Format Cells, Alignment, Center Across Selection)."]
["2022-02-25",null,27,0,null,null,200,0,null,{"$f":"IF(A10,SUM(G$7:G10)-SUM(H$7:H10),\"\")","v":20400}]
{"$rows_left_out":30}
{"sheet":"T2","index":13,"n_rows":43,"n_cols":23,"rows_kept":43,"cut":false,"hidden":false,"merged":[[39,0,39,4],[42,0,42,4],[43,0,43,5],[24,1,24,4],[26,1,26,4],[28,1,28,4],[30,1,30,4],[33,0,33,4],[36,0,36,4],[22,1,22,4],[6,2,6,4],[6,7,6,9],[8,1,8,4],[8,7,8,9],[10,1,10,4],[10,7,10,9],[12,1,12,4],[14,1,14,4],[16,1,16,4],[18,1,18,4],[20,1,20,4],[12,7,12,9],[12,10,12,13],[5,18,5,19],[3,7,3,9],[5,10,5,11],[5,12,5,13],[5,14,5,15],[5,16,5,17]]}
[null,null,null,null,null,null,null,null,null,null,null,null,null,null,null,null,null,null,null,null,null,null,"Formand/Sekretær"]
["Regnskabs år ",{"$f":"C2+1","v":2023},2022,{"$f":"C2-1","v":2021},{"$f":"C2-2","v":2020},{"$f":"D2-2","v":2019},null,"cellen C2","her indtastes det indeværende regnskabs år",null,null,null,null,null,null,null,null,null,null,null,null,null,"Næstformand"]
[null,{"$f":"IF(YEAR(B4)<>YEAR(B5),YEAR(B4)&\"-\"&YEAR(B5),YEAR(B4))","v":2023},{"$f":"IF(YEAR(C4)<>YEAR(C5),YEAR(C4)&\"-\"&YEAR(C5),YEAR(C4))","v":2022},{"$f":"IF(YEAR(D4)<>YEAR(D5),YEAR(D4)&\"-\"&YEAR(D5),YEAR(D4))","v":2021},{"$f":"IF(YEAR(E4)<>YEAR(E5),YEAR(E4)&\"-\"&YEAR(E5),YEAR(E4))","v":2020},{"$f":"IF(YEAR(F4)<>YEAR(F5),YEAR(F4)&\"-\"&YEAR(F5),YEAR(F4))","v":2019},null,null,null,null,null,null,null,null,null,null,null,null,null,null,null,null,"Web ansvarlig"]
["Regnskabsårets start ",{"$f":"DATE(B2-I5,$L$5,$K$5)","v":"2023-01-01"},{"$f":"DATE(C2-I5,$L$5,$K$5)","v":"2022-01-01"},{"$f":"DATE(D2-I5,$L$5,$K$5)","v":"2021-01-01"},{"$f":"DATE(E2-I5,$L$5,$K$5)","v":"2020-01-01"},{"$f":"DATE(F2-I5,$L$5,$K$5)","v":"2019-01-01"},null,"Regnskabs året starter :",null,null,"dag","måned",null,null,null,null,null,null,null,null,null,null,"Forbindelsesp. til AK"]
["Regnskabs årets slut",{"$f":"N7","v":"2023-12-31"},{"$f":"L7","v":"2022-12-31"},{"$f":"P7","v":"2021-12-31"},{"$f":"R7","v":"2020-12-31"},{"$f":"T7","v":"2019-12-31"},null,null,0,null,1,1,null,null,null,null,null,null,null,null,null,null,"Ad hoc"]
[null,null,null,null,null,null,null,null,null,null,"Aktuelt år",null,"Budget år",null,"realiseret år",null,"realiseret år",null,"realiseret år",null,null,null,"Suppleant"]
[{"$f":"\"Periode : \"&TEXT(C4, \"dd-mm-åååå\")& \" - \"&TEXT(C5,\"dd-mm-åååå\")","v":"Periode : 01-01-2022 - 31-12-2022"},null,"version 2020.00.02.00",null,null,null,null,"Regnskabs året slutter :",null,null,{"$f":"C4-1","v":"2021-12-31"},{"$f":"DATE(YEAR(K7)+1,MONTH(K7),DAY(K7))","v":"2022-12-31"},{"$f":"B4-1","v":"2022-12-31"},{"$f":"DATE(YEAR(M7)+1,MONTH(M7),DAY(M7))","v":"2023-12-31"},{"$f":"D4-1","v":"2020-12-31"},{"$f":"DATE(YEAR(O7)+1,MONTH(O7),DAY(O7))","v":"2021-12-31"},{"$f":"E4-1","v":"2019-12-31"},{"$f":"DATE(YEAR(Q7)+1,MONTH(Q7),DAY(Q7))","v":"2020-12-31"},{"$f":"F4-1","v":"2018-12-31"},{"$f":"DATE(YEAR(S7)+1,MONTH(S7),DAY(S7))","v":"2019-12-31"},null,null,"Bilagskontrollant"]
[null,null,null,null,null,null,null,null,null,null,null,null,null,null,null,null,null,null,null,null,null,null,"Kasserer"]
["Foreningens navn:","TEST regnskab",null,null,null,null,null,"Revisionspåtegning: (1-3)",null,null,1,"0= tomt felt"]
[]
{"$rows_left_out":34}
{"sheet":"Restanceliste","index":14,"n_rows":7,"n_cols":5,"rows_kept":7,"cut":false,"hidden":true,"merged":[[5,1,5,6],[4,0,4,6]]}
[]
[]
[]
[]
["der laves en funktion der danner restancelisten ved tryk på en knap\nhvis der findes en liste kommer der en msgbox om man ønsker at overskrive den"]
[null,"Hentes fra medlemslisten udfra A kolonnen med lopslag"]
["Medlems nr.:","Navn","Adresse","postnr","by"]