{"text_format":"1","workbook":"xlsx","n_sheets":8,"sheets":["Juni2010","september2010","oktober2010","Tomt","Satser","Timeberegning","Ark2","Ark3"],"not_rendered":{"charts":0,"images":0,"macros":1,"external_links":0,"defined_names":4,"comments":0,"pivot_tables":0},"unopened":[],"bounds":{"document_bytes":16777216,"sheet_cells":100000,"rows_first":2000,"rows_last":500,"rows_between":2000,"halvings":0,"cell_chars":16384,"cell_head_chars":4096},"cells_cut":0,"cells_raw":0,"read":"whole","date_system":"1900"}

{"sheet":"Juni2010","index":0,"n_rows":45,"n_cols":24,"rows_kept":45,"cut":false,"hidden":true,"merged":[[43,0,43,2],[0,1,0,4],[0,14,0,15],[2,1,2,2],[1,1,1,2]]}
["Løn","1 juni 2010 - 30 juni 2010",null,null,null,null,null,null,null,null,null,null,null,null,"Time beregning:"]
["Lønart",null,null,null,null,3025,3425,3426,3600,3602,3605,9091,9092,null,"Betalt pause ved vagt over 5 timer",null,null,null,"00:25:00","minutter","00:00:00","06:00:00","18:00:00","14:00:00"]
["Dato","Dag",null,"Start","Slut","Time SID","Overtid           1-3 time","Overtid            4 - time","Aftenstillæg","Nattillæg     00-06","Søndags tillæg"]
["2010-06-01",{"$f":"PROPER(TEXT(A4,\"ddd\"))","v":"Ti"},{"$f":"HelligdagsNavn(A4,0,0)","v":""},"00:01:00","13:00:00",{"$f":"IF(D4=\"\",\"\",(E4-D4)+(D4>E4))","v":0.54097222222222219},null,null,{"$f":"IF(D4<>\"\",IF(WEEKDAY(A4,2)<>6,IF(D4>E4,(E4-MAX(D4,(18/24))+(D4>E4))-E4,IF(E4>W$2,(E4-MAX(D4,(18/24))),\"\")),IF(D4>E4,(E4-MAX(D4,(14/24))+(D4>E4))-E4,IF(E4>X$2,(E4-MAX(D4,(14/24))),\"\"))),\"\")","v":""},{"$f":"IF(F4<>\"\",IF(Q4<V$2,(V$2-Q4),IF(T4<V$2,(T4-U$2),\"\")),\"\")","v":"05:59:00"},{"$f":"IF(F4<>0,IF(WEEKDAY(A4,2)=7,F4,\"\"),\"\")","v":""},{"$f":"IF(SUM(G4:H4)=0,\"\",SUM(G4:H4))","v":""},null,null,{"$f":"IF(D4=\"\",\"\",HOUR(D4))","v":0},{"$f":"IF(D4=\"\",\"\",MINUTE(D4))","v":1},{"$f":"IF(D4=\"\",\"\",TIME(HOUR(D4),MINUTE(D4),0))","v":"00:01:00"},{"$f":"IF(E4=\"\",\"\",HOUR(E4))","v":13},{"$f":"IF(E4=\"\",\"\",MINUTE(E4))","v":0},{"$f":"TIME(HOUR(E4),MINUTE(E4),0)","v":"13:00:00"}]
["2010-04-02",{"$f":"PROPER(TEXT(A5,\"ddd\"))","v":"Fr"},{"$f":"HelligdagsNavn(A5,0,0)","v":"Langfredag"},"10:00:00","18:30:00",0.35416666666666669,null,null,"00:30:00","","","",null,null,10,0,"10:00:00",18,30,{"$f":"TIME(HOUR(E5),MINUTE(E5),0)","v":"18:30:00"}]
["2010-04-03",{"$f":"PROPER(TEXT(A6,\"ddd\"))","v":"Lø"},"",null,null,"",null,null,"","","","",null,null,"","","","","",{"$f":"TIME(HOUR(E6),MINUTE(E6),0)","v":"00:00:00"}]
["2010-04-04","Sø","Påskedag",null,null,"",null,null,"","","","",null,null,"","","","","",{"$f":"TIME(HOUR(E7),MINUTE(E7),0)","v":"00:00:00"}]
["2010-04-05","Ma","2. Påskedag",null,null,"",null,null,"","","","",null,null,"","","","","",{"$f":"TIME(HOUR(E8),MINUTE(E8),0)","v":"00:00:00"}]
["2010-04-06","Ti","",null,null,"",null,null,"","","","",null,null,"","","","","",{"$f":"IF(E9=\"\",\"\",TIME(HOUR(E9),MINUTE(E9),0))","v":""}]
["2010-04-07","On","",null,null,"",null,null,"","","","",null,null,"","","","","",""]
{"$rows_left_out":36}
{"sheet":"september2010","index":1,"n_rows":53,"n_cols":35,"rows_kept":53,"cut":false,"hidden":false,"merged":[[11,14,11,15],[44,10,44,11],[45,10,45,11],[8,11,8,14],[39,10,39,11],[40,10,40,11],[41,10,41,11],[42,10,42,11],[43,10,43,11],[34,10,34,11],[35,10,35,11],[36,10,36,11],[37,10,37,11],[38,10,38,11],[29,10,29,11],[30,10,30,11],[33,10,33,11],[24,10,24,11],[25,10,25,11],[26,10,26,11],[27,10,27,11],[28,10,28,11],[21,10,21,11],[22,10,22,11],[23,10,23,11],[31,10,31,11],[32,10,32,11],[42,14,42,15],[43,14,43,15],[44,14,44,15],[45,14,45,15],[9,10,9,11],[10,10,10,11],[11,10,11,11],[12,10,12,11],[13,10,13,11],[14,10,14,11],[15,10,15,11],[16,10,16,11],[17,10,17,11],[18,10,18,11],[19,10,19,11],[20,10,20,11],[37,14,37,15],[38,14,38,15],[39,14,39,15],[40,14,40,15],[41,14,41,15],[32,14,32,15],[33,14,33,15],[34,14,34,15],[35,14,35,15],[36,14,36,15],[27,14,27,15],[28,14,28,15],[29,14,29,15],[30,14,30,15],[31,14,31,15],[22,14,22,15],[23,14,23,15],[24,14,24,15],[25,14,25,15],[26,14,26,15],[17,14,17,15],[18,14,18,15],[19,14,19,15],[20,14,20,15],[21,14,21,15],[49,0,49,2],[50,0,50,2],[51,0,51,2],[8,25,8,26],[9,1,9,2],[10,1,10,2],[47,0,47,2],[48,0,48,2],[8,1,8,6],[9,14,9,15],[10,14,10,15],[12,14,12,15],[13,14,13,15],[14,14,14,15],[15,14,15,15],[16,14,16,15]]}
[null,null,null,null,null,null,null,null,null,null,null,null,null,null,null,null,null,null,null,null,null,null,null,null,null,null,null,null,null,"Faktor:",1,1.5,2]
[null,null,null,null,null,null,null,null,null,null,null,null,null,null,null,null,null,null,null,null,null,null,null,null,"Aften tillæg","Fra kl.","16:00:00","Til kl.","00:00:00"]
[null,null,null,null,null,null,null,null,null,null,null,null,null,null,null,null,null,null,null,null,null,null,null,null,"Nat tillæg","Fra kl.",1,"Til kl.","06:00:00"]
[null,null,null,null,null,null,null,null,null,null,null,null,null,null,null,null,null,null,null,null,null,null,null,null,"Lørdag","Fra kl.","14:00:00","Til kl.","00:00:00"]
[null,null,null,null,null,null,null,null,null,null,null,null,null,null,null,null,null,null,null,null,null,null,null,null,"Grundlovsdag","Fra kl.","12:00:00","Til kl.","00:00:00"]
[]
[]
[]
["Løn",{"$f":"PROPER(TEXT(A12,\"dd mmmm åååå\")) & PROPER(TEXT(A42,\"  -  dd mmmm åååå\"))","v":"06 September 2010  -  03 Oktober 2010"},null,null,null,null,null,"Uge :",null,null,{"$f":"IF(A12=\"\",\"\",TRUNC((A12-WEEKDAY(A12,2)-DATE(YEAR(A12+4-WEEKDAY(A12,2)),1,-10))/7))","v":36},"-",null,null,null,{"$f":"IF(A36=\"\",\"\",TRUNC((A36-WEEKDAY(A36,2)-DATE(YEAR(A36+4-WEEKDAY(A36,2)),1,-10))/7))","v":39},null,null,null,null,null,null,null,null,null,"Time beregning:"]
["Lønart",null,null,null,null,null,null,null,null,null,null,null,null,null,null,null,null,null,null,null,null,null,null,null,null,"Betalt pause ved vagt over 5 timer",null,null,null,"00:25:00","minutter","00:00:00","06:00:00","17:00:00","14:00:00"]
{"$rows_left_out":44}
{"sheet":"oktober2010","index":2,"n_rows":51,"n_cols":28,"rows_kept":51,"cut":false,"hidden":true,"merged":[[45,0,45,2],[46,0,46,2],[47,0,47,2],[48,0,48,2],[49,0,49,2],[41,8,41,9],[41,10,41,11],[42,8,42,9],[42,10,42,11],[43,8,43,9],[43,10,43,11],[38,8,38,9],[38,10,38,11],[39,8,39,9],[39,10,39,11],[40,8,40,9],[40,10,40,11],[35,8,35,9],[35,10,35,11],[36,8,36,9],[36,10,36,11],[37,8,37,9],[37,10,37,11],[32,8,32,9],[32,10,32,11],[33,8,33,9],[33,10,33,11],[34,8,34,9],[34,10,34,11],[29,8,29,9],[29,10,29,11],[30,8,30,9],[30,10,30,11],[31,8,31,9],[31,10,31,11],[26,8,26,9],[26,10,26,11],[27,8,27,9],[27,10,27,11],[28,8,28,9],[28,10,28,11],[23,8,23,9],[23,10,23,11],[24,8,24,9],[24,10,24,11],[25,8,25,9],[25,10,25,11],[20,8,20,9],[20,10,20,11],[21,8,21,9],[21,10,21,11],[22,8,22,9],[22,10,22,11],[17,8,17,9],[17,10,17,11],[18,8,18,9],[18,10,18,11],[19,8,19,9],[19,10,19,11],[14,8,14,9],[14,10,14,11],[15,8,15,9],[15,10,15,11],[16,8,16,9],[16,10,16,11],[11,8,11,9],[11,10,11,11],[12,8,12,9],[12,10,12,11],[13,8,13,9],[13,10,13,11],[10,8,10,9],[10,10,10,11],[6,1,6,6],[6,9,6,10],[6,18,6,19],[7,1,7,2],[7,8,7,9],[7,10,7,11],[8,1,8,2],[8,8,8,9],[8,10,8,11],[9,8,9,9],[9,10,9,11]]}
[]
[null,null,null,null,null,null,null,null,null,null,null,null,null,null,null,null,null,"Aften tillæg","Fra kl.","18:00:00","Til kl.","00:00:00"]
[null,null,null,null,null,null,null,null,null,null,null,null,null,null,null,null,null,"Nat tillæg","Fra kl.","00:00:00","Til kl.","06:00:00"]
[null,null,null,null,null,null,null,null,null,null,null,null,null,null,null,null,null,"Lørdag","Fra kl.","14:00:00","Til kl.","00:00:00"]
[null,null,null,null,null,null,null,null,null,null,null,null,null,null,null,null,null,"Grundlovsdag","Fra kl.","12:00:00","Til kl.","00:00:00"]
[]
["Løn",{"$f":"PROPER(TEXT(A10,\"dd mmmm åååå\")) & PROPER(TEXT(A40,\"  -  dd mmmm åååå\"))","v":"05 December 2011  -  01 Januar 2012"},null,null,null,null,null,"Uge :",{"$f":"IF(A10=\"\",\"\",TRUNC((A10-WEEKDAY(A10,2)-DATE(YEAR(A10+4-WEEKDAY(A10,2)),1,-10))/7))","v":49},"-",null,{"$f":"IF(A34=\"\",\"\",TRUNC((A34-WEEKDAY(A34,2)-DATE(YEAR(A34+4-WEEKDAY(A34,2)),1,-10))/7))","v":52},null,null,null,null,null,null,"Time beregning:"]
["Lønart",null,null,null,null,null,null,null,null,null,null,null,null,null,null,null,null,null,"Betalt pause ved vagt over 5 timer",null,null,null,"00:25:00","minutter","00:00:00","06:00:00","17:00:00","14:00:00"]
["Dato","Dag",null,"Start","Slut","Time SID","Overtid           1-3 time","Overtid            4 - time","Aftenstillæg alle dage        17-23",null,"Nattillæg     23-06",null,"Lørdag tillæg 06 - 06","Søndag tillæg 06-06","Optjent afspadsering","Afholdt afspadsering"]
["2011-12-05",{"$f":"PROPER(TEXT(A10,\"ddd\"))","v":"Ma"},{"$f":"HelligdagsNavn(A10,0,0)","v":""},"00:01:00","13:00:00",{"$f":"IF(D10=\"\",\"\",(E10-D10)+(D10>E10))","v":0.54097222222222219},null,null,{"$f":"IF(D10=\"\",\"\",(IF(E10-MAX(D10,(17/24))+(E10<D10)<0,0,E10-MAX(D10,(17/24))+(E10<D10)))-(IF((E10-MAX(D10,(23/24))+(E10<D10))<0,0,(E10-MAX(D10,(23/24))+(E10<D10)))))","v":"00:00:00"},null,{"$f":"IF(F10=\"\",\"\",IF((E10-MAX(D10,(23/24))+(D10>E10))<0,0,(IF(E10<D10,IF(E10>6/24,6/24,E10),E10)-MAX(D10,(23/24)))+(D10>E10))+(6/24)-MIN(D10,(6/24)))","v":"05:59:00"},null,null,{"$f":"IF(D10=\"\",\"\",IF(D10<6/24,6/24-D10,\"\"))","v":"05:59:00"},{"$f":"IF(F10=\"\",\"\",IF(F10<>0,IF(C10<>\"\",IF(M10+N10=0,Satser!B$23,((M10+N10)*24)*(24/1440)+Satser!B$23),IF(M10+N10=0,\"\",((M10+N10)*24)*(24/1440))),\"\"))","v":"02:23:36"},null,null,null,{"$f":"IF(D10=\"\",\"\",HOUR(D10))","v":0},{"$f":"IF(D10=\"\",\"\",MINUTE(D10))","v":1},{"$f":"IF(D10=\"\",\"\",TIME(HOUR(D10),MINUTE(D10),0))","v":"00:01:00"},{"$f":"IF(E10=\"\",\"\",HOUR(E10))","v":13},{"$f":"IF(E10=\"\",\"\",MINUTE(E10))","v":0},{"$f":"IF(E10=\"\",\"\",TIME(HOUR(E10),MINUTE(E10),0))","v":"13:00:00"}]
{"$rows_left_out":42}
{"sheet":"Tomt","index":3,"n_rows":51,"n_cols":26,"rows_kept":51,"cut":false,"hidden":false,"merged":[[6,16,6,18],[47,0,47,3],[48,0,48,3],[49,0,49,3],[6,1,6,5],[7,1,7,2],[8,1,8,2],[45,0,45,3],[46,0,46,3]]}
[]
[null,null,null,null,null,null,null,null,null,null,null,null,null,null,null,null,"Aften tillæg","Fra kl.","18:00:00","Til kl.","00:00:00"]
[null,null,null,null,null,null,null,null,null,null,null,null,null,null,null,null,"Nat tillæg","Fra kl.","00:00:00","Til kl.","06:00:00"]
[null,null,null,null,null,null,null,null,null,null,null,null,null,null,null,null,"Lørdag","Fra kl.","14:00:00","Til kl.","00:00:00"]
[null,null,null,null,null,null,null,null,null,null,null,null,null,null,null,null,"Grundlovsdag","Fra kl.","12:00:00","Til kl.","00:00:00"]
[]
["Løn","1 juni 2010 - 30 juni 2010",null,null,null,null,null,null,null,null,null,null,null,null,null,null,"Time beregning:"]
["Lønart",null,null,null,null,null,3025,3425,3426,3600,3602,3605,3610,9091,9092,null,"Betalt pause ved vagt over 5 timer",null,null,null,"00:25:00","minutter","00:00:00","06:00:00","18:00:00","14:00:00"]
["Dato","Dag",null,"Vagt","Start","Slut","Time SID","Overtid           1-3 time","Overtid            4 - time","Forskudttid alle dage","Nattillæg     00-06","Weekend tillæg","Delt tjenste"]
["2013-04-01",{"$f":"PROPER(TEXT(A10,\"ddd\"))","v":"Ma"},{"$f":"HelligdagsNavn(A10,0,0)","v":"2. Påskedag"},701,{"$f":"IF($D10=\"\",\"\",IF(VLOOKUP($D10,Timeberegning!A$4:B$153,2)=0,\"\",VLOOKUP($D10,Timeberegning!A$4:B$153,2)))","v":"04:36:00"},{"$f":"IF($D10=\"\",\"\",IF(VLOOKUP($D10,Timeberegning!A$4:C$153,3)=\"\",\"\",VLOOKUP($D10,Timeberegning!A$4:C$153,3)))","v":"12:24:00"},{"$f":"IF($D10=\"\",\"\",VLOOKUP($D10,Timeberegning!$A$4:$O$10,13))","v":"06:56:00"},null,null,{"$f":"IF(E10<>\"\",IF(WEEKDAY(A10,2)<>6,IF(E10>F10,(F10-MAX(E10,(18/24))+(E10>F10))-F10,IF(F10>Y$8,(F10-MAX(E10,(18/24))),\"\")),IF(E10>F10,(F10-MAX(E10,(14/24))+(E10>F10))-F10,IF(F10>Z$8,(F10-MAX(E10,(14/24))),\"\"))),\"\")","v":""},{"$f":"IF(G10<>\"\",IF(S10<X$8,(X$8-S10),IF(V10<X$8,(V10-W$8),\"\")),\"\")","v":"01:24:00"},{"$f":"IF(G10<>0,IF(WEEKDAY(A10,2)=7,G10,\"\"),\"\")","v":""},{"$f":"IF($D10=\"\",\"\",IF(VLOOKUP($D10,Timeberegning!$A$4:$O$101,15)=\"\",\"\",VLOOKUP($D10,Timeberegning!$A$4:$O$101,15)))","v":""},{"$f":"IF(SUM(H10:I10)=0,\"\",SUM(H10:I10))","v":""},null,null,{"$f":"IF(E10=\"\",\"\",HOUR(E10))","v":4},{"$f":"IF(E10=\"\",\"\",MINUTE(E10))","v":36},{"$f":"IF(E10=\"\",\"\",TIME(HOUR(E10),MINUTE(E10),0))","v":"04:36:00"},{"$f":"IF(F10=\"\",\"\",HOUR(F10))","v":12},{"$f":"IF(F10=\"\",\"\",MINUTE(F10))","v":24},{"$f":"TIME(HOUR(F10),MINUTE(F10),0)","v":"12:24:00"}]
{"$rows_left_out":42}
{"sheet":"Satser","index":4,"n_rows":24,"n_cols":4,"rows_kept":24,"cut":false,"hidden":false,"merged":[]}
[]
[]
["Timeløn",119.62]
["specielt tillæg",1.19]
["Chauffør tillæg",4.95]
[]
["Samlet timeløn",{"$f":"SUM(B3:B5)","v":125.76}]
[]
["overtidstillæg 50%",59.81]
["pr. time",{"$f":"B7+B9","v":185.57}]
{"$rows_left_out":15}
{"sheet":"Timeberegning","index":5,"n_rows":78,"n_cols":16,"rows_kept":78,"cut":false,"hidden":false,"merged":[[0,0,0,2],[1,0,1,6]]}
["Time beregning:"]
["Betalt pause ved vagt over 5 timer",null,null,null,null,null,null,"00:25:00","minutter","00:00:00","06:00:00","18:00:00","14:00:00"]
["vagt","start","slut","Tid","Pause 1 start","Pause 1 start","Tid","Pause 2 start","Pause 2 slut","Tid","Samlet pause","Selv betalt pause","Beregnet arbejdstid","1/100","Delevagt","Afholdt afspadsering"]
[111,"05:54:00","14:57:00",{"$f":"C4-B4+(B4>C4)","v":"09:03:00"},"10:34:00","11:08:00",{"$f":"TEXT(F4-E4,\"t:mm\")","v":"0:34"},null,null,{"$f":"I4-H4","v":"00:00:00"},{"$f":"G4+J4","v":"00:34:00"},{"$f":"IF(K4>H$2,K4-H$2,0)","v":"00:09:00"},{"$f":"D4-L4","v":"08:54:00"},{"$f":"24*M4","v":8.9}]
[112,"10:06:00","16:38:00",{"$f":"C5-B5+(B5>C5)","v":"06:32:00"},"14:00:00","14:46:00","0:46",null,null,{"$f":"I5-H5","v":"00:00:00"},{"$f":"G5+J5","v":"00:46:00"},{"$f":"IF(K5>H$2,K5-H$2,0)","v":"00:21:00"},{"$f":"D5-L5","v":"06:11:00"},{"$f":"24*M5","v":6.1833333333333327}]
[113,"07:55:00","16:19:00",{"$f":"C6-B6+(B6>C6)","v":"08:24:00"},null,null,"0:00",null,null,"00:00:00","00:00:00","00:00:00","08:24:00",8.4]
[114,"09:48:00","17:55:00",{"$f":"C7-B7+(B7>C7)","v":"08:07:00"},"12:34:00","12:58:00","0:24","15:04:00","16:01:00","00:57:00","01:21:00","00:56:00","07:11:00",7.1833333333333336]
[121,"04:36:00","11:24:00",{"$f":"C8-B8+(B8>C8)","v":"06:48:00"},"08:30:00","08:58:00","0:28",null,null,"00:00:00","00:28:00","00:03:00","06:45:00",6.7500000000000018]
[122,"04:36:00","11:58:00","07:22:00","08:32:00","08:51:00","0:19","09:22:00","10:03:00","00:41:00","01:00:00","00:35:00","06:47:00",6.7833333333333332]
[123,"04:48:00","12:24:00","07:36:00","06:32:00","06:58:00","0:26","09:04:00","09:43:00","00:39:00","01:05:00","00:40:00","06:56:00",6.9333333333333353]
{"$rows_left_out":69}
{"sheet":"Ark2","index":6,"n_rows":6,"n_cols":9,"rows_kept":6,"cut":false,"hidden":false,"merged":[]}
["start","slut",null,"tid","pause start","pause slut","tid"]
["13:55:00","22:11:00",null,{"$f":"B2-A2","v":0.34444444444444455},"19:52:00","20:17:00",{"$f":"TEXT(F2-E2,\"t:mm\")","v":"0:25"},null,{"$f":"TEXT(D2-G2,\"t:mm\")","v":"7:51"}]
["14:10:00",1,null,{"$f":"B3-A3","v":"09:50:00"}]
["00:00:00","00:11:00",null,{"$f":"B4-A4","v":"00:11:00"}]
["2010-06-10T14:10:00","2010-06-11T00:11:00",null,{"$f":"B5-A5","v":"10:01:00"}]
[null,null,null,{"$f":"SUM(D2:D5)","v":1.179166666666505},{"$f":"D6*24","v":28.299999999996121}]

{"sheet":"Ark3","index":7,"n_rows":0,"n_cols":0,"rows_kept":0,"cut":false,"hidden":false,"merged":[]}