{"text_format":"1","workbook":"xlsx","n_sheets":8,"sheets":["Juni2010 (2)","september2010","Tomt","Satser","Timeberegning","Ark1","Ark2","Ark3"],"not_rendered":{"charts":0,"images":0,"macros":1,"external_links":0,"defined_names":4,"comments":0,"pivot_tables":0},"unopened":[],"bounds":{"document_bytes":16777216,"sheet_cells":100000,"rows_first":2000,"rows_last":500,"rows_between":2000,"halvings":0,"cell_chars":16384,"cell_head_chars":4096},"cells_cut":0,"cells_raw":0,"read":"whole","date_system":"1900"}

{"sheet":"Juni2010 (2)","index":0,"n_rows":45,"n_cols":26,"rows_kept":45,"cut":false,"hidden":true,"merged":[[43,0,43,3],[0,1,0,5],[39,0,39,3],[40,0,40,3],[41,0,41,3],[42,0,42,3],[2,1,2,2],[1,1,1,2]]}
["Løn","1 juni 2010 - 30 juni 2010",null,null,null,null,null,null,null,null,null,null,null,null,null,null,"Time beregning:"]
["Lønart",null,null,null,null,null,3025,3425,3426,3600,3602,3605,3610,9091,9092,null,"Betalt pause ved vagt over 5 timer",null,null,null,"00:25:00","minutter","00:00:00","06:00:00","18:00:00","14:00:00"]
["Dato","Dag",null,"Vagt","Start","Slut","Time SID","Overtid           1-3 time","Overtid            4 - time","Aftenstillæg","Nattillæg     00-06","Søndags tillæg","Delt tjenste"]
["2010-04-01",{"$f":"PROPER(TEXT(A4,\"ddd\"))","v":"To"},{"$f":"HelligdagsNavn(A4,0,0)","v":"Skærtorsdag"},111,{"$f":"IF($D4=\"\",\"\",IF(VLOOKUP($D4,Timeberegning!A$4:B$153,2)=0,\"\",VLOOKUP($D4,Timeberegning!A$4:B$153,2)))","v":"05:54:00"},{"$f":"IF($D4=\"\",\"\",IF(VLOOKUP($D4,Timeberegning!A$4:C$153,3)=\"\",\"\",VLOOKUP($D4,Timeberegning!A$4:C$153,3)))","v":"14:57:00"},{"$f":"IF($D4=\"\",\"\",VLOOKUP($D4,Timeberegning!$A$4:$O$10,13))","v":"08:54:00"},null,null,{"$f":"IF(E4<>\"\",IF(WEEKDAY(A4,2)<>6,IF(E4>F4,(F4-MAX(E4,(18/24))+(E4>F4))-F4,IF(F4>Y$2,(F4-MAX(E4,(18/24))),\"\")),IF(E4>F4,(F4-MAX(E4,(14/24))+(E4>F4))-F4,IF(F4>Z$2,(F4-MAX(E4,(14/24))),\"\"))),\"\")","v":""},{"$f":"IF(G4<>\"\",IF(S4<X$2,(X$2-S4),IF(V4<X$2,(V4-W$2),\"\")),\"\")","v":"00:06:00"},{"$f":"IF(G4<>0,IF(WEEKDAY(A4,2)=7,G4,\"\"),\"\")","v":""},{"$f":"IF($D4=\"\",\"\",IF(VLOOKUP($D4,Timeberegning!$A$4:$O$101,15)=\"\",\"\",VLOOKUP($D4,Timeberegning!$A$4:$O$101,15)))","v":""},{"$f":"IF(SUM(H4:I4)=0,\"\",SUM(H4:I4))","v":""},null,null,{"$f":"IF(E4=\"\",\"\",HOUR(E4))","v":5},{"$f":"IF(E4=\"\",\"\",MINUTE(E4))","v":54},{"$f":"IF(E4=\"\",\"\",TIME(HOUR(E4),MINUTE(E4),0))","v":"05:54:00"},{"$f":"IF(F4=\"\",\"\",HOUR(F4))","v":14},{"$f":"IF(F4=\"\",\"\",MINUTE(F4))","v":57},{"$f":"TIME(HOUR(F4),MINUTE(F4),0)","v":"14:57:00"}]
["2010-04-02",{"$f":"PROPER(TEXT(A5,\"ddd\"))","v":"Fr"},{"$f":"HelligdagsNavn(A5,0,0)","v":"Langfredag"},134,{"$f":"IF($D5=\"\",\"\",IF(VLOOKUP($D5,Timeberegning!A$4:B$153,2)=0,\"\",VLOOKUP($D5,Timeberegning!A$4:B$153,2)))","v":"07:07:00"},{"$f":"IF($D5=\"\",\"\",IF(VLOOKUP($D5,Timeberegning!A$4:C$153,3)=\"\",\"\",VLOOKUP($D5,Timeberegning!A$4:C$153,3)))","v":"16:16:00"},{"$f":"IF($D5=\"\",\"\",VLOOKUP($D5,Timeberegning!$A$4:$O$153,13))","v":"08:34:00"},null,null,{"$f":"IF(E5<>\"\",IF(WEEKDAY(A5,2)<>6,IF(E5>F5,(F5-MAX(E5,(18/24))+(E5>F5))-F5,IF(F5>Y$2,(F5-MAX(E5,(18/24))),\"\")),IF(E5>F5,(F5-MAX(E5,(14/24))+(E5>F5))-F5,IF(F5>Z$2,(F5-MAX(E5,(14/24))),\"\"))),\"\")","v":""},"",{"$f":"IF(G5<>0,IF(WEEKDAY(A5,2)=7,G5,\"\"),\"\")","v":""},{"$f":"IF($D5=\"\",\"\",IF(VLOOKUP($D5,Timeberegning!$A$4:$O$101,15)=\"\",\"\",VLOOKUP($D5,Timeberegning!$A$4:$O$101,15)))","v":""},{"$f":"IF(SUM(H5:I5)=0,\"\",SUM(H5:I5))","v":""},null,null,7,7,"07:07:00",16,16,{"$f":"TIME(HOUR(F5),MINUTE(F5),0)","v":"16:16:00"}]
["2010-04-03",{"$f":"PROPER(TEXT(A6,\"ddd\"))","v":"Lø"},"",612,{"$f":"IF($D6=\"\",\"\",IF(VLOOKUP($D6,Timeberegning!A$4:B$153,2)=0,\"\",VLOOKUP($D6,Timeberegning!A$4:B$153,2)))","v":"14:55:00"},{"$f":"IF($D6=\"\",\"\",IF(VLOOKUP($D6,Timeberegning!A$4:C$153,3)=\"\",\"\",VLOOKUP($D6,Timeberegning!A$4:C$153,3)))","v":"00:22:00"},{"$f":"IF($D6=\"\",\"\",VLOOKUP($D6,Timeberegning!$A$4:$O$153,13))","v":"08:46:00"},null,null,{"$f":"IF(E6<>\"\",IF(WEEKDAY(A6,2)<>6,IF(E6>F6,(F6-MAX(E6,(18/24))+(E6>F6))-F6,IF(F6>Y$2,(F6-MAX(E6,(18/24))),\"\")),IF(E6>F6,(F6-MAX(E6,(14/24))+(E6>F6))-F6,IF(F6>Z$2,(F6-MAX(E6,(14/24))),\"\"))),\"\")","v":"09:05:00"},"00:22:00","",{"$f":"IF($D6=\"\",\"\",IF(VLOOKUP($D6,Timeberegning!$A$4:$O$101,15)=\"\",\"\",VLOOKUP($D6,Timeberegning!$A$4:$O$101,15)))","v":""},"",null,null,14,55,"14:55:00",0,22,{"$f":"TIME(HOUR(F6),MINUTE(F6),0)","v":"00:22:00"}]
["2010-04-04","Sø","Påskedag",711,{"$f":"IF($D7=\"\",\"\",IF(VLOOKUP($D7,Timeberegning!A$4:B$153,2)=0,\"\",VLOOKUP($D7,Timeberegning!A$4:B$153,2)))","v":"13:55:00"},{"$f":"IF($D7=\"\",\"\",IF(VLOOKUP($D7,Timeberegning!A$4:C$153,3)=\"\",\"\",VLOOKUP($D7,Timeberegning!A$4:C$153,3)))","v":"22:22:00"},{"$f":"IF($D7=\"\",\"\",VLOOKUP($D7,Timeberegning!$A$4:$O$153,13))","v":"08:24:00"},null,null,"04:22:00","","08:24:00",{"$f":"IF($D7=\"\",\"\",IF(VLOOKUP($D7,Timeberegning!$A$4:$O$101,15)=\"\",\"\",VLOOKUP($D7,Timeberegning!$A$4:$O$101,15)))","v":""},"",{"$f":"IF($D7=\"\",\"\",IF(VLOOKUP($D7,Timeberegning!$A$4:$P$101,16)=\"\",\"\",VLOOKUP($D7,Timeberegning!$A$4:$P$101,16)))","v":""},null,13,55,"13:55:00",22,22,{"$f":"TIME(HOUR(F7),MINUTE(F7),0)","v":"22:22:00"}]
["2010-04-05","Ma","2. Påskedag",122,{"$f":"IF($D8=\"\",\"\",IF(VLOOKUP($D8,Timeberegning!A$4:B$153,2)=0,\"\",VLOOKUP($D8,Timeberegning!A$4:B$153,2)))","v":"04:36:00"},{"$f":"IF($D8=\"\",\"\",IF(VLOOKUP($D8,Timeberegning!A$4:C$153,3)=\"\",\"\",VLOOKUP($D8,Timeberegning!A$4:C$153,3)))","v":"11:58:00"},{"$f":"IF($D8=\"\",\"\",VLOOKUP($D8,Timeberegning!$A$4:$O$153,13))","v":"06:47:00"},null,null,"","01:24:00","",{"$f":"IF($D8=\"\",\"\",IF(VLOOKUP($D8,Timeberegning!$A$4:$O$101,15)=\"\",\"\",VLOOKUP($D8,Timeberegning!$A$4:$O$101,15)))","v":""},"",{"$f":"IF($D8=\"\",\"\",IF(VLOOKUP($D8,Timeberegning!$A$4:$P$101,16)=\"\",\"\",VLOOKUP($D8,Timeberegning!$A$4:$P$101,16)))","v":""},null,4,36,"04:36:00",11,58,{"$f":"TIME(HOUR(F8),MINUTE(F8),0)","v":"11:58:00"}]
["2010-04-06","Ti","",124,{"$f":"IF($D9=\"\",\"\",IF(VLOOKUP($D9,Timeberegning!A$4:B$153,2)=0,\"\",VLOOKUP($D9,Timeberegning!A$4:B$153,2)))","v":"05:20:00"},{"$f":"IF($D9=\"\",\"\",IF(VLOOKUP($D9,Timeberegning!A$4:C$153,3)=\"\",\"\",VLOOKUP($D9,Timeberegning!A$4:C$153,3)))","v":"12:53:00"},{"$f":"IF($D9=\"\",\"\",VLOOKUP($D9,Timeberegning!$A$4:$O$153,13))","v":"07:29:00"},null,null,"","00:40:00",{"$f":"IF(G9<>0,IF(WEEKDAY(A9,2)=7,G9,\"\"),\"\")","v":""},{"$f":"IF($D9=\"\",\"\",IF(VLOOKUP($D9,Timeberegning!$A$4:$O$101,15)=\"\",\"\",VLOOKUP($D9,Timeberegning!$A$4:$O$101,15)))","v":""},"",{"$f":"IF($D9=\"\",\"\",IF(VLOOKUP($D9,Timeberegning!$A$4:$P$101,16)=\"\",\"\",VLOOKUP($D9,Timeberegning!$A$4:$P$101,16)))","v":""},null,5,20,"05:20:00",12,53,{"$f":"IF(F9=\"\",\"\",TIME(HOUR(F9),MINUTE(F9),0))","v":"12:53:00"}]
["2010-04-07","On","",606,{"$f":"IF($D10=\"\",\"\",IF(VLOOKUP($D10,Timeberegning!A$4:B$153,2)=0,\"\",VLOOKUP($D10,Timeberegning!A$4:B$153,2)))","v":"06:07:00"},{"$f":"IF($D10=\"\",\"\",IF(VLOOKUP($D10,Timeberegning!A$4:C$153,3)=\"\",\"\",VLOOKUP($D10,Timeberegning!A$4:C$153,3)))","v":"15:15:00"},{"$f":"IF($D10=\"\",\"\",IF(VLOOKUP($D10,Timeberegning!$A$4:$O$153,13)=\"\",\"\",VLOOKUP($D10,Timeberegning!$A$4:$O$153,13)))","v":"08:46:00"},null,null,"","",{"$f":"IF(G10<>0,IF(WEEKDAY(A10,2)=7,G10,\"\"),\"\")","v":""},{"$f":"IF($D10=\"\",\"\",IF(VLOOKUP($D10,Timeberegning!$A$4:$O$101,15)=\"\",\"\",VLOOKUP($D10,Timeberegning!$A$4:$O$101,15)))","v":""},"",{"$f":"IF($D10=\"\",\"\",IF(VLOOKUP($D10,Timeberegning!$A$4:$P$101,16)=\"\",\"\",VLOOKUP($D10,Timeberegning!$A$4:$P$101,16)))","v":""},null,6,7,"06:07:00",15,15,"15:15:00"]
{"$rows_left_out":36}
{"sheet":"september2010","index":1,"n_rows":45,"n_cols":29,"rows_kept":45,"cut":false,"hidden":false,"merged":[[10,9,10,10],[17,9,17,10],[24,9,24,10],[25,9,25,10],[10,11,10,12],[11,11,11,12],[12,11,12,12],[17,11,17,12],[24,11,24,12],[25,11,25,12],[31,9,31,10],[31,11,31,12],[32,9,32,10],[32,11,32,12],[33,9,33,10],[33,11,33,12],[41,0,41,2],[42,0,42,2],[43,0,43,2],[1,1,1,2],[2,1,2,2],[39,0,39,2],[40,0,40,2],[0,1,0,6],[1,11,1,12],[2,11,2,12],[3,11,3,12],[4,11,4,12],[5,11,5,12],[6,11,6,12],[7,11,7,12],[8,11,8,12],[9,11,9,12],[13,11,13,12],[14,11,14,12],[15,11,15,12],[16,11,16,12],[18,11,18,12],[19,11,19,12],[20,11,20,12],[21,11,21,12],[22,11,22,12],[23,11,23,12],[26,11,26,12],[27,11,27,12],[28,11,28,12],[29,11,29,12],[30,11,30,12],[34,11,34,12],[35,11,35,12],[36,11,36,12],[37,11,37,12],[1,9,1,10],[2,9,2,10],[3,9,3,10],[4,9,4,10],[5,9,5,10],[6,9,6,10],[7,9,7,10],[8,9,8,10],[9,9,9,10],[11,9,11,10],[12,9,12,10],[13,9,13,10],[14,9,14,10],[15,9,15,10],[22,9,22,10],[23,9,23,10],[16,9,16,10],[18,9,18,10],[19,9,19,10],[20,9,20,10],[36,9,36,10],[37,9,37,10],[0,10,0,11],[28,9,28,10],[29,9,29,10],[30,9,30,10],[34,9,34,10],[35,9,35,10],[26,9,26,10],[27,9,27,10],[21,9,21,10]]}
["Løn",{"$f":"PROPER(TEXT(A4,\"dd mmmm åååå\")) & PROPER(TEXT(AC1,\"  -  dd mmmm åååå\"))","v":"01 December 2015  -  31 December 2015"},null,null,null,null,null,null,"Uge :",{"$f":"IF(A4=\"\",\"\",TRUNC((A4-WEEKDAY(A4,2)-DATE(YEAR(A4+4-WEEKDAY(A4,2)),1,-10))/7))","v":49},"-",null,{"$f":"IF(A25=\"\",\"\",TRUNC((A25-WEEKDAY(A25,2)-DATE(YEAR(A25+4-WEEKDAY(A25,2)),1,-10))/7))","v":52},null,null,null,null,null,"Time beregning:",null,null,null,null,null,null,null,null,null,{"$f":"IF(A32=\"\",A31,IF(A33=\"\",A32,IF(A34=\"\",A33,A34)))","v":"2015-12-31"}]
["Lønart",null,null,null,null,null,null,null,null,null,null,null,null,null,null,null,null,null,"Betalt pause ved vagt over 5 timer",null,null,null,"00:25:00","minutter","00:00:00","06:00:00","17:00:00","14:00:00"]
["Dato","Dag",null,"Start","Slut","Arb. Tid","Overtid           1-2 time","Overtid           3-4 time",null,"Aftenstillæg alle dage        17-23",null,"Nattillæg     20-08",null,"Lørdag tillæg 06 - 06","Søndag tillæg 06-06","Optjent afspadsering","Afholdt afspadsering"]
["2015-12-01",{"$f":"PROPER(TEXT(A4,\"ddd\"))","v":"Ti"},{"$f":"HelligdagsNavn(A4,0,0)","v":""},"14:00:00","02:00:00",{"$f":"IF(D4=\"\",\"\",(E4-D4)+(D4>E4))","v":0.5},null,null,null,{"$f":"IF(D4=\"\",\"\",(IF(E4-MAX(D4,(17/24))+(E4<D4)<0,0,E4-MAX(D4,(17/24))+(E4<D4)))-(IF((E4-MAX(D4,(23/24))+(E4<D4))<0,0,(E4-MAX(D4,(23/24))+(E4<D4)))))","v":"06:00:00"},null,{"$f":"IF(F4=\"\",\"\",IF((E4-MAX(D4,(20/24))+(D4>E4))<0,0,(IF(E4<D4,IF(E4>8/24,8/24,E4),E4)-MAX(D4,(20/24)))+(D4>E4))+(8/24)-MIN(D4,(8/24)))","v":"06:00:00"},null,null,{"$f":"IF(D4=\"\",\"\",IF(D4<6/24,6/24-D4,\"\"))","v":""},{"$f":"IF(F4=\"\",\"\",IF(F4<>0,IF(C4<>\"\",IF(G4+H4=0,Satser!B$23,((G4+H4)*24)*(24/1440)+Satser!B$23),IF(G4+H4=0,\"\",((G4+H4)*24)*(24/1440))),\"\"))","v":""},null,null,{"$f":"IF(D4=\"\",\"\",HOUR(D4))","v":14},{"$f":"IF(D4=\"\",\"\",MINUTE(D4))","v":0},{"$f":"IF(D4=\"\",\"\",TIME(HOUR(D4),MINUTE(D4),0))","v":"14:00:00"},{"$f":"IF(E4=\"\",\"\",HOUR(E4))","v":2},{"$f":"IF(E4=\"\",\"\",MINUTE(E4))","v":0},{"$f":"IF(E4=\"\",\"\",TIME(HOUR(E4),MINUTE(E4),0))","v":"02:00:00"}]
[{"$f":"A4+1","v":"2015-12-02"},{"$f":"PROPER(TEXT(A5,\"ddd\"))","v":"On"},{"$f":"HelligdagsNavn(A5,0,0)","v":""},"08:00:00","22:00:00",0.58333333333333326,null,null,null,{"$f":"IF(D5=\"\",\"\",(IF(E5-MAX(D5,(17/24))+(E5<D5)<0,0,E5-MAX(D5,(17/24))+(E5<D5)))-(IF((E5-MAX(D5,(23/24))+(E5<D5))<0,0,(E5-MAX(D5,(23/24))+(E5<D5)))))","v":"05:00:00"},null,{"$f":"IF(F5=\"\",\"\",IF((E5-MAX(D5,(20/24))+(D5>E5))<0,0,(IF(E5<D5,IF(E5>8/24,8/24,E5),E5)-MAX(D5,(20/24)))+(D5>E5))+(8/24)-MIN(D5,(8/24)))","v":"02:00:00"},null,null,null,{"$f":"IF(F5=\"\",\"\",IF(F5<>0,IF(C5<>\"\",IF(G5+H5=0,Satser!B$23,((G5+H5)*24)*(24/1440)+Satser!B$23),IF(G5+H5=0,\"\",((G5+H5)*24)*(24/1440))),\"\"))","v":""},null,null,8,0,"08:00:00",22,0,"22:00:00"]
[{"$f":"A5+1","v":"2015-12-03"},{"$f":"PROPER(TEXT(A6,\"ddd\"))","v":"To"},"","22:00:00","05:00:00",0.29166666666666674,null,null,null,"01:00:00",null,"07:00:00",null,null,null,{"$f":"IF(F6=\"\",\"\",IF(F6<>0,IF(C6<>\"\",IF(G6+H6=0,Satser!B$23,((G6+H6)*24)*(24/1440)+Satser!B$23),IF(G6+H6=0,\"\",((G6+H6)*24)*(24/1440))),\"\"))","v":""},null,null,22,0,"22:00:00",5,0,{"$f":"IF(E6=\"\",\"\",TIME(HOUR(E6),MINUTE(E6),0))","v":"05:00:00"}]
["2015-12-04","Fr","","17:45:00",1,0.26041666666666663,null,null,null,"05:15:00",null,"04:00:00",null,null,null,{"$f":"IF(F7=\"\",\"\",IF(F7<>0,IF(C7<>\"\",IF(G7+H7=0,Satser!B$23,((G7+H7)*24)*(24/1440)+Satser!B$23),IF(G7+H7=0,\"\",((G7+H7)*24)*(24/1440))),\"\"))","v":""},null,null,17,45,"17:45:00",0,0,"00:00:00"]
["2015-12-05","Lø","",null,null,"",null,null,null,"",null,"",null,{"$f":"IF(E8<D8,IF(E8>6/24,E8-6/24,\"\"),\"\")","v":""},null,{"$f":"IF(F8=\"\",\"\",IF(F8<>0,IF(C8<>\"\",IF(G8+H8=0,Satser!B$23,((G8+H8)*24)*(24/1440)+Satser!B$23),IF(G8+H8=0,\"\",((G8+H8)*24)*(24/1440))),\"\"))","v":""},null,null,"","","","","",""]
["2015-12-06","Sø","","17:45:00",1,0.26041666666666663,null,null,null,"05:15:00",null,"04:00:00",null,{"$f":"IF(D9=\"\",\"\",IF((E9-MAX(D9,(6/24))+(D9>E9))<0,0,(IF(E9<D9,IF(E9>6/24,6/24,E9),E9)-MAX(D9,(6/24)))+(D9>E9))+(6/24)-MIN(E9,(6/24)))","v":0.26041666666666663},{"$f":"IF(E9<D9,IF(E9>6/24,E9-6/24,\"\"),\"\")","v":""},{"$f":"IF(F9=\"\",\"\",IF(F9<>0,IF(C9<>\"\",IF(G9+H9=0,Satser!B$23,((G9+H9)*24)*(24/1440)+Satser!B$23),IF(G9+H9=0,\"\",((G9+H9)*24)*(24/1440))),\"\"))","v":""},null,null,17,45,"17:45:00",0,0,"00:00:00"]
["2015-12-07","Ma","",null,null,"",null,null,null,"",null,{"$f":"IF(F10=\"\",\"\",IF((E10-MAX(D10,(18/24))+(D10>E10))<0,0,(IF(E10<D10,IF(E10>2/24,2/24,E10),E10)-MAX(D10,(18/24)))+(D10>E10))+(2/24)-MIN(D10,(2/24)))","v":""},null,{"$f":"IF(D10=\"\",\"\",IF(D10<6/24,IF(E10<6/24,6/24-D10-(6/24-E10),6/24-D10),\"00:00\"))","v":""},{"$f":"IF(D10=\"\",\"\",IF((E10-MAX(D10,(6/24))+(D10>E10))<0,0,(IF(E10<D10,IF(E10>6/24,6/24,E10),E10)-MAX(D10,(6/24)))+(D10>E10))+(6/24)-MIN(E10,(6/24)))","v":""},{"$f":"IF(F10=\"\",\"\",IF(F10<>0,IF(C10<>\"\",IF(G10+H10=0,Satser!B$23,((G10+H10)*24)*(24/1440)+Satser!B$23),IF(G10+H10=0,\"\",((G10+H10)*24)*(24/1440))),\"\"))","v":""},null,null,"","","","","",""]
{"$rows_left_out":36}
{"sheet":"Tomt","index":2,"n_rows":45,"n_cols":26,"rows_kept":45,"cut":false,"hidden":false,"merged":[[0,16,0,19],[41,0,41,3],[42,0,42,3],[43,0,43,3],[0,1,0,5],[1,1,1,2],[2,1,2,2],[39,0,39,3],[40,0,40,3]]}
["Løn","1 juni 2010 - 30 juni 2010",null,null,null,null,null,null,null,null,null,null,null,null,null,null,"Time beregning:"]
["Lønart",null,null,null,null,null,3025,3425,3426,3600,3602,3605,3610,9091,9092,null,"Betalt pause ved vagt over 5 timer",null,null,null,"00:25:00","minutter","00:00:00","06:00:00","18:00:00","14:00:00"]
["Dato","Dag",null,"Vagt","Start","Slut","Time SID","Overtid           1-3 time","Overtid            4 - time","Forskudttid alle dage","Nattillæg     00-06","Weekend tillæg","Delt tjenste"]
["2010-04-01",{"$f":"PROPER(TEXT(A4,\"ddd\"))","v":"To"},{"$f":"HelligdagsNavn(A4,0,0)","v":"Skærtorsdag"},null,"08:00:00","20:00:00",{"$f":"IF($D4=\"\",\"\",VLOOKUP($D4,Timeberegning!$A$4:$O$10,13))","v":""},null,null,{"$f":"IF(E4<>\"\",IF(WEEKDAY(A4,2)<>6,IF(E4>F4,(F4-MAX(E4,(18/24))+(E4>F4))-F4,IF(F4>Y$2,(F4-MAX(E4,(18/24))),\"\")),IF(E4>F4,(F4-MAX(E4,(14/24))+(E4>F4))-F4,IF(F4>Z$2,(F4-MAX(E4,(14/24))),\"\"))),\"\")","v":"02:00:00"},{"$f":"IF(G4<>\"\",IF(S4<X$2,(X$2-S4),IF(V4<X$2,(V4-W$2),\"\")),\"\")","v":""},{"$f":"IF(G4<>0,IF(WEEKDAY(A4,2)=7,G4,\"\"),\"\")","v":""},{"$f":"IF($D4=\"\",\"\",IF(VLOOKUP($D4,Timeberegning!$A$4:$O$101,15)=\"\",\"\",VLOOKUP($D4,Timeberegning!$A$4:$O$101,15)))","v":""},{"$f":"IF(SUM(H4:I4)=0,\"\",SUM(H4:I4))","v":""},null,null,{"$f":"IF(E4=\"\",\"\",HOUR(E4))","v":8},{"$f":"IF(E4=\"\",\"\",MINUTE(E4))","v":0},{"$f":"IF(E4=\"\",\"\",TIME(HOUR(E4),MINUTE(E4),0))","v":"08:00:00"},{"$f":"IF(F4=\"\",\"\",HOUR(F4))","v":20},{"$f":"IF(F4=\"\",\"\",MINUTE(F4))","v":0},{"$f":"TIME(HOUR(F4),MINUTE(F4),0)","v":"20:00:00"}]
["2010-04-02",{"$f":"PROPER(TEXT(A5,\"ddd\"))","v":"Fr"},{"$f":"HelligdagsNavn(A5,0,0)","v":"Langfredag"},null,"17:45:00",1,{"$f":"IF($D5=\"\",\"\",VLOOKUP($D5,Timeberegning!$A$4:$O$10,13))","v":""},null,null,{"$f":"IF(E5<>\"\",IF(WEEKDAY(A5,2)<>6,IF(E5>F5,(F5-MAX(E5,(18/24))+(E5>F5))-F5,IF(F5>Y$2,(F5-MAX(E5,(18/24))),\"\")),IF(E5>F5,(F5-MAX(E5,(14/24))+(E5>F5))-F5,IF(F5>Z$2,(F5-MAX(E5,(14/24))),\"\"))),\"\")","v":"06:00:00"},"",{"$f":"IF(G5<>0,IF(WEEKDAY(A5,2)=7,G5,\"\"),\"\")","v":""},{"$f":"IF($D5=\"\",\"\",IF(VLOOKUP($D5,Timeberegning!$A$4:$O$101,15)=\"\",\"\",VLOOKUP($D5,Timeberegning!$A$4:$O$101,15)))","v":""},{"$f":"IF(SUM(H5:I5)=0,\"\",SUM(H5:I5))","v":""},null,null,17,45,"17:45:00",0,0,{"$f":"TIME(HOUR(F5),MINUTE(F5),0)","v":"00:00:00"}]
["2010-04-03",{"$f":"PROPER(TEXT(A6,\"ddd\"))","v":"Lø"},"",null,{"$f":"IF($D6=\"\",\"\",IF(VLOOKUP($D6,Timeberegning!A$4:B$153,2)=0,\"\",VLOOKUP($D6,Timeberegning!A$4:B$153,2)))","v":""},{"$f":"IF($D6=\"\",\"\",IF(VLOOKUP($D6,Timeberegning!A$4:C$153,3)=\"\",\"\",VLOOKUP($D6,Timeberegning!A$4:C$153,3)))","v":""},{"$f":"IF($D6=\"\",\"\",VLOOKUP($D6,Timeberegning!$A$4:$O$10,13))","v":""},null,null,{"$f":"IF(E6<>\"\",IF(WEEKDAY(A6,2)<>6,IF(E6>F6,(F6-MAX(E6,(18/24))+(E6>F6))-F6,IF(F6>Y$2,(F6-MAX(E6,(18/24))),\"\")),IF(E6>F6,(F6-MAX(E6,(14/24))+(E6>F6))-F6,IF(F6>Z$2,(F6-MAX(E6,(14/24))),\"\"))),\"\")","v":""},"","",{"$f":"IF($D6=\"\",\"\",IF(VLOOKUP($D6,Timeberegning!$A$4:$O$101,15)=\"\",\"\",VLOOKUP($D6,Timeberegning!$A$4:$O$101,15)))","v":""},"",null,null,"","","","","",{"$f":"TIME(HOUR(F6),MINUTE(F6),0)","v":{"$error":"#VALUE!"}}]
["2010-04-04","Sø","Påskedag",null,{"$f":"IF($D7=\"\",\"\",IF(VLOOKUP($D7,Timeberegning!A$4:B$153,2)=0,\"\",VLOOKUP($D7,Timeberegning!A$4:B$153,2)))","v":""},{"$f":"IF($D7=\"\",\"\",IF(VLOOKUP($D7,Timeberegning!A$4:C$153,3)=\"\",\"\",VLOOKUP($D7,Timeberegning!A$4:C$153,3)))","v":""},{"$f":"IF($D7=\"\",\"\",VLOOKUP($D7,Timeberegning!$A$4:$O$153,13))","v":""},null,null,"","","",{"$f":"IF($D7=\"\",\"\",IF(VLOOKUP($D7,Timeberegning!$A$4:$O$101,15)=\"\",\"\",VLOOKUP($D7,Timeberegning!$A$4:$O$101,15)))","v":""},"",{"$f":"IF($D7=\"\",\"\",IF(VLOOKUP($D7,Timeberegning!$A$4:$P$101,16)=\"\",\"\",VLOOKUP($D7,Timeberegning!$A$4:$P$101,16)))","v":""},null,"","","","","",{"$f":"TIME(HOUR(F7),MINUTE(F7),0)","v":{"$error":"#VALUE!"}}]
["2010-04-05","Ma","2. Påskedag",null,{"$f":"IF($D8=\"\",\"\",IF(VLOOKUP($D8,Timeberegning!A$4:B$153,2)=0,\"\",VLOOKUP($D8,Timeberegning!A$4:B$153,2)))","v":""},{"$f":"IF($D8=\"\",\"\",IF(VLOOKUP($D8,Timeberegning!A$4:C$153,3)=\"\",\"\",VLOOKUP($D8,Timeberegning!A$4:C$153,3)))","v":""},{"$f":"IF($D8=\"\",\"\",VLOOKUP($D8,Timeberegning!$A$4:$O$153,13))","v":""},null,null,"","","",{"$f":"IF($D8=\"\",\"\",IF(VLOOKUP($D8,Timeberegning!$A$4:$O$101,15)=\"\",\"\",VLOOKUP($D8,Timeberegning!$A$4:$O$101,15)))","v":""},"",{"$f":"IF($D8=\"\",\"\",IF(VLOOKUP($D8,Timeberegning!$A$4:$P$101,16)=\"\",\"\",VLOOKUP($D8,Timeberegning!$A$4:$P$101,16)))","v":""},null,"","","","","",{"$f":"TIME(HOUR(F8),MINUTE(F8),0)","v":{"$error":"#VALUE!"}}]
["2010-04-06","Ti","",null,{"$f":"IF($D9=\"\",\"\",IF(VLOOKUP($D9,Timeberegning!A$4:B$153,2)=0,\"\",VLOOKUP($D9,Timeberegning!A$4:B$153,2)))","v":""},{"$f":"IF($D9=\"\",\"\",IF(VLOOKUP($D9,Timeberegning!A$4:C$153,3)=\"\",\"\",VLOOKUP($D9,Timeberegning!A$4:C$153,3)))","v":""},{"$f":"IF($D9=\"\",\"\",VLOOKUP($D9,Timeberegning!$A$4:$O$153,13))","v":""},null,null,"","",{"$f":"IF(G9<>0,IF(WEEKDAY(A9,2)=7,G9,\"\"),\"\")","v":""},{"$f":"IF($D9=\"\",\"\",IF(VLOOKUP($D9,Timeberegning!$A$4:$O$101,15)=\"\",\"\",VLOOKUP($D9,Timeberegning!$A$4:$O$101,15)))","v":""},"",{"$f":"IF($D9=\"\",\"\",IF(VLOOKUP($D9,Timeberegning!$A$4:$P$101,16)=\"\",\"\",VLOOKUP($D9,Timeberegning!$A$4:$P$101,16)))","v":""},null,"","","","","",{"$f":"IF(F9=\"\",\"\",TIME(HOUR(F9),MINUTE(F9),0))","v":""}]
["2010-04-07","On","",null,{"$f":"IF($D10=\"\",\"\",IF(VLOOKUP($D10,Timeberegning!A$4:B$153,2)=0,\"\",VLOOKUP($D10,Timeberegning!A$4:B$153,2)))","v":""},{"$f":"IF($D10=\"\",\"\",IF(VLOOKUP($D10,Timeberegning!A$4:C$153,3)=\"\",\"\",VLOOKUP($D10,Timeberegning!A$4:C$153,3)))","v":""},{"$f":"IF($D10=\"\",\"\",IF(VLOOKUP($D10,Timeberegning!$A$4:$O$153,13)=\"\",\"\",VLOOKUP($D10,Timeberegning!$A$4:$O$153,13)))","v":""},null,null,"","",{"$f":"IF(G10<>0,IF(WEEKDAY(A10,2)=7,G10,\"\"),\"\")","v":""},{"$f":"IF($D10=\"\",\"\",IF(VLOOKUP($D10,Timeberegning!$A$4:$O$101,15)=\"\",\"\",VLOOKUP($D10,Timeberegning!$A$4:$O$101,15)))","v":""},"",{"$f":"IF($D10=\"\",\"\",IF(VLOOKUP($D10,Timeberegning!$A$4:$P$101,16)=\"\",\"\",VLOOKUP($D10,Timeberegning!$A$4:$P$101,16)))","v":""},null,"","","","","",""]
{"$rows_left_out":36}
{"sheet":"Satser","index":3,"n_rows":23,"n_cols":4,"rows_kept":23,"cut":false,"hidden":false,"merged":[]}
[]
[]
["Timeløn",119.62]
["specielt tillæg",1.19]
["Chauffør tillæg",4.95]
[]
["Samlet timeløn",{"$f":"SUM(B3:B5)","v":125.76}]
[]
["overtidstillæg 50%",59.81]
["pr. time",{"$f":"B7+B9","v":185.57}]
{"$rows_left_out":14}
{"sheet":"Timeberegning","index":4,"n_rows":78,"n_cols":16,"rows_kept":78,"cut":false,"hidden":false,"merged":[[0,0,0,2],[1,0,1,6]]}
["Time beregning:"]
["Betalt pause ved vagt over 5 timer",null,null,null,null,null,null,"00:25:00","minutter","00:00:00","06:00:00","18:00:00","14:00:00"]
["vagt","start","slut","Tid","Pause 1 start","Pause 1 start","Tid","Pause 2 start","Pause 2 slut","Tid","Samlet pause","Selv betalt pause","Beregnet arbejdstid","1/100","Delevagt","Afholdt afspadsering"]
[111,"05:54:00","14:57:00",{"$f":"C4-B4+(B4>C4)","v":"09:03:00"},"10:34:00","11:08:00",{"$f":"TEXT(F4-E4,\"t:mm\")","v":"0:34"},null,null,{"$f":"I4-H4","v":"00:00:00"},{"$f":"G4+J4","v":"00:34:00"},{"$f":"IF(K4>H$2,K4-H$2,0)","v":"00:09:00"},{"$f":"D4-L4","v":"08:54:00"},{"$f":"24*M4","v":8.9}]
[112,"10:06:00","16:38:00",{"$f":"C5-B5+(B5>C5)","v":"06:32:00"},"14:00:00","14:46:00","0:46",null,null,{"$f":"I5-H5","v":"00:00:00"},{"$f":"G5+J5","v":"00:46:00"},{"$f":"IF(K5>H$2,K5-H$2,0)","v":"00:21:00"},{"$f":"D5-L5","v":"06:11:00"},{"$f":"24*M5","v":6.1833333333333327}]
[113,"07:55:00","16:19:00",{"$f":"C6-B6+(B6>C6)","v":"08:24:00"},null,null,"0:00",null,null,"00:00:00","00:00:00","00:00:00","08:24:00",8.4]
[114,"09:48:00","17:55:00",{"$f":"C7-B7+(B7>C7)","v":"08:07:00"},"12:34:00","12:58:00","0:24","15:04:00","16:01:00","00:57:00","01:21:00","00:56:00","07:11:00",7.1833333333333336]
[121,"04:36:00","11:24:00",{"$f":"C8-B8+(B8>C8)","v":"06:48:00"},"08:30:00","08:58:00","0:28",null,null,"00:00:00","00:28:00","00:03:00","06:45:00",6.7500000000000018]
[122,"04:36:00","11:58:00","07:22:00","08:32:00","08:51:00","0:19","09:22:00","10:03:00","00:41:00","01:00:00","00:35:00","06:47:00",6.7833333333333332]
[123,"04:48:00","12:24:00","07:36:00","06:32:00","06:58:00","0:26","09:04:00","09:43:00","00:39:00","01:05:00","00:40:00","06:56:00",6.9333333333333353]
{"$rows_left_out":69}
{"sheet":"Ark1","index":5,"n_rows":33,"n_cols":7,"rows_kept":33,"cut":false,"hidden":false,"merged":[[26,3,26,4],[0,0,0,1],[1,0,3,0],[1,1,3,1],[1,3,1,5],[2,3,2,5],[24,3,24,4]]}
["Koder"]
["Dataløn","BusPlan","Nr.","Navn:",null,null,"Anc."]
[null,null,1807,"Bjarne Hansen",null,null,3]
[null,null,null,"TAST HER"]
[null,"001","Køretid",null,{"$f":"Satser!B3","v":119.62},{"$f":"D5*E5","v":0}]
[null,3025,"Timer",{"$f":"'Juni2010 (2)'!G36","v":151.78},{"$f":"Satser!B3","v":119.62},{"$f":"D6*E6","v":18155.923600000002}]
[null,3210,"Delt vagt",{"$f":"'Juni2010 (2)'!M35","v":1},{"$f":"Satser!B21","v":67},{"$f":"D7*E7","v":67}]
[null,3405,"Overarb. 50%",{"$f":"'Juni2010 (2)'!H36","v":0},{"$f":"Satser!B10","v":185.57},{"$f":"D8*E8","v":0}]
[null,3410,"Overarb. 100%",{"$f":"'Juni2010 (2)'!I36","v":0},{"$f":"Satser!B13","v":245.38},{"$f":"D9*E9","v":0}]
[null,3600,"Forskudt 18-24",{"$f":"'Juni2010 (2)'!J36","v":60.45},{"$f":"Satser!B15","v":18.8},{"$f":"D10*E10","v":1136.46}]
{"$rows_left_out":24}
{"sheet":"Ark2","index":6,"n_rows":6,"n_cols":9,"rows_kept":6,"cut":false,"hidden":false,"merged":[]}
["start","slut",null,"tid","pause start","pause slut","tid"]
["13:55:00","22:11:00",null,{"$f":"B2-A2","v":0.34444444444444455},"19:52:00","20:17:00",{"$f":"TEXT(F2-E2,\"t:mm\")","v":"0:25"},null,{"$f":"TEXT(D2-G2,\"t:mm\")","v":"7:51"}]
["14:10:00",1,null,{"$f":"B3-A3","v":"09:50:00"}]
["00:00:00","00:11:00",null,{"$f":"B4-A4","v":"00:11:00"}]
["2010-06-10T14:10:00","2010-06-11T00:11:00",null,{"$f":"B5-A5","v":"10:01:00"}]
[null,null,null,{"$f":"SUM(D2:D5)","v":1.179166666666505},{"$f":"D6*24","v":28.299999999996121}]

{"sheet":"Ark3","index":7,"n_rows":0,"n_cols":0,"rows_kept":0,"cut":false,"hidden":false,"merged":[]}