{"text_format":"1","workbook":"xlsx","n_sheets":7,"sheets":["Juni2010 (2)","september2010","Tomt","Satser","norm","Ark2","Ark3"],"not_rendered":{"charts":0,"images":0,"macros":1,"external_links":0,"defined_names":3,"comments":0,"pivot_tables":0},"unopened":[],"bounds":{"document_bytes":16777216,"sheet_cells":100000,"rows_first":2000,"rows_last":500,"rows_between":2000,"halvings":0,"cell_chars":16384,"cell_head_chars":4096},"cells_cut":0,"cells_raw":0,"read":"whole","date_system":"1900"}

{"sheet":"Juni2010 (2)","index":0,"n_rows":45,"n_cols":26,"rows_kept":45,"cut":false,"hidden":false,"merged":[[43,0,43,3],[0,1,0,5],[0,16,0,17],[39,0,39,3],[40,0,40,3],[41,0,41,3],[42,0,42,3],[2,1,2,2],[1,1,1,2]]}
["Løn","1 juni 2010 - 30 juni 2010",null,null,null,null,null,null,null,null,null,null,null,null,null,null,"Time beregning:"]
["Lønart",null,null,null,null,null,3025,3425,3426,3600,3602,3605,3610,9091,9092,null,"Betalt pause ved vagt over 5 timer",null,null,null,"00:25:00","minutter","00:00:00","06:00:00","18:00:00","14:00:00"]
["Dato","Dag",null,"Vagt","Start","Slut","Time SID","Overtid           1-3 time","Overtid            4 - time","Aftenstillæg","Nattillæg     00-06","Søndags tillæg","Delt tjenste"]
["2010-04-01",{"$f":"PROPER(TEXT(A4,\"ddd\"))","v":"To"},{"$f":"HelligdagsNavn(A4,0,0)","v":"Skærtorsdag"},111,{"$f":"IF($D4=\"\",\"\",IF(VLOOKUP($D4,#REF!,2)=0,\"\",VLOOKUP($D4,#REF!,2)))","v":{"$error":"#REF!"}},{"$f":"IF($D4=\"\",\"\",IF(VLOOKUP($D4,#REF!,3)=\"\",\"\",VLOOKUP($D4,#REF!,3)))","v":{"$error":"#REF!"}},{"$f":"IF($D4=\"\",\"\",VLOOKUP($D4,#REF!,13))","v":{"$error":"#REF!"}},null,null,{"$f":"IF(E4<>\"\",IF(WEEKDAY(A4,2)<>6,IF(E4>F4,(F4-MAX(E4,(18/24))+(E4>F4))-F4,IF(F4>Y$2,(F4-MAX(E4,(18/24))),\"\")),IF(E4>F4,(F4-MAX(E4,(14/24))+(E4>F4))-F4,IF(F4>Z$2,(F4-MAX(E4,(14/24))),\"\"))),\"\")","v":{"$error":"#REF!"}},{"$f":"IF(G4<>\"\",IF(S4<X$2,(X$2-S4),IF(V4<X$2,(V4-W$2),\"\")),\"\")","v":{"$error":"#REF!"}},{"$f":"IF(G4<>0,IF(WEEKDAY(A4,2)=7,G4,\"\"),\"\")","v":{"$error":"#REF!"}},{"$f":"IF($D4=\"\",\"\",IF(VLOOKUP($D4,#REF!,15)=\"\",\"\",VLOOKUP($D4,#REF!,15)))","v":{"$error":"#REF!"}},{"$f":"IF(SUM(H4:I4)=0,\"\",SUM(H4:I4))","v":""},null,null,{"$f":"IF(E4=\"\",\"\",HOUR(E4))","v":{"$error":"#REF!"}},{"$f":"IF(E4=\"\",\"\",MINUTE(E4))","v":{"$error":"#REF!"}},{"$f":"IF(E4=\"\",\"\",TIME(HOUR(E4),MINUTE(E4),0))","v":{"$error":"#REF!"}},{"$f":"IF(F4=\"\",\"\",HOUR(F4))","v":{"$error":"#REF!"}},{"$f":"IF(F4=\"\",\"\",MINUTE(F4))","v":{"$error":"#REF!"}},{"$f":"TIME(HOUR(F4),MINUTE(F4),0)","v":{"$error":"#REF!"}}]
["2010-04-02",{"$f":"PROPER(TEXT(A5,\"ddd\"))","v":"Fr"},{"$f":"HelligdagsNavn(A5,0,0)","v":"Langfredag"},134,{"$f":"IF($D5=\"\",\"\",IF(VLOOKUP($D5,#REF!,2)=0,\"\",VLOOKUP($D5,#REF!,2)))","v":{"$error":"#REF!"}},{"$f":"IF($D5=\"\",\"\",IF(VLOOKUP($D5,#REF!,3)=\"\",\"\",VLOOKUP($D5,#REF!,3)))","v":{"$error":"#REF!"}},{"$f":"IF($D5=\"\",\"\",VLOOKUP($D5,#REF!,13))","v":{"$error":"#REF!"}},null,null,{"$f":"IF(E5<>\"\",IF(WEEKDAY(A5,2)<>6,IF(E5>F5,(F5-MAX(E5,(18/24))+(E5>F5))-F5,IF(F5>Y$2,(F5-MAX(E5,(18/24))),\"\")),IF(E5>F5,(F5-MAX(E5,(14/24))+(E5>F5))-F5,IF(F5>Z$2,(F5-MAX(E5,(14/24))),\"\"))),\"\")","v":{"$error":"#REF!"}},{"$error":"#REF!"},{"$f":"IF(G5<>0,IF(WEEKDAY(A5,2)=7,G5,\"\"),\"\")","v":{"$error":"#REF!"}},{"$f":"IF($D5=\"\",\"\",IF(VLOOKUP($D5,#REF!,15)=\"\",\"\",VLOOKUP($D5,#REF!,15)))","v":{"$error":"#REF!"}},{"$f":"IF(SUM(H5:I5)=0,\"\",SUM(H5:I5))","v":""},null,null,{"$error":"#REF!"},{"$error":"#REF!"},{"$error":"#REF!"},{"$error":"#REF!"},{"$error":"#REF!"},{"$f":"TIME(HOUR(F5),MINUTE(F5),0)","v":{"$error":"#REF!"}}]
["2010-04-03",{"$f":"PROPER(TEXT(A6,\"ddd\"))","v":"Lø"},"",612,{"$f":"IF($D6=\"\",\"\",IF(VLOOKUP($D6,#REF!,2)=0,\"\",VLOOKUP($D6,#REF!,2)))","v":{"$error":"#REF!"}},{"$f":"IF($D6=\"\",\"\",IF(VLOOKUP($D6,#REF!,3)=\"\",\"\",VLOOKUP($D6,#REF!,3)))","v":{"$error":"#REF!"}},{"$f":"IF($D6=\"\",\"\",VLOOKUP($D6,#REF!,13))","v":{"$error":"#REF!"}},null,null,{"$f":"IF(E6<>\"\",IF(WEEKDAY(A6,2)<>6,IF(E6>F6,(F6-MAX(E6,(18/24))+(E6>F6))-F6,IF(F6>Y$2,(F6-MAX(E6,(18/24))),\"\")),IF(E6>F6,(F6-MAX(E6,(14/24))+(E6>F6))-F6,IF(F6>Z$2,(F6-MAX(E6,(14/24))),\"\"))),\"\")","v":{"$error":"#REF!"}},{"$error":"#REF!"},{"$error":"#REF!"},{"$f":"IF($D6=\"\",\"\",IF(VLOOKUP($D6,#REF!,15)=\"\",\"\",VLOOKUP($D6,#REF!,15)))","v":{"$error":"#REF!"}},"",null,null,{"$error":"#REF!"},{"$error":"#REF!"},{"$error":"#REF!"},{"$error":"#REF!"},{"$error":"#REF!"},{"$f":"TIME(HOUR(F6),MINUTE(F6),0)","v":{"$error":"#REF!"}}]
["2010-04-04","Sø","Påskedag",711,{"$f":"IF($D7=\"\",\"\",IF(VLOOKUP($D7,#REF!,2)=0,\"\",VLOOKUP($D7,#REF!,2)))","v":{"$error":"#REF!"}},{"$f":"IF($D7=\"\",\"\",IF(VLOOKUP($D7,#REF!,3)=\"\",\"\",VLOOKUP($D7,#REF!,3)))","v":{"$error":"#REF!"}},{"$f":"IF($D7=\"\",\"\",VLOOKUP($D7,#REF!,13))","v":{"$error":"#REF!"}},null,null,{"$error":"#REF!"},{"$error":"#REF!"},{"$error":"#REF!"},{"$f":"IF($D7=\"\",\"\",IF(VLOOKUP($D7,#REF!,15)=\"\",\"\",VLOOKUP($D7,#REF!,15)))","v":{"$error":"#REF!"}},"",{"$f":"IF($D7=\"\",\"\",IF(VLOOKUP($D7,#REF!,16)=\"\",\"\",VLOOKUP($D7,#REF!,16)))","v":{"$error":"#REF!"}},null,{"$error":"#REF!"},{"$error":"#REF!"},{"$error":"#REF!"},{"$error":"#REF!"},{"$error":"#REF!"},{"$f":"TIME(HOUR(F7),MINUTE(F7),0)","v":{"$error":"#REF!"}}]
["2010-04-05","Ma","2. Påskedag",122,{"$f":"IF($D8=\"\",\"\",IF(VLOOKUP($D8,#REF!,2)=0,\"\",VLOOKUP($D8,#REF!,2)))","v":{"$error":"#REF!"}},{"$f":"IF($D8=\"\",\"\",IF(VLOOKUP($D8,#REF!,3)=\"\",\"\",VLOOKUP($D8,#REF!,3)))","v":{"$error":"#REF!"}},{"$f":"IF($D8=\"\",\"\",VLOOKUP($D8,#REF!,13))","v":{"$error":"#REF!"}},null,null,{"$error":"#REF!"},{"$error":"#REF!"},{"$error":"#REF!"},{"$f":"IF($D8=\"\",\"\",IF(VLOOKUP($D8,#REF!,15)=\"\",\"\",VLOOKUP($D8,#REF!,15)))","v":{"$error":"#REF!"}},"",{"$f":"IF($D8=\"\",\"\",IF(VLOOKUP($D8,#REF!,16)=\"\",\"\",VLOOKUP($D8,#REF!,16)))","v":{"$error":"#REF!"}},null,{"$error":"#REF!"},{"$error":"#REF!"},{"$error":"#REF!"},{"$error":"#REF!"},{"$error":"#REF!"},{"$f":"TIME(HOUR(F8),MINUTE(F8),0)","v":{"$error":"#REF!"}}]
["2010-04-06","Ti","",124,{"$f":"IF($D9=\"\",\"\",IF(VLOOKUP($D9,#REF!,2)=0,\"\",VLOOKUP($D9,#REF!,2)))","v":{"$error":"#REF!"}},{"$f":"IF($D9=\"\",\"\",IF(VLOOKUP($D9,#REF!,3)=\"\",\"\",VLOOKUP($D9,#REF!,3)))","v":{"$error":"#REF!"}},{"$f":"IF($D9=\"\",\"\",VLOOKUP($D9,#REF!,13))","v":{"$error":"#REF!"}},null,null,{"$error":"#REF!"},{"$error":"#REF!"},{"$f":"IF(G9<>0,IF(WEEKDAY(A9,2)=7,G9,\"\"),\"\")","v":{"$error":"#REF!"}},{"$f":"IF($D9=\"\",\"\",IF(VLOOKUP($D9,#REF!,15)=\"\",\"\",VLOOKUP($D9,#REF!,15)))","v":{"$error":"#REF!"}},"",{"$f":"IF($D9=\"\",\"\",IF(VLOOKUP($D9,#REF!,16)=\"\",\"\",VLOOKUP($D9,#REF!,16)))","v":{"$error":"#REF!"}},null,{"$error":"#REF!"},{"$error":"#REF!"},{"$error":"#REF!"},{"$error":"#REF!"},{"$error":"#REF!"},{"$f":"IF(F9=\"\",\"\",TIME(HOUR(F9),MINUTE(F9),0))","v":{"$error":"#REF!"}}]
["2010-04-07","On","",606,{"$f":"IF($D10=\"\",\"\",IF(VLOOKUP($D10,#REF!,2)=0,\"\",VLOOKUP($D10,#REF!,2)))","v":{"$error":"#REF!"}},{"$f":"IF($D10=\"\",\"\",IF(VLOOKUP($D10,#REF!,3)=\"\",\"\",VLOOKUP($D10,#REF!,3)))","v":{"$error":"#REF!"}},{"$f":"IF($D10=\"\",\"\",IF(VLOOKUP($D10,#REF!,13)=\"\",\"\",VLOOKUP($D10,#REF!,13)))","v":{"$error":"#REF!"}},null,null,{"$error":"#REF!"},{"$error":"#REF!"},{"$f":"IF(G10<>0,IF(WEEKDAY(A10,2)=7,G10,\"\"),\"\")","v":{"$error":"#REF!"}},{"$f":"IF($D10=\"\",\"\",IF(VLOOKUP($D10,#REF!,15)=\"\",\"\",VLOOKUP($D10,#REF!,15)))","v":{"$error":"#REF!"}},"",{"$f":"IF($D10=\"\",\"\",IF(VLOOKUP($D10,#REF!,16)=\"\",\"\",VLOOKUP($D10,#REF!,16)))","v":{"$error":"#REF!"}},null,{"$error":"#REF!"},{"$error":"#REF!"},{"$error":"#REF!"},{"$error":"#REF!"},{"$error":"#REF!"},{"$error":"#REF!"}]
{"$rows_left_out":36}
{"sheet":"september2010","index":1,"n_rows":47,"n_cols":35,"rows_kept":47,"cut":false,"hidden":false,"merged":[[29,10,29,11],[30,10,30,11],[31,10,31,11],[32,10,32,11],[28,12,28,13],[29,12,29,13],[30,12,30,13],[31,12,31,13],[32,12,32,13],[37,12,37,13],[39,12,39,13],[38,12,38,13],[17,12,17,13],[18,12,18,13],[19,12,19,13],[20,12,20,13],[35,12,35,13],[36,12,36,13],[25,12,25,13],[26,12,26,13],[27,12,27,13],[33,12,33,13],[34,12,34,13],[21,12,21,13],[19,10,19,11],[20,10,20,11],[21,10,21,11],[8,12,8,13],[9,12,9,13],[10,12,10,13],[11,12,11,13],[12,12,12,13],[13,12,13,13],[14,12,14,13],[15,12,15,13],[16,12,16,13],[24,10,24,11],[25,10,25,11],[26,10,26,11],[27,10,27,11],[28,10,28,11],[33,10,33,11],[34,10,34,11],[35,10,35,11],[36,10,36,11],[37,10,37,11],[45,0,45,5],[43,0,43,2],[44,0,44,2],[8,10,8,11],[9,10,9,11],[10,10,10,11],[11,10,11,11],[12,10,12,11],[13,10,13,11],[14,10,14,11],[22,10,22,11],[23,10,23,11],[15,10,15,11],[16,10,16,11],[41,0,41,2],[42,0,42,2],[5,12,5,13],[6,12,6,13],[7,12,7,13],[5,10,5,11],[6,10,6,11],[7,10,7,11],[22,12,22,13],[23,12,23,13],[24,12,24,13],[17,10,17,11],[18,10,18,11],[38,10,38,11],[39,10,39,11],[0,1,0,7],[1,12,1,13],[2,12,2,13],[3,12,3,13],[4,12,4,13],[1,10,1,11],[2,10,2,11],[3,10,3,11],[4,10,4,11],[1,1,1,2],[2,1,2,2],[0,11,0,12]]}
["Løn",{"$f":"PROPER(TEXT(A4,\"dd mmmm åååå\")) & PROPER(TEXT(A36,\"  -  dd mmmm åååå\"))","v":"15 December 2001  -  16 Januar 2002"},null,null,null,null,null,null,null,"Uge :",{"$f":"IF(A4=\"\",\"\",TRUNC((A4-WEEKDAY(A4,2)-DATE(YEAR(A4+4-WEEKDAY(A4,2)),1,-10))/7))","v":50},"-",null,{"$f":"IF(A25=\"\",\"\",TRUNC((A25-WEEKDAY(A25,2)-DATE(YEAR(A25+4-WEEKDAY(A25,2)),1,-10))/7))","v":1},null,null,null,null,null,null,null,null,"Time beregning:",null,null,null,null,null,null,null,null,null,null,"06:00:00","18:00:00"]
["Lønart",null,null,null,null,null,null,null,null,null,null,null,null,null,null,null,null,null,null,null,null,null,"Betalt pause ved vagt over 5 timer",null,null,null,"00:25:00","minutter","00:00:00","06:00:00","17:00:00","14:00:00"]
["Dato","Dag",null,"Start","Slut","Pause","Arb. Tid","Overtid           1-2 time","Overtid           3-4 time","Overtid            5 - time","Forskudt tid alle dage        18-22",null,"Natarbejde 22-06",null,"Lørdag tillæg 15 - 24","Søndag tillæg 00 - 24","Optjent afspadsering","Afholdt afspadsering","Syge Timer","norm"]
["2001-12-15",{"$f":"PROPER(TEXT(A4,\"ddd\"))","v":"Lø"},{"$f":"HelligdagsNavn(A4,0,0)","v":""},"07:00:00","16:00:00","00:15:00",{"$f":"IF(D4=\"\",\"\",(E4-D4)+(D4>E4)-F4+H4+I4+J4)","v":0.47916666666666657},"02:00:00","00:45:00",null,{"$f":"ColTime(TIME(18,0,0),TIME(23,0,0),D4,E4)","v":"00:00:00"},null,{"$f":"ColTime(TIME(23,0,0),TIME(6,0,0),D4,E4)","v":"00:00:00"},null,{"$f":"IF(WEEKDAY(A4,2)=6,ColTime(TIME(15,0,0),TIME(24,0,0),D4,E4),\"\")","v":"01:00:00"},{"$f":"IF(D4=\"\",\"\",IF(D4<6/24,6/24-D4,\"\"))","v":""},{"$f":"H4+I4+J4","v":"02:45:00"},null,null,{"$f":"CHOOSE(WEEKDAY(A4,2),norm!C$1,norm!C$2,norm!C$3,norm!C$4,norm!C$5,norm!C$6,norm!C$7)","v":"00:00:00"},null,null,{"$f":"IF(D4=\"\",\"\",HOUR(D4))","v":7},{"$f":"IF(D4=\"\",\"\",MINUTE(D4))","v":0},{"$f":"IF(D4=\"\",\"\",TIME(HOUR(D4),MINUTE(D4),0))","v":"07:00:00"},{"$f":"IF(E4=\"\",\"\",HOUR(E4))","v":16},{"$f":"IF(E4=\"\",\"\",MINUTE(E4))","v":0},"02:00:00","09:30:00","11:30:00",null,null,{"$f":"WEEKDAY(A4,2)","v":6}]
[{"$f":"A4+1","v":"2001-12-16"},{"$f":"PROPER(TEXT(A5,\"ddd\"))","v":"Sø"},{"$f":"HelligdagsNavn(A5,0,0)","v":""},"13:45:00","21:30:00","00:15:00",0.31250000000000006,null,null,null,{"$f":"ColTime(TIME(18,0,0),TIME(23,0,0),D5,E5)","v":"03:30:00"},null,{"$f":"ColTime(TIME(23,0,0),TIME(6,0,0),D5,E5)","v":"00:00:00"},null,{"$f":"IF(WEEKDAY(A5,2)=6,ColTime(TIME(15,0,0),TIME(24,0,0),D5,E5),\"\")","v":""},null,{"$f":"H5+I5+J5","v":"00:00:00"},null,null,{"$f":"CHOOSE(WEEKDAY(A5,2),norm!C$1,norm!C$2,norm!C$3,norm!C$4,norm!C$5,norm!C$6,norm!C$7)","v":"00:00:00"},null,null,{"$f":"IF(D5=\"\",\"\",HOUR(D5))","v":13},{"$f":"IF(D5=\"\",\"\",MINUTE(D5))","v":45},{"$f":"IF(D5=\"\",\"\",TIME(HOUR(D5),MINUTE(D5),0))","v":"13:45:00"},{"$f":"IF(E5=\"\",\"\",HOUR(E5))","v":21},{"$f":"IF(E5=\"\",\"\",MINUTE(E5))","v":30},{"$f":"IF(E5=\"\",\"\",TIME(HOUR(E5),MINUTE(E5),0))","v":"21:30:00"}]
[{"$f":"A5+1","v":"2001-12-17"},{"$f":"PROPER(TEXT(A6,\"ddd\"))","v":"Ma"},"","22:00:00","05:45:00","00:15:00",0.31250000000000006,null,null,null,{"$f":"ColTime(TIME(18,0,0),TIME(23,0,0),D6,E6)","v":"01:00:00"},null,{"$f":"ColTime(TIME(23,0,0),TIME(6,0,0),D6,E6)","v":"06:45:00"},null,"",null,{"$f":"H6+I6+J6","v":"00:00:00"},null,null,{"$f":"CHOOSE(WEEKDAY(A6,2),norm!C$1,norm!C$2,norm!C$3,norm!C$4,norm!C$5,norm!C$6,norm!C$7)","v":"07:30:00"},null,null,{"$f":"IF(D6=\"\",\"\",HOUR(D6))","v":22},{"$f":"IF(D6=\"\",\"\",MINUTE(D6))","v":0},{"$f":"IF(D6=\"\",\"\",TIME(HOUR(D6),MINUTE(D6),0))","v":"22:00:00"},{"$f":"IF(E6=\"\",\"\",HOUR(E6))","v":5},{"$f":"IF(E6=\"\",\"\",MINUTE(E6))","v":45},{"$f":"IF(E6=\"\",\"\",TIME(HOUR(E6),MINUTE(E6),0))","v":"05:45:00"}]
["2001-12-18","Ti","","05:00:00","12:45:00","00:15:00",0.48958333333333326,"02:00:00","02:00:00","00:15:00","00:00:00",null,"01:00:00",null,"",null,{"$f":"H7+I7+J7","v":"04:15:00"},null,null,{"$f":"CHOOSE(WEEKDAY(A7,2),norm!C$1,norm!C$2,norm!C$3,norm!C$4,norm!C$5,norm!C$6,norm!C$7)","v":"07:30:00"},null,null,{"$f":"IF(D7=\"\",\"\",HOUR(D7))","v":5},{"$f":"IF(D7=\"\",\"\",MINUTE(D7))","v":0},{"$f":"IF(D7=\"\",\"\",TIME(HOUR(D7),MINUTE(D7),0))","v":"05:00:00"},{"$f":"IF(E7=\"\",\"\",HOUR(E7))","v":12},{"$f":"IF(E7=\"\",\"\",MINUTE(E7))","v":45},{"$f":"IF(E7=\"\",\"\",TIME(HOUR(E7),MINUTE(E7),0))","v":"12:45:00"}]
["2001-12-19","On","",null,null,null,"",null,null,null,"00:00:00",null,"00:00:00",null,"",null,{"$f":"H8+I8+J8","v":"00:00:00"},null,null,{"$f":"CHOOSE(WEEKDAY(A8,2),norm!C$1,norm!C$2,norm!C$3,norm!C$4,norm!C$5,norm!C$6,norm!C$7)","v":"07:30:00"},null,null,{"$f":"IF(D8=\"\",\"\",HOUR(D8))","v":""},{"$f":"IF(D8=\"\",\"\",MINUTE(D8))","v":""},{"$f":"IF(D8=\"\",\"\",TIME(HOUR(D8),MINUTE(D8),0))","v":""},{"$f":"IF(E8=\"\",\"\",HOUR(E8))","v":""},{"$f":"IF(E8=\"\",\"\",MINUTE(E8))","v":""},{"$f":"IF(E8=\"\",\"\",TIME(HOUR(E8),MINUTE(E8),0))","v":""}]
["2001-12-20","To","","06:00:00","19:00:00",null,0.54166666666666663,null,null,null,"01:00:00",null,"00:00:00",null,"",null,{"$f":"H9+I9+J9","v":"00:00:00"},null,null,{"$f":"CHOOSE(WEEKDAY(A9,2),norm!C$1,norm!C$2,norm!C$3,norm!C$4,norm!C$5,norm!C$6,norm!C$7)","v":"07:30:00"},null,null,{"$f":"IF(D9=\"\",\"\",HOUR(D9))","v":6},{"$f":"IF(D9=\"\",\"\",MINUTE(D9))","v":0},{"$f":"IF(D9=\"\",\"\",TIME(HOUR(D9),MINUTE(D9),0))","v":"06:00:00"},{"$f":"IF(E9=\"\",\"\",HOUR(E9))","v":19},{"$f":"IF(E9=\"\",\"\",MINUTE(E9))","v":0},{"$f":"IF(E9=\"\",\"\",TIME(HOUR(E9),MINUTE(E9),0))","v":"19:00:00"}]
["2001-12-21","Fr","","07:00:00","19:00:00",null,0.49999999999999994,null,null,null,"01:00:00",null,"00:00:00",null,"",{"$f":"ColTime(TIME(6,0,0),TIME(12,0,0),D10,E10)","v":"05:00:00"},{"$f":"H10+I10+J10","v":"00:00:00"},null,null,{"$f":"CHOOSE(WEEKDAY(A10,2),norm!C$1,norm!C$2,norm!C$3,norm!C$4,norm!C$5,norm!C$6,norm!C$7)","v":"07:00:00"},null,null,{"$f":"IF(D10=\"\",\"\",HOUR(D10))","v":7},{"$f":"IF(D10=\"\",\"\",MINUTE(D10))","v":0},{"$f":"IF(D10=\"\",\"\",TIME(HOUR(D10),MINUTE(D10),0))","v":"07:00:00"},{"$f":"IF(E10=\"\",\"\",HOUR(E10))","v":19},{"$f":"IF(E10=\"\",\"\",MINUTE(E10))","v":0},{"$f":"IF(E10=\"\",\"\",TIME(HOUR(E10),MINUTE(E10),0))","v":"19:00:00"}]
{"$rows_left_out":38}
{"sheet":"Tomt","index":2,"n_rows":45,"n_cols":26,"rows_kept":45,"cut":false,"hidden":false,"merged":[[41,0,41,3],[42,0,42,3],[43,0,43,3],[0,1,0,5],[0,16,0,17],[1,1,1,2],[2,1,2,2],[39,0,39,3],[40,0,40,3]]}
["Løn","1 juni 2010 - 30 juni 2010",null,null,null,null,null,null,null,null,null,null,null,null,null,null,"Time beregning:"]
["Lønart",null,null,null,null,null,3025,3425,3426,3600,3602,3605,3610,9091,9092,null,"Betalt pause ved vagt over 5 timer",null,null,null,"00:25:00","minutter","00:00:00","06:00:00","18:00:00","14:00:00"]
["Dato","Dag",null,"Vagt","Start","Slut","Time SID","Overtid           1-3 time","Overtid            4 - time","Forskudttid alle dage","Nattillæg     00-06","Weekend tillæg","Delt tjenste"]
["2010-04-01",{"$f":"PROPER(TEXT(A4,\"ddd\"))","v":"To"},{"$f":"HelligdagsNavn(A4,0,0)","v":"Skærtorsdag"},null,{"$f":"IF($D4=\"\",\"\",IF(VLOOKUP($D4,#REF!,2)=0,\"\",VLOOKUP($D4,#REF!,2)))","v":""},{"$f":"IF($D4=\"\",\"\",IF(VLOOKUP($D4,#REF!,3)=\"\",\"\",VLOOKUP($D4,#REF!,3)))","v":""},{"$f":"IF($D4=\"\",\"\",VLOOKUP($D4,#REF!,13))","v":""},null,null,{"$f":"IF(E4<>\"\",IF(WEEKDAY(A4,2)<>6,IF(E4>F4,(F4-MAX(E4,(18/24))+(E4>F4))-F4,IF(F4>Y$2,(F4-MAX(E4,(18/24))),\"\")),IF(E4>F4,(F4-MAX(E4,(14/24))+(E4>F4))-F4,IF(F4>Z$2,(F4-MAX(E4,(14/24))),\"\"))),\"\")","v":""},{"$f":"IF(G4<>\"\",IF(S4<X$2,(X$2-S4),IF(V4<X$2,(V4-W$2),\"\")),\"\")","v":""},{"$f":"IF(G4<>0,IF(WEEKDAY(A4,2)=7,G4,\"\"),\"\")","v":""},{"$f":"IF($D4=\"\",\"\",IF(VLOOKUP($D4,#REF!,15)=\"\",\"\",VLOOKUP($D4,#REF!,15)))","v":""},{"$f":"IF(SUM(H4:I4)=0,\"\",SUM(H4:I4))","v":""},null,null,{"$f":"IF(E4=\"\",\"\",HOUR(E4))","v":""},{"$f":"IF(E4=\"\",\"\",MINUTE(E4))","v":""},{"$f":"IF(E4=\"\",\"\",TIME(HOUR(E4),MINUTE(E4),0))","v":""},{"$f":"IF(F4=\"\",\"\",HOUR(F4))","v":""},{"$f":"IF(F4=\"\",\"\",MINUTE(F4))","v":""},{"$f":"TIME(HOUR(F4),MINUTE(F4),0)","v":{"$error":"#VALUE!"}}]
["2010-04-02",{"$f":"PROPER(TEXT(A5,\"ddd\"))","v":"Fr"},{"$f":"HelligdagsNavn(A5,0,0)","v":"Langfredag"},null,{"$f":"IF($D5=\"\",\"\",IF(VLOOKUP($D5,#REF!,2)=0,\"\",VLOOKUP($D5,#REF!,2)))","v":""},{"$f":"IF($D5=\"\",\"\",IF(VLOOKUP($D5,#REF!,3)=\"\",\"\",VLOOKUP($D5,#REF!,3)))","v":""},{"$f":"IF($D5=\"\",\"\",VLOOKUP($D5,#REF!,13))","v":""},null,null,{"$f":"IF(E5<>\"\",IF(WEEKDAY(A5,2)<>6,IF(E5>F5,(F5-MAX(E5,(18/24))+(E5>F5))-F5,IF(F5>Y$2,(F5-MAX(E5,(18/24))),\"\")),IF(E5>F5,(F5-MAX(E5,(14/24))+(E5>F5))-F5,IF(F5>Z$2,(F5-MAX(E5,(14/24))),\"\"))),\"\")","v":""},"",{"$f":"IF(G5<>0,IF(WEEKDAY(A5,2)=7,G5,\"\"),\"\")","v":""},{"$f":"IF($D5=\"\",\"\",IF(VLOOKUP($D5,#REF!,15)=\"\",\"\",VLOOKUP($D5,#REF!,15)))","v":""},{"$f":"IF(SUM(H5:I5)=0,\"\",SUM(H5:I5))","v":""},null,null,"","","","","",{"$f":"TIME(HOUR(F5),MINUTE(F5),0)","v":{"$error":"#VALUE!"}}]
["2010-04-03",{"$f":"PROPER(TEXT(A6,\"ddd\"))","v":"Lø"},"",null,{"$f":"IF($D6=\"\",\"\",IF(VLOOKUP($D6,#REF!,2)=0,\"\",VLOOKUP($D6,#REF!,2)))","v":""},{"$f":"IF($D6=\"\",\"\",IF(VLOOKUP($D6,#REF!,3)=\"\",\"\",VLOOKUP($D6,#REF!,3)))","v":""},{"$f":"IF($D6=\"\",\"\",VLOOKUP($D6,#REF!,13))","v":""},null,null,{"$f":"IF(E6<>\"\",IF(WEEKDAY(A6,2)<>6,IF(E6>F6,(F6-MAX(E6,(18/24))+(E6>F6))-F6,IF(F6>Y$2,(F6-MAX(E6,(18/24))),\"\")),IF(E6>F6,(F6-MAX(E6,(14/24))+(E6>F6))-F6,IF(F6>Z$2,(F6-MAX(E6,(14/24))),\"\"))),\"\")","v":""},"","",{"$f":"IF($D6=\"\",\"\",IF(VLOOKUP($D6,#REF!,15)=\"\",\"\",VLOOKUP($D6,#REF!,15)))","v":""},"",null,null,"","","","","",{"$f":"TIME(HOUR(F6),MINUTE(F6),0)","v":{"$error":"#VALUE!"}}]
["2010-04-04","Sø","Påskedag",null,{"$f":"IF($D7=\"\",\"\",IF(VLOOKUP($D7,#REF!,2)=0,\"\",VLOOKUP($D7,#REF!,2)))","v":""},{"$f":"IF($D7=\"\",\"\",IF(VLOOKUP($D7,#REF!,3)=\"\",\"\",VLOOKUP($D7,#REF!,3)))","v":""},{"$f":"IF($D7=\"\",\"\",VLOOKUP($D7,#REF!,13))","v":""},null,null,"","","",{"$f":"IF($D7=\"\",\"\",IF(VLOOKUP($D7,#REF!,15)=\"\",\"\",VLOOKUP($D7,#REF!,15)))","v":""},"",{"$f":"IF($D7=\"\",\"\",IF(VLOOKUP($D7,#REF!,16)=\"\",\"\",VLOOKUP($D7,#REF!,16)))","v":""},null,"","","","","",{"$f":"TIME(HOUR(F7),MINUTE(F7),0)","v":{"$error":"#VALUE!"}}]
["2010-04-05","Ma","2. Påskedag",null,{"$f":"IF($D8=\"\",\"\",IF(VLOOKUP($D8,#REF!,2)=0,\"\",VLOOKUP($D8,#REF!,2)))","v":""},{"$f":"IF($D8=\"\",\"\",IF(VLOOKUP($D8,#REF!,3)=\"\",\"\",VLOOKUP($D8,#REF!,3)))","v":""},{"$f":"IF($D8=\"\",\"\",VLOOKUP($D8,#REF!,13))","v":""},null,null,"","","",{"$f":"IF($D8=\"\",\"\",IF(VLOOKUP($D8,#REF!,15)=\"\",\"\",VLOOKUP($D8,#REF!,15)))","v":""},"",{"$f":"IF($D8=\"\",\"\",IF(VLOOKUP($D8,#REF!,16)=\"\",\"\",VLOOKUP($D8,#REF!,16)))","v":""},null,"","","","","",{"$f":"TIME(HOUR(F8),MINUTE(F8),0)","v":{"$error":"#VALUE!"}}]
["2010-04-06","Ti","",null,{"$f":"IF($D9=\"\",\"\",IF(VLOOKUP($D9,#REF!,2)=0,\"\",VLOOKUP($D9,#REF!,2)))","v":""},{"$f":"IF($D9=\"\",\"\",IF(VLOOKUP($D9,#REF!,3)=\"\",\"\",VLOOKUP($D9,#REF!,3)))","v":""},{"$f":"IF($D9=\"\",\"\",VLOOKUP($D9,#REF!,13))","v":""},null,null,"","",{"$f":"IF(G9<>0,IF(WEEKDAY(A9,2)=7,G9,\"\"),\"\")","v":""},{"$f":"IF($D9=\"\",\"\",IF(VLOOKUP($D9,#REF!,15)=\"\",\"\",VLOOKUP($D9,#REF!,15)))","v":""},"",{"$f":"IF($D9=\"\",\"\",IF(VLOOKUP($D9,#REF!,16)=\"\",\"\",VLOOKUP($D9,#REF!,16)))","v":""},null,"","","","","",{"$f":"IF(F9=\"\",\"\",TIME(HOUR(F9),MINUTE(F9),0))","v":""}]
["2010-04-07","On","",null,{"$f":"IF($D10=\"\",\"\",IF(VLOOKUP($D10,#REF!,2)=0,\"\",VLOOKUP($D10,#REF!,2)))","v":""},{"$f":"IF($D10=\"\",\"\",IF(VLOOKUP($D10,#REF!,3)=\"\",\"\",VLOOKUP($D10,#REF!,3)))","v":""},{"$f":"IF($D10=\"\",\"\",IF(VLOOKUP($D10,#REF!,13)=\"\",\"\",VLOOKUP($D10,#REF!,13)))","v":""},null,null,"","",{"$f":"IF(G10<>0,IF(WEEKDAY(A10,2)=7,G10,\"\"),\"\")","v":""},{"$f":"IF($D10=\"\",\"\",IF(VLOOKUP($D10,#REF!,15)=\"\",\"\",VLOOKUP($D10,#REF!,15)))","v":""},"",{"$f":"IF($D10=\"\",\"\",IF(VLOOKUP($D10,#REF!,16)=\"\",\"\",VLOOKUP($D10,#REF!,16)))","v":""},null,"","","","","",""]
{"$rows_left_out":36}
{"sheet":"Satser","index":3,"n_rows":26,"n_cols":6,"rows_kept":26,"cut":false,"hidden":false,"merged":[]}
[]
[]
["Timeløn",114.42]
["specielt tillæg"]
["Chauffør tillæg"]
[]
["Samlet timeløn",107.35,null,108.7]
[]
["overtidstillæg 50%",36.35,null,36.5]
["pr. time",{"$f":"B7+B9","v":143.69999999999999}]
{"$rows_left_out":17}
{"sheet":"norm","index":4,"n_rows":7,"n_cols":3,"rows_kept":7,"cut":false,"hidden":false,"merged":[]}
["mandag",7.5,"07:30:00"]
["tirsdag",7.5,"07:30:00"]
["onsdag",7.5,"07:30:00"]
["torsdag",7.5,"07:30:00"]
["fredag",7,"07:00:00"]
["lørdag",0,"00:00:00"]
["søndag",0,"00:00:00"]

{"sheet":"Ark2","index":5,"n_rows":0,"n_cols":0,"rows_kept":0,"cut":false,"hidden":false,"merged":[]}

{"sheet":"Ark3","index":6,"n_rows":0,"n_cols":0,"rows_kept":0,"cut":false,"hidden":false,"merged":[]}