{"text_format":"1","workbook":"xlsx","n_sheets":3,"sheets":["Ark1","Ark2","Ark3"],"not_rendered":{"charts":0,"images":0,"macros":1,"external_links":0,"defined_names":0,"comments":1,"pivot_tables":0},"unopened":[],"bounds":{"document_bytes":16777216,"sheet_cells":100000,"rows_first":2000,"rows_last":500,"rows_between":2000,"halvings":0,"cell_chars":16384,"cell_head_chars":4096},"cells_cut":0,"cells_raw":0,"read":"whole","date_system":"1900"}

{"sheet":"Ark1","index":0,"n_rows":9,"n_cols":14,"rows_kept":9,"cut":false,"hidden":false,"merged":[[0,2,0,4]]}
[null,null,"Dags Dato : ",null,null,{"$f":"TODAY()","v":"2020-10-04"}]
["Personnummer",null,"Fødseldato",null,"Køn","Dødsdato","Alder",null,null,null,null,null,"P-kreatinin : ","eGFR"]
[1010482583,null,{"$f":"IF(A3=\"\",\"\",CPR(A3,\"Dato\"))","v":"1948-10-10"},null,{"$f":"IF(A3=\"\",\"\",CPR(A3,\"Køn\"))","v":"Mand"},"2015-11-16",{"$f":"DATEDIF(CPR(A3,\"Dato\"),IF(F3=\"\",$F$1,F3),\"y\")","v":67},null,null,null,null,null,82,{"$f":"IF(AND(E3=\"kvinde\",M3>62),144*(M3/(0.7*88.4))^-1.209*0.993^G3,IF(AND(E3=\"kvinde\",M3<=62),144*(M3/(0.7*88.4))^-0.329*0.993^G3,IF(AND(E3=\"mand\",M3>80),144*(M3/(0.7*88.4))^-1.209*0.993^G3,IF(AND(E3=\"mand\",M3<=80),144*(M3/(0.7*88.4))^-0.411*0.993^G3,\"test\"))))","v":63.994921774244482}]
[1110752582,null,{"$f":"IF(A4=\"\",\"\",CPR(A4,\"Dato\"))","v":"1975-10-11"},null,{"$f":"IF(A4=\"\",\"\",CPR(A4,\"Køn\"))","v":"Kvinde"},"2015-11-16",{"$f":"DATEDIF(CPR(A4,\"Dato\"),IF(F4=\"\",$F$1,F4),\"y\")","v":40},null,null,null,null,null,61,{"$f":"IF(AND(E4=\"kvinde\",M4>62),144*(M4/(0.7*88.4))^-1.209*0.993^G4,IF(AND(E4=\"kvinde\",M4<=62),144*(M4/(0.7*88.4))^-0.329*0.993^G4,IF(AND(E4=\"mand\",M4>80),144*(M4/(0.7*88.4))^-1.209*0.993^G4,IF(AND(E4=\"mand\",M4<=80),144*(M4/(0.7*88.4))^-0.411*0.993^G4,\"test\"))))","v":109.23931459060485}]
[1112652582,null,{"$f":"IF(A5=\"\",\"\",CPR(A5,\"Dato\"))","v":"1965-12-11"},null,{"$f":"IF(A5=\"\",\"\",CPR(A5,\"Køn\"))","v":"Kvinde"},"2015-11-17",{"$f":"DATEDIF(CPR(A5,\"Dato\"),IF(F5=\"\",$F$1,F5),\"y\")","v":49},null,null,null,null,null,64,{"$f":"IF(AND(E5=\"kvinde\",M5>62),144*(M5/(0.7*88.4))^-1.209*0.993^G5,IF(AND(E5=\"kvinde\",M5<=62),144*(M5/(0.7*88.4))^-0.329*0.993^G5,IF(AND(E5=\"mand\",M5>80),144*(M5/(0.7*88.4))^-1.209*0.993^G5,IF(AND(E5=\"mand\",M5<=80),144*(M5/(0.7*88.4))^-0.411*0.993^G5,\"test\"))))","v":97.991498407153728}]
[406803306,null,{"$f":"IF(A6=\"\",\"\",CPR(A6,\"Dato\"))","v":"1980-06-04"},null,{"$f":"IF(A6=\"\",\"\",CPR(A6,\"Køn\"))","v":"Kvinde"},null,{"$f":"DATEDIF(CPR(A6,\"Dato\"),IF(F6=\"\",$F$1,F6),\"y\")","v":40},null,null,null,null,null,64,{"$f":"IF(AND(E6=\"kvinde\",M6>62),144*(M6/(0.7*88.4))^-1.209*0.993^G6,IF(AND(E6=\"kvinde\",M6<=62),144*(M6/(0.7*88.4))^-0.329*0.993^G6,IF(AND(E6=\"mand\",M6>80),144*(M6/(0.7*88.4))^-1.209*0.993^G6,IF(AND(E6=\"mand\",M6<=80),144*(M6/(0.7*88.4))^-0.411*0.993^G6,\"test\"))))","v":104.3866985068133}]
[209132085,null,{"$f":"IF(A7=\"\",\"\",CPR(A7,\"Dato\"))","v":"1913-09-02"},null,{"$f":"IF(A7=\"\",\"\",CPR(A7,\"Køn\"))","v":"Mand"},"2015-11-19",{"$f":"DATEDIF(CPR(A7,\"Dato\"),IF(F7=\"\",$F$1,F7),\"y\")","v":102},null,null,null,null,null,81,{"$f":"IF(AND(E7=\"kvinde\",M7>62),144*(M7/(0.7*88.4))^-1.209*0.993^G7,IF(AND(E7=\"kvinde\",M7<=62),144*(M7/(0.7*88.4))^-0.329*0.993^G7,IF(AND(E7=\"mand\",M7>80),144*(M7/(0.7*88.4))^-1.209*0.993^G7,IF(AND(E7=\"mand\",M7<=80),144*(M7/(0.7*88.4))^-0.411*0.993^G7,\"test\"))))","v":50.793924556295408}]
[108902063,null,{"$f":"IF(A8=\"\",\"\",CPR(A8,\"Dato\"))","v":"1990-08-01"},null,{"$f":"IF(A8=\"\",\"\",CPR(A8,\"Køn\"))","v":"Mand"},"2015-11-20",{"$f":"DATEDIF(CPR(A8,\"Dato\"),IF(F8=\"\",$F$1,F8),\"y\")","v":25},null,null,null,null,null,79,{"$f":"IF(AND(E8=\"kvinde\",M8>62),144*(M8/(0.7*88.4))^-1.209*0.993^G8,IF(AND(E8=\"kvinde\",M8<=62),144*(M8/(0.7*88.4))^-0.329*0.993^G8,IF(AND(E8=\"mand\",M8>80),144*(M8/(0.7*88.4))^-1.209*0.993^G8,IF(AND(E8=\"mand\",M8<=80),144*(M8/(0.7*88.4))^-0.411*0.993^G8,\"test\"))))","v":109.2687928758443}]
["161155-0851",null,{"$f":"IF(A9=\"\",\"\",CPR(A9,\"Dato\"))","v":"1955-11-16"},null,{"$f":"IF(A9=\"\",\"\",CPR(A9,\"Køn\"))","v":"Mand"},"2015-11-21",{"$f":"DATEDIF(CPR(A9,\"Dato\"),IF(F9=\"\",$F$1,F9),\"y\")","v":60},null,null,null,null,null,64,{"$f":"IF(AND(E9=\"kvinde\",M9>62),144*(M9/(0.7*88.4))^-1.209*0.993^G9,IF(AND(E9=\"kvinde\",M9<=62),144*(M9/(0.7*88.4))^-0.329*0.993^G9,IF(AND(E9=\"mand\",M9>80),144*(M9/(0.7*88.4))^-1.209*0.993^G9,IF(AND(E9=\"mand\",M9<=80),144*(M9/(0.7*88.4))^-0.411*0.993^G9,\"test\"))))","v":93.176117016239061}]

{"sheet":"Ark2","index":1,"n_rows":6,"n_cols":1,"rows_kept":6,"cut":false,"hidden":false,"merged":[]}
[]
[1110752582]
[""]
[406803306]
[209502085]
[108122063]

{"sheet":"Ark3","index":2,"n_rows":0,"n_cols":0,"rows_kept":0,"cut":false,"hidden":false,"merged":[]}