{"text_format":"1","workbook":"xlsx","n_sheets":3,"sheets":["Helligdage","Backend","Tidsreg"],"not_rendered":{"charts":0,"images":0,"macros":1,"external_links":0,"defined_names":1,"comments":0,"pivot_tables":0},"unopened":[],"bounds":{"document_bytes":16777216,"sheet_cells":100000,"rows_first":2000,"rows_last":500,"rows_between":2000,"halvings":0,"cell_chars":16384,"cell_head_chars":4096},"cells_cut":0,"cells_raw":0,"read":"whole","date_system":"1900"}

{"sheet":"Helligdage","index":0,"n_rows":37,"n_cols":13,"rows_kept":37,"cut":false,"hidden":false,"merged":[]}
["Årstal",{"$f":"Tidsreg!K1","v":2022},null,"Type",null,null,null,"X","Årstal",{"$f":"B1","v":2022}]
["Nytårsdag",{"$f":"DATE(B1,1,1)","v":"2017-12-31"},null,"Fast",null,null,null,"A","Rest",{"$f":"MOD(År,19)","v":8}]
["Palmesøndag",{"$f":"B6-7","v":"2018-04-09"},null,"Beregnet"]
["Skærtorsdag",{"$f":"L24","v":"2018-04-13"},null,"Beregnet",null,null,null,"B","Heltal",{"$f":"INT(År/100)","v":20}]
["Langfredag",{"$f":"L25","v":"2018-04-14"},null,"Beregnet",null,null,null,"C","Rest",{"$f":"MOD(År,100)","v":22}]
["Påskedag",{"$f":"L26","v":"2018-04-16"},null,"Beregnet",null,null,null,"D","Heltal",{"$f":"INT(J4/4)","v":5}]
["2. påskedag",{"$f":"L27","v":"2018-04-17"},null,"Beregnet",null,null,null,"E","Rest",{"$f":"MOD(J4,4)","v":0}]
["1. maj",{"$f":"DATE(B1,5,1)","v":"2018-04-30"},null,"Fast"]
["Store Bededag",{"$f":"L31","v":"2018-05-12"},null,"Beregnet",null,null,null,"F","Heltal",{"$f":"INT((J4+8)/25)","v":1}]
["Kristi Himmelfart",{"$f":"L34","v":"2018-05-25"},null,"Beregnet",null,null,null,"G","Heltal",{"$f":"INT((J4-J9+1)/3)","v":6}]
["Pinsedag",{"$f":"L36","v":"2018-06-04"},null,"Beregnet",null,null,null,"H","Heltal",{"$f":"MOD(19*J2+J4-J6-J10+15,30)","v":26}]
["2. pinsedag",{"$f":"L37","v":"2018-06-05"},null,"Beregnet",null,null,null,"J","Heltal",{"$f":"INT(J5/4)","v":5}]
["Grundlovsdag",{"$f":"DATE(B1,6,5)","v":"2018-06-04"},null,"Fast",null,null,null,"K","Rest",{"$f":"MOD(J5,4)","v":2}]
["Juleaften",{"$f":"DATE(B1,12,24)","v":"2018-12-23"},null,"Fast",null,null,null,"L","Rest",{"$f":"MOD(32+2*J7+2*J12-J11-J13,7)","v":0}]
["1. juledag",{"$f":"B14+1","v":"2018-12-24"},null,"Fast",null,null,null,"M","Heltal",{"$f":"INT((J2+11*J11+22*J14)/451)","v":0}]
["2. juledag",{"$f":"B14+2","v":"2018-12-25"},null,"Fast",null,null,null,"N","Heltal",{"$f":"INT((J11+J14-7*J15+114)/31)","v":4}]
["Nytårsaftens dag",{"$f":"DATE(B1,12,31)","v":"2018-12-30"},null,"Fast",null,null,null,"P","Rest",{"$f":"MOD(J11+J14-7*J15+114,31)","v":16}]
["Mors dag",null,null,null,null,null,null,"Q","Formel",{"$f":"(J16-3)*31+J17-20","v":27}]
[]
[null,null,null,null,null,null,null,null,"Dag",{"$f":"J17+1","v":17}]
[null,null,null,null,null,null,null,null,"Måned",{"$f":"J16","v":4}]
[]
[null,null,null,null,null,null,null,null,null,null,"Mellemregning",null,"Diff ift Påskesøndag"]
[null,null,null,null,null,null,null,null,"Skærtorsdag",null,{"$f":"K26-3","v":"2018-04-13"},{"$f":"L26-3","v":"2018-04-13"},-3]
[null,null,null,null,null,null,null,null,"Langfredag",null,{"$f":"K26-2","v":"2018-04-14"},{"$f":"L26-2","v":"2018-04-14"},-2]
[null,null,null,null,null,null,null,null,"Påskedag",null,{"$f":"DATE(År,J21,J20)","v":"2018-04-16"},{"$f":"DATE(År,J21,J20)","v":"2018-04-16"}]
[null,null,null,null,null,null,null,null,"2. påskedag",null,{"$f":"K26+1","v":"2018-04-17"},{"$f":"L26+1","v":"2018-04-17"},1]
[null,null,null,null,null,null,null,null,"1. s.e. påske",null,{"$f":"K26+7","v":"2018-04-23"}]
[null,null,null,null,null,null,null,null,"2. s.e. påske",null,{"$f":"K28+7","v":"2018-04-30"}]
[null,null,null,null,null,null,null,null,"3. s.e. påske",null,{"$f":"K29+7","v":"2018-05-07"}]
[null,null,null,null,null,null,null,null,"Store Bededag",null,{"$f":"K30+5","v":"2018-05-12"},{"$f":"L26+26","v":"2018-05-12"},26]
[null,null,null,null,null,null,null,null,"4. s.e. påske",null,{"$f":"K30+7","v":"2018-05-14"}]
[null,null,null,null,null,null,null,null,"5. s.e. påske",null,{"$f":"K32+7","v":"2018-05-21"}]
[null,null,null,null,null,null,null,null,"Kristi Himmelfart",null,{"$f":"K33+4","v":"2018-05-25"},{"$f":"L26+39","v":"2018-05-25"},39]
[null,null,null,null,null,null,null,null,"6.s.e. påske",null,{"$f":"K33+7","v":"2018-05-28"}]
[null,null,null,null,null,null,null,null,"Pinsedag",null,{"$f":"K35+7","v":"2018-06-04"},{"$f":"L26+49","v":"2018-06-04"},49]
[null,null,null,null,null,null,null,null,"2. pinsedag",null,{"$f":"K36+1","v":"2018-06-05"},{"$f":"L26+50","v":"2018-06-05"},50]

{"sheet":"Backend","index":1,"n_rows":55,"n_cols":15,"rows_kept":55,"cut":false,"hidden":false,"merged":[[1,6,1,10],[8,1,8,3],[16,6,16,10],[29,6,29,10]]}
[]
[null,"År:",{"$f":"Tidsreg!K1","v":2022},null,null,null,"Mødetider",null,null,null,null,null,"Fraværsgrunde. Hvis der tilføjes mere end rammen viser, skal der aktivt ændres i registreringsarket (Ark2)"]
[null,"Navn:",null,null,null,null,"Normtid:","Timer","Efter pause","Timer","Efter pause",null,"Flex-fri",null,"Fravær ændres i Data -> DavaValidering -> vælg Datavalidering i listen."]
[null,"Normaltimer:",37,null,null,null,"Ugedag","Lige uger","Sum","Ulige uger","Sum",null,"Ferie med løn"]
[null,{"$f":"C2-1","v":2021},{"$f":"D5/24","v":-0.17541666666666667},-4.21,null,1,"Mandag","07:24:00",{"$f":"IF(H5>K14,H5-K13,H5)","v":0.30833333333333335},"07:24:00",{"$f":"IF(J5>K14,J5-K13,J5)","v":0.30833333333333335},null,"Feriefridag"]
[null,{"$f":"C2-1","v":2021},3.2034722222222225,null,null,2,"Tirsdag","07:24:00",{"$f":"IF(H6>K14,H6-K13,H6)","v":0.30833333333333335},"07:24:00",{"$f":"IF(J6>K14,J6-K13,J6)","v":0.30833333333333335},null,"Sygdom"]
[null,"Helligdage der falder på hverdage:",{"$f":"SUM(C10:C25)","v":9},null,null,3,"Onsdag","07:24:00",{"$f":"IF(H7>K14,H7-K13,H7)","v":0.30833333333333335},"07:24:00",{"$f":"IF(J7>K14,J7-K13,J7)","v":0.30833333333333335},null,"Hjemmearbejdsdag"]
[null,null,null,null,null,4,"Torsdag","07:24:00",{"$f":"IF(H8>K14,H8-K13,H8)","v":0.30833333333333335},"07:24:00",{"$f":"IF(J8>K14,J8-K13,J8)","v":0.30833333333333335},null,"Kursus/Uddannelse"]
[null,"Årets helligdage og faste fridage",null,null,null,5,"Fredag","07:24:00",{"$f":"IF(H9>K14,H9-K13,H9)","v":0.30833333333333335},"07:24:00",{"$f":"IF(J9>K14,J9-K13,J9)","v":0.30833333333333335},null,"Andet (Skriv under bemærkninger)"]
[null,"Nytårsdag",{"$f":"IF(WEEKDAY(D10,2)<6,1,0)","v":1},"2016-12-31",null,6,"Lørdag","00:00:00",{"$f":"IF(H10>K14,H10-K13,H10)","v":0},"00:00:00",{"$f":"IF(J10>K14,J10-K13,J10)","v":0},null,"Tjenestefri"]
[null,"Palmesøndag",{"$f":"IF(WEEKDAY(D11,2)<6,1,0)","v":0},"2017-03-27",null,7,"Søndag","00:00:00",{"$f":"IF(H11>K14,H11-K13,H11)","v":0},"00:00:00",{"$f":"IF(J11>K14,J11-K13,J11)","v":0},null,"Ferie uden løn"]
[null,"Skærtorsdag",1,"2017-03-31",null,null,"I alt:",{"$f":"SUM(H5:H11)","v":1.5416666666666667},{"$f":"SUM(I5:I11)","v":1.5416666666666667},{"$f":"SUM(J5:J11)","v":1.5416666666666667},{"$f":"SUM(K5:K11)","v":1.5416666666666667},null,"Omsorgsdag"]
[null,"Langfredag",1,"2017-04-01",null,null,"Selvbetalte","Minutter selvbetalt frokost",null,null,0,null,"Barns sygedag"]
[null,"Påskedag",0,"2017-04-03",null,null,"pauser","Medregn ikke hvis arbejdsdag < eller =",null,null,0,null,"Barsel/Orlov"]
[null,"2. Påskedag",1,"2017-04-04"]
[null,"1. maj",0,"2017-04-30"]
[null,"Store Bededag",1,"2017-04-29",null,null,"Telefontider"]
[null,"Kristi Himmelfartsdag",1,"2017-05-12",null,null,"Normtid:","Timer","Efter pause","Timer","Efter pause"]
[null,"Pinsedag",0,"2017-05-22",null,null,"Ugedag","Lige uger","Sum","Ulige uger","Sum"]
[null,"2. Pinsedag",1,"2017-05-23",null,1,"Mandag","08:00:00",{"$f":"H20*0.8","v":0.26666666666666666},"08:00:00",{"$f":"J20*0.8","v":0.26666666666666666}]
[null,"Grundlovsdag",0,"2017-06-04",null,2,"Tirsdag","01:30:00",{"$f":"H21*0.8","v":0.05},"01:30:00",{"$f":"J21*0.8","v":0.05}]
[null,"Juleaftensdag",1,"2017-12-23",null,3,"Onsdag","07:00:00",0.23333333333333336,"07:00:00",0.23333333333333336,null,null,3.2638888888888891E-2]
[null,"Juledag",0,"2017-12-24",null,4,"Torsdag","07:00:00",0.23333333333333336,"07:00:00",0.23333333333333336,null,null,{"$f":"N22*24","v":0.78333333333333344},{"$f":"N23*1.25","v":0.97916666666666674}]
[null,"2. Juledag",0,"2017-12-25",null,5,"Fredag","06:00:00",0.2,"06:00:00",0.2]
[null,"Nytårsaftensdag",{"$f":"IF(WEEKDAY(D25,2)<6,1,0)","v":1},"2017-12-30",null,6,"Lørdag","00:00:00",0,"00:00:00",0,null,"Tid i tt:mm :",26.95,{"$f":"N25*1.25","v":33.6875}]
[null,"Sommertid start",null,{"$f":"DATE(C2,4,1)-WEEKDAY(DATE(C2,4,1)-1,1)","v":"2018-03-26"},null,7,"Søndag","00:00:00",0,"00:00:00",0,null,"Tid i Decimaler :",{"$f":"N25/24","v":1.1229166666666666}]
[null,"Sommertid slut",null,{"$f":"DATE(C2,11,1)-WEEKDAY(DATE(C2,11,1)-1,1)","v":"2018-10-29"},null,null,"I alt:",{"$f":"SUM(H20:H26)","v":1.2291666666666667},0.98333333333333339,{"$f":"SUM(J20:J26)","v":1.2291666666666667},0.98333333333333339]
[null,null,null,null,null,null,null,null,null,null,null,null,"Tid i decimaler :"]
[null,null,null,null,null,null,"Efter d.","01.05.2015",null,null,null,null,"Tid i tt:mm :"]
[null,"Udfyld grønne felter, så det passer med din arbejdstid.",null,null,null,null,"Telefontider"]
[null,null,null,null,null,null,"Normtid:","Timer","Efter pause","Timer","Efter pause"]
[null,"Helligdage",null,null,null,null,"Ugedag","Lige uger","Sum","Ulige uger","Sum"]
[null,null,null,null,null,null,"Mandag","08:00:00",{"$f":"H33*0.8","v":0.26666666666666666},"08:00:00",{"$f":"J33*0.8","v":0.26666666666666666}]
[null,"Følgende dage er helligdage for alle typer medarbejdere:",null,null,null,null,"Tirsdag","01:30:00",{"$f":"H34*0.8","v":0.05},"01:30:00",{"$f":"J34*0.8","v":0.05}]
[null,null,null,null,null,null,"Onsdag","07:00:00",0.23333333333333336,"07:00:00",0.23333333333333336]
[null,"Nytårsdag ",null,null,null,null,"Torsdag","07:00:00",0.23333333333333336,"07:00:00",0.23333333333333336]
[null,"Skærtorsdag ",null,null,null,null,"Fredag","06:00:00",0.2,"06:00:00",0.2]
[null,"Langfredag ",null,null,null,null,"Lørdag","00:00:00",0,"00:00:00",0]
[null,"2. påskedag ",null,null,null,null,"Søndag","00:00:00",0,"00:00:00",0]
[null,"St. Bededag ",null,null,null,null,"I alt:",{"$f":"SUM(H33:H39)","v":1.2291666666666667},0.98333333333333339,{"$f":"SUM(J33:J39)","v":1.2291666666666667},0.98333333333333339]
{"$rows_left_out":16}
{"sheet":"Tidsreg","index":2,"n_rows":376,"n_cols":22,"rows_kept":376,"cut":false,"hidden":false,"merged":[]}
[{"$f":"TODAY()","v":"2017-11-03"},null,null,null,null,null,null,null,null,"Timeregistrering",2022,null,null,null,null,null,null,null,null,null,null,"Række 11 - 376 (375)"]
[]
[null,"Antal dage i året:",{"$f":"COUNTA(C11:C376)","v":365},null,null,null,null,null,null,"Sygedage:",{"$f":"COUNTIF($M$11:$M$376,\"Sygdom\")","v":0},null,null,"Arbejdsdage på kontoret:",{"$f":"SUM(F11:F376)","v":260}]
["Aktuel arbejdsdage i året:","Antal arbejdsdage i året:",{"$f":"COUNTIF(O11:O376,\">0\")","v":0},null,null,null,null,null,null,"Feriedage:",{"$f":"COUNTIF($M$11:$M$376,\"Ferie med løn\")","v":0},null,null,"Arbejdsdage hjemmefra:",{"$f":"SUM(G11:G376)","v":0}]
[null,"Helligdage på hverdage:",{"$f":"SUM(Backend!C10:C27)","v":9},null,null,null,null,null,null,"Feriefridage:",{"$f":"COUNTIF($M$11:$M$376,\"Feriefridag\")","v":0},null,null,"Arbejdsdage i weekender:",{"$f":"SUM(H11:H376)","v":0}]
[null,null,null,null,null,null,null,null,null,"Flexdage:",{"$f":"COUNTIF($M$11:$M$376,\"Flex-fri\")","v":0}]
["Weekend, ferie og helligdage i alt:",null,{"$f":"SUM(D11:E376)","v":105},null,null,null,null,null,null,"Fraværsdage i alt:",{"$f":"SUM(K3:K6)","v":0},null,null,"Arbejdsdage til skattekort i alt:"]
[]
[]
["Måned","Uge","Dato","Weekend og helligdage","Ferie og Flex","Arbejdspladsen","Hjemmefra","Ekstraarbejde","Diverse","Dag","Komme","Gå","Fravær","Bemærkning","Optjent","Decimaltal","Normal","Justering",{"$f":"\"+/-\"","v":"+/-"},"Saldo","Flex","Misc"]
[{"$f":"IF(DAY(C11)=1,C11,\"\")","v":"2017-12-31"},{"$f":"1+INT((C11-DATE(YEAR(C11+4-WEEKDAY(C11+6)),1,5)+WEEKDAY(DATE(YEAR(C11+4-WEEKDAY(C11+6)),1,3)))/7)","v":52},{"$f":"DATE(K1,1,1)","v":"2017-12-31"},{"$f":"IF(OR(WEEKDAY(C11)=1,WEEKDAY(C11)=7),1,\"\")","v":1},{"$f":"IF(OR(M11=\"Feriefridag\",M11=\"Ferie med løn\",M11=\"Flex-fri\"),1,\"\")","v":""},{"$f":"IF(AND(Q11<>\"\",G11=\"\"),1,\"\")","v":""},{"$f":"IF(AND(K11<>\"\",$M11=\"Hjemmearbejdsdag\"),1,\"\")","v":""},{"$f":"IF(AND(D11=1,K11<>\"\"),1,\"\")","v":""},null,{"$f":"IF(HelligdagsNavn(C11,0,0)<>\"\",HelligdagsNavn(C11,0,0),C11)","v":"Nytårsdag"},null,null,null,null,{"$f":"IF(OR(K11=\"\",L11=\"\"),0,IF(VALUE(K11)>=VALUE(L11),(TIME(TRUNC(L11/100),MOD(L11,100),0))+1-(TIME(TRUNC(K11/100),MOD(K11,100),0)),(TIME(TRUNC(L11/100),MOD(L11,100),0))-(TIME(TRUNC(K11/100),MOD(K11,100),0))))","v":0},{"$f":"O11*24","v":0},{"$f":"IF(OR(C11=\"\",D11=1),\"\",VLOOKUP(WEEKDAY($C11,2),Backend!$F$5:$K$11,4,FALSE))","v":""}]
[{"$f":"IF(DAY(C12)=1,C12,\"\")","v":""},{"$f":"IF(WEEKDAY(C12,2)=1,1+INT((C12-DATE(YEAR(C12+4-WEEKDAY(C12+6)),1,5)+WEEKDAY(DATE(YEAR(C12+4-WEEKDAY(C12+6)),1,3)))/7),\"\")","v":""},{"$f":"C11+1","v":"2018-01-01"},{"$f":"IF(OR(WEEKDAY(C12)=1,WEEKDAY(C12)=7),1,\"\")","v":1},{"$f":"IF(OR(M12=\"Feriefridag\",M12=\"Ferie med løn\",M12=\"Flex-fri\"),1,\"\")","v":""},{"$f":"IF(AND(Q12<>\"\",G12=\"\"),1,\"\")","v":""},"",{"$f":"IF(AND(D12=1,K12<>\"\"),1,\"\")","v":""},null,{"$f":"IF(HelligdagsNavn(C12,0,0)<>\"\",HelligdagsNavn(C12,0,0),C12)","v":"2018-01-01"},null,null,null,null,{"$f":"IF(OR(K12=\"\",L12=\"\"),0,IF(VALUE(K12)>=VALUE(L12),(TIME(TRUNC(L12/100),MOD(L12,100),0))+1-(TIME(TRUNC(K12/100),MOD(K12,100),0)),(TIME(TRUNC(L12/100),MOD(L12,100),0))-(TIME(TRUNC(K12/100),MOD(K12,100),0))))","v":0},{"$f":"O12*24","v":0},{"$f":"IF(OR(C12=\"\",D12=1),\"\",VLOOKUP(WEEKDAY($C12,2),Backend!$F$5:$K$11,4,FALSE))","v":""}]
["",1,{"$f":"C12+1","v":"2018-01-02"},"","",{"$f":"IF(AND(Q13<>\"\",G13=\"\"),1,\"\")","v":1},"",{"$f":"IF(AND(D13=1,K13<>\"\"),1,\"\")","v":""},null,{"$f":"IF(HelligdagsNavn(C13,0,0)<>\"\",HelligdagsNavn(C13,0,0),C13)","v":"2018-01-02"},null,null,null,null,0,0,{"$f":"IF(OR(C13=\"\",D13=1),\"\",VLOOKUP(WEEKDAY($C13,2),Backend!$F$5:$K$11,4,FALSE))","v":"07:24:00"}]
["","","2018-01-03","","",{"$f":"IF(AND(Q14<>\"\",G14=\"\"),1,\"\")","v":1},"",{"$f":"IF(AND(D14=1,K14<>\"\"),1,\"\")","v":""},null,{"$f":"IF(HelligdagsNavn(C14,0,0)<>\"\",HelligdagsNavn(C14,0,0),C14)","v":"2018-01-03"},null,null,null,null,0,0,{"$f":"IF(OR(C14=\"\",D14=1),\"\",VLOOKUP(WEEKDAY($C14,2),Backend!$F$5:$K$11,4,FALSE))","v":"07:24:00"}]
["","","2018-01-04","","",{"$f":"IF(AND(Q15<>\"\",G15=\"\"),1,\"\")","v":1},"",{"$f":"IF(AND(D15=1,K15<>\"\"),1,\"\")","v":""},null,{"$f":"IF(HelligdagsNavn(C15,0,0)<>\"\",HelligdagsNavn(C15,0,0),C15)","v":"Hellig Trekongersaften"},null,null,null,null,0,0,{"$f":"IF(OR(C15=\"\",D15=1),\"\",VLOOKUP(WEEKDAY($C15,2),Backend!$F$5:$K$11,4,FALSE))","v":"07:24:00"}]
["","","2018-01-05","","",{"$f":"IF(AND(Q16<>\"\",G16=\"\"),1,\"\")","v":1},{"$f":"IF(AND(K16<>\"\",$M16=\"Hjemmearbejdsdag\"),1,\"\")","v":""},{"$f":"IF(AND(D16=1,K16<>\"\"),1,\"\")","v":""},null,{"$f":"IF(HelligdagsNavn(C16,0,0)<>\"\",HelligdagsNavn(C16,0,0),C16)","v":"Hellig Trekongersdag"},null,null,null,null,0,0,{"$f":"IF(OR(C16=\"\",D16=1),\"\",VLOOKUP(WEEKDAY($C16,2),Backend!$F$5:$K$11,4,FALSE))","v":"07:24:00"}]
["","","2018-01-06","","",{"$f":"IF(AND(Q17<>\"\",G17=\"\"),1,\"\")","v":1},"",{"$f":"IF(AND(D17=1,K17<>\"\"),1,\"\")","v":""},null,{"$f":"IF(HelligdagsNavn(C17,0,0)<>\"\",HelligdagsNavn(C17,0,0),C17)","v":"2018-01-06"},null,null,null,null,0,0,{"$f":"IF(OR(C17=\"\",D17=1),\"\",VLOOKUP(WEEKDAY($C17,2),Backend!$F$5:$K$11,4,FALSE))","v":"07:24:00"}]
["","","2018-01-07",1,"",{"$f":"IF(AND(Q18<>\"\",G18=\"\"),1,\"\")","v":""},"",{"$f":"IF(AND(D18=1,K18<>\"\"),1,\"\")","v":""},null,{"$f":"IF(HelligdagsNavn(C18,0,0)<>\"\",HelligdagsNavn(C18,0,0),C18)","v":"2018-01-07"},null,null,null,null,0,0,{"$f":"IF(OR(C18=\"\",D18=1),\"\",VLOOKUP(WEEKDAY($C18,2),Backend!$F$5:$K$11,4,FALSE))","v":""}]
["","","2018-01-08",1,"",{"$f":"IF(AND(Q19<>\"\",G19=\"\"),1,\"\")","v":""},"",{"$f":"IF(AND(D19=1,K19<>\"\"),1,\"\")","v":""},null,{"$f":"IF(HelligdagsNavn(C19,0,0)<>\"\",HelligdagsNavn(C19,0,0),C19)","v":"2018-01-08"},null,null,null,null,0,0,{"$f":"IF(OR(C19=\"\",D19=1),\"\",VLOOKUP(WEEKDAY($C19,2),Backend!$F$5:$K$11,4,FALSE))","v":""}]
["",2,"2018-01-09","","",{"$f":"IF(AND(Q20<>\"\",G20=\"\"),1,\"\")","v":1},"",{"$f":"IF(AND(D20=1,K20<>\"\"),1,\"\")","v":""},null,{"$f":"IF(HelligdagsNavn(C20,0,0)<>\"\",HelligdagsNavn(C20,0,0),C20)","v":"2018-01-09"},null,null,null,null,0,0,{"$f":"IF(OR(C20=\"\",D20=1),\"\",VLOOKUP(WEEKDAY($C20,2),Backend!$F$5:$K$11,4,FALSE))","v":"07:24:00"}]
["","","2018-01-10","","",{"$f":"IF(AND(Q21<>\"\",G21=\"\"),1,\"\")","v":1},"",{"$f":"IF(AND(D21=1,K21<>\"\"),1,\"\")","v":""},null,{"$f":"IF(HelligdagsNavn(C21,0,0)<>\"\",HelligdagsNavn(C21,0,0),C21)","v":"2018-01-10"},null,null,null,null,0,0,{"$f":"IF(OR(C21=\"\",D21=1),\"\",VLOOKUP(WEEKDAY($C21,2),Backend!$F$5:$K$11,4,FALSE))","v":"07:24:00"}]
["","","2018-01-11","","",{"$f":"IF(AND(Q22<>\"\",G22=\"\"),1,\"\")","v":1},"",{"$f":"IF(AND(D22=1,K22<>\"\"),1,\"\")","v":""},null,{"$f":"IF(HelligdagsNavn(C22,0,0)<>\"\",HelligdagsNavn(C22,0,0),C22)","v":"2018-01-11"},null,null,null,null,0,0,{"$f":"IF(OR(C22=\"\",D22=1),\"\",VLOOKUP(WEEKDAY($C22,2),Backend!$F$5:$K$11,4,FALSE))","v":"07:24:00"}]
["","","2018-01-12","","",{"$f":"IF(AND(Q23<>\"\",G23=\"\"),1,\"\")","v":1},"",{"$f":"IF(AND(D23=1,K23<>\"\"),1,\"\")","v":""},null,{"$f":"IF(HelligdagsNavn(C23,0,0)<>\"\",HelligdagsNavn(C23,0,0),C23)","v":"2018-01-12"},null,null,null,null,0,0,{"$f":"IF(OR(C23=\"\",D23=1),\"\",VLOOKUP(WEEKDAY($C23,2),Backend!$F$5:$K$11,4,FALSE))","v":"07:24:00"}]
["","","2018-01-13","","",{"$f":"IF(AND(Q24<>\"\",G24=\"\"),1,\"\")","v":1},"",{"$f":"IF(AND(D24=1,K24<>\"\"),1,\"\")","v":""},null,{"$f":"IF(HelligdagsNavn(C24,0,0)<>\"\",HelligdagsNavn(C24,0,0),C24)","v":"2018-01-13"},null,null,null,null,0,0,{"$f":"IF(OR(C24=\"\",D24=1),\"\",VLOOKUP(WEEKDAY($C24,2),Backend!$F$5:$K$11,4,FALSE))","v":"07:24:00"}]
["","","2018-01-14",1,"",{"$f":"IF(AND(Q25<>\"\",G25=\"\"),1,\"\")","v":""},"",{"$f":"IF(AND(D25=1,K25<>\"\"),1,\"\")","v":""},null,{"$f":"IF(HelligdagsNavn(C25,0,0)<>\"\",HelligdagsNavn(C25,0,0),C25)","v":"2018-01-14"},null,null,null,null,0,0,{"$f":"IF(OR(C25=\"\",D25=1),\"\",VLOOKUP(WEEKDAY($C25,2),Backend!$F$5:$K$11,4,FALSE))","v":""}]
["","","2018-01-15",1,"",{"$f":"IF(AND(Q26<>\"\",G26=\"\"),1,\"\")","v":""},"",{"$f":"IF(AND(D26=1,K26<>\"\"),1,\"\")","v":""},null,{"$f":"IF(HelligdagsNavn(C26,0,0)<>\"\",HelligdagsNavn(C26,0,0),C26)","v":"2018-01-15"},null,null,null,null,0,0,{"$f":"IF(OR(C26=\"\",D26=1),\"\",VLOOKUP(WEEKDAY($C26,2),Backend!$F$5:$K$11,4,FALSE))","v":""}]
["",3,"2018-01-16","","",{"$f":"IF(AND(Q27<>\"\",G27=\"\"),1,\"\")","v":1},"",{"$f":"IF(AND(D27=1,K27<>\"\"),1,\"\")","v":""},null,{"$f":"IF(HelligdagsNavn(C27,0,0)<>\"\",HelligdagsNavn(C27,0,0),C27)","v":"2018-01-16"},null,null,null,null,0,0,{"$f":"IF(OR(C27=\"\",D27=1),\"\",VLOOKUP(WEEKDAY($C27,2),Backend!$F$5:$K$11,4,FALSE))","v":"07:24:00"}]
["","","2018-01-17","","",{"$f":"IF(AND(Q28<>\"\",G28=\"\"),1,\"\")","v":1},"",{"$f":"IF(AND(D28=1,K28<>\"\"),1,\"\")","v":""},null,{"$f":"IF(HelligdagsNavn(C28,0,0)<>\"\",HelligdagsNavn(C28,0,0),C28)","v":"2018-01-17"},null,null,null,null,0,0,{"$f":"IF(OR(C28=\"\",D28=1),\"\",VLOOKUP(WEEKDAY($C28,2),Backend!$F$5:$K$11,4,FALSE))","v":"07:24:00"}]
["","","2018-01-18","","",{"$f":"IF(AND(Q29<>\"\",G29=\"\"),1,\"\")","v":1},"",{"$f":"IF(AND(D29=1,K29<>\"\"),1,\"\")","v":""},null,{"$f":"IF(HelligdagsNavn(C29,0,0)<>\"\",HelligdagsNavn(C29,0,0),C29)","v":"2018-01-18"},null,null,null,null,0,0,{"$f":"IF(OR(C29=\"\",D29=1),\"\",VLOOKUP(WEEKDAY($C29,2),Backend!$F$5:$K$11,4,FALSE))","v":"07:24:00"}]
["","","2018-01-19","","",{"$f":"IF(AND(Q30<>\"\",G30=\"\"),1,\"\")","v":1},"",{"$f":"IF(AND(D30=1,K30<>\"\"),1,\"\")","v":""},null,{"$f":"IF(HelligdagsNavn(C30,0,0)<>\"\",HelligdagsNavn(C30,0,0),C30)","v":"2018-01-19"},null,null,null,null,0,0,{"$f":"IF(OR(C30=\"\",D30=1),\"\",VLOOKUP(WEEKDAY($C30,2),Backend!$F$5:$K$11,4,FALSE))","v":"07:24:00"}]
["","","2018-01-20","","",{"$f":"IF(AND(Q31<>\"\",G31=\"\"),1,\"\")","v":1},"",{"$f":"IF(AND(D31=1,K31<>\"\"),1,\"\")","v":""},null,{"$f":"IF(HelligdagsNavn(C31,0,0)<>\"\",HelligdagsNavn(C31,0,0),C31)","v":"2018-01-20"},null,null,null,null,0,0,{"$f":"IF(OR(C31=\"\",D31=1),\"\",VLOOKUP(WEEKDAY($C31,2),Backend!$F$5:$K$11,4,FALSE))","v":"07:24:00"}]
["","","2018-01-21",1,"",{"$f":"IF(AND(Q32<>\"\",G32=\"\"),1,\"\")","v":""},"",{"$f":"IF(AND(D32=1,K32<>\"\"),1,\"\")","v":""},null,{"$f":"IF(HelligdagsNavn(C32,0,0)<>\"\",HelligdagsNavn(C32,0,0),C32)","v":"2018-01-21"},null,null,null,null,0,0,{"$f":"IF(OR(C32=\"\",D32=1),\"\",VLOOKUP(WEEKDAY($C32,2),Backend!$F$5:$K$11,4,FALSE))","v":""}]
["","","2018-01-22",1,"",{"$f":"IF(AND(Q33<>\"\",G33=\"\"),1,\"\")","v":""},"",{"$f":"IF(AND(D33=1,K33<>\"\"),1,\"\")","v":""},null,{"$f":"IF(HelligdagsNavn(C33,0,0)<>\"\",HelligdagsNavn(C33,0,0),C33)","v":"2018-01-22"},null,null,null,null,0,0,{"$f":"IF(OR(C33=\"\",D33=1),\"\",VLOOKUP(WEEKDAY($C33,2),Backend!$F$5:$K$11,4,FALSE))","v":""}]
["",4,"2018-01-23","","",{"$f":"IF(AND(Q34<>\"\",G34=\"\"),1,\"\")","v":1},"",{"$f":"IF(AND(D34=1,K34<>\"\"),1,\"\")","v":""},null,{"$f":"IF(HelligdagsNavn(C34,0,0)<>\"\",HelligdagsNavn(C34,0,0),C34)","v":"2018-01-23"},null,null,null,null,0,0,{"$f":"IF(OR(C34=\"\",D34=1),\"\",VLOOKUP(WEEKDAY($C34,2),Backend!$F$5:$K$11,4,FALSE))","v":"07:24:00"}]
["","","2018-01-24","","",{"$f":"IF(AND(Q35<>\"\",G35=\"\"),1,\"\")","v":1},"",{"$f":"IF(AND(D35=1,K35<>\"\"),1,\"\")","v":""},null,{"$f":"IF(HelligdagsNavn(C35,0,0)<>\"\",HelligdagsNavn(C35,0,0),C35)","v":"2018-01-24"},null,null,null,null,0,0,{"$f":"IF(OR(C35=\"\",D35=1),\"\",VLOOKUP(WEEKDAY($C35,2),Backend!$F$5:$K$11,4,FALSE))","v":"07:24:00"}]
["","","2018-01-25","","",{"$f":"IF(AND(Q36<>\"\",G36=\"\"),1,\"\")","v":1},"",{"$f":"IF(AND(D36=1,K36<>\"\"),1,\"\")","v":""},null,{"$f":"IF(HelligdagsNavn(C36,0,0)<>\"\",HelligdagsNavn(C36,0,0),C36)","v":"2018-01-25"},null,null,null,null,0,0,{"$f":"IF(OR(C36=\"\",D36=1),\"\",VLOOKUP(WEEKDAY($C36,2),Backend!$F$5:$K$11,4,FALSE))","v":"07:24:00"}]
["","","2018-01-26","","",{"$f":"IF(AND(Q37<>\"\",G37=\"\"),1,\"\")","v":1},"",{"$f":"IF(AND(D37=1,K37<>\"\"),1,\"\")","v":""},null,{"$f":"IF(HelligdagsNavn(C37,0,0)<>\"\",HelligdagsNavn(C37,0,0),C37)","v":"2018-01-26"},null,null,null,null,0,0,{"$f":"IF(OR(C37=\"\",D37=1),\"\",VLOOKUP(WEEKDAY($C37,2),Backend!$F$5:$K$11,4,FALSE))","v":"07:24:00"}]
["","","2018-01-27","","",{"$f":"IF(AND(Q38<>\"\",G38=\"\"),1,\"\")","v":1},"",{"$f":"IF(AND(D38=1,K38<>\"\"),1,\"\")","v":""},null,{"$f":"IF(HelligdagsNavn(C38,0,0)<>\"\",HelligdagsNavn(C38,0,0),C38)","v":"2018-01-27"},null,null,null,null,0,0,{"$f":"IF(OR(C38=\"\",D38=1),\"\",VLOOKUP(WEEKDAY($C38,2),Backend!$F$5:$K$11,4,FALSE))","v":"07:24:00"}]
["","","2018-01-28",1,"",{"$f":"IF(AND(Q39<>\"\",G39=\"\"),1,\"\")","v":""},"",{"$f":"IF(AND(D39=1,K39<>\"\"),1,\"\")","v":""},null,{"$f":"IF(HelligdagsNavn(C39,0,0)<>\"\",HelligdagsNavn(C39,0,0),C39)","v":"2018-01-28"},null,null,null,null,0,0,{"$f":"IF(OR(C39=\"\",D39=1),\"\",VLOOKUP(WEEKDAY($C39,2),Backend!$F$5:$K$11,4,FALSE))","v":""}]
["","","2018-01-29",1,"",{"$f":"IF(AND(Q40<>\"\",G40=\"\"),1,\"\")","v":""},"",{"$f":"IF(AND(D40=1,K40<>\"\"),1,\"\")","v":""},null,{"$f":"IF(HelligdagsNavn(C40,0,0)<>\"\",HelligdagsNavn(C40,0,0),C40)","v":"2018-01-29"},null,null,null,null,0,0,{"$f":"IF(OR(C40=\"\",D40=1),\"\",VLOOKUP(WEEKDAY($C40,2),Backend!$F$5:$K$11,4,FALSE))","v":""}]
{"$rows_left_out":336}