{"text_format":"1","workbook":"xlsx","n_sheets":3,"sheets":["Helligdage","Backend","Tidsreg"],"not_rendered":{"charts":0,"images":0,"macros":1,"external_links":0,"defined_names":1,"comments":0,"pivot_tables":0},"unopened":[],"bounds":{"document_bytes":16777216,"sheet_cells":100000,"rows_first":2000,"rows_last":500,"rows_between":2000,"halvings":0,"cell_chars":16384,"cell_head_chars":4096},"cells_cut":0,"cells_raw":0,"read":"whole","date_system":"1900"}

{"sheet":"Helligdage","index":0,"n_rows":37,"n_cols":13,"rows_kept":37,"cut":false,"hidden":false,"merged":[]}
["Årstal",{"$f":"Tidsreg!K1","v":2022},null,"Type",null,null,null,"X","Årstal",{"$f":"B1","v":2022}]
["Nytårsdag",{"$f":"DATE(B1,1,1)","v":"2017-12-31"},null,"Fast",null,null,null,"A","Rest",{"$f":"MOD(År,19)","v":8}]
["Palmesøndag",{"$f":"B6-7","v":"2018-04-09"},null,"Beregnet"]
["Skærtorsdag",{"$f":"L24","v":"2018-04-13"},null,"Beregnet",null,null,null,"B","Heltal",{"$f":"INT(År/100)","v":20}]
["Langfredag",{"$f":"L25","v":"2018-04-14"},null,"Beregnet",null,null,null,"C","Rest",{"$f":"MOD(År,100)","v":22}]
["Påskedag",{"$f":"L26","v":"2018-04-16"},null,"Beregnet",null,null,null,"D","Heltal",{"$f":"INT(J4/4)","v":5}]
["2. påskedag",{"$f":"L27","v":"2018-04-17"},null,"Beregnet",null,null,null,"E","Rest",{"$f":"MOD(J4,4)","v":0}]
["1. maj",{"$f":"DATE(B1,5,1)","v":"2018-04-30"},null,"Fast"]
["Store Bededag",{"$f":"L31","v":"2018-05-12"},null,"Beregnet",null,null,null,"F","Heltal",{"$f":"INT((J4+8)/25)","v":1}]
["Kristi Himmelfart",{"$f":"L34","v":"2018-05-25"},null,"Beregnet",null,null,null,"G","Heltal",{"$f":"INT((J4-J9+1)/3)","v":6}]
["Pinsedag",{"$f":"L36","v":"2018-06-04"},null,"Beregnet",null,null,null,"H","Heltal",{"$f":"MOD(19*J2+J4-J6-J10+15,30)","v":26}]
["2. pinsedag",{"$f":"L37","v":"2018-06-05"},null,"Beregnet",null,null,null,"J","Heltal",{"$f":"INT(J5/4)","v":5}]
["Grundlovsdag",{"$f":"DATE(B1,6,5)","v":"2018-06-04"},null,"Fast",null,null,null,"K","Rest",{"$f":"MOD(J5,4)","v":2}]
["Juleaften",{"$f":"DATE(B1,12,24)","v":"2018-12-23"},null,"Fast",null,null,null,"L","Rest",{"$f":"MOD(32+2*J7+2*J12-J11-J13,7)","v":0}]
["1. juledag",{"$f":"B14+1","v":"2018-12-24"},null,"Fast",null,null,null,"M","Heltal",{"$f":"INT((J2+11*J11+22*J14)/451)","v":0}]
["2. juledag",{"$f":"B14+2","v":"2018-12-25"},null,"Fast",null,null,null,"N","Heltal",{"$f":"INT((J11+J14-7*J15+114)/31)","v":4}]
["Nytårsaftens dag",{"$f":"DATE(B1,12,31)","v":"2018-12-30"},null,"Fast",null,null,null,"P","Rest",{"$f":"MOD(J11+J14-7*J15+114,31)","v":16}]
["Mors dag",null,null,null,null,null,null,"Q","Formel",{"$f":"(J16-3)*31+J17-20","v":27}]
[]
[null,null,null,null,null,null,null,null,"Dag",{"$f":"J17+1","v":17}]
[null,null,null,null,null,null,null,null,"Måned",{"$f":"J16","v":4}]
[]
[null,null,null,null,null,null,null,null,null,null,"Mellemregning",null,"Diff ift Påskesøndag"]
[null,null,null,null,null,null,null,null,"Skærtorsdag",null,{"$f":"K26-3","v":"2018-04-13"},{"$f":"L26-3","v":"2018-04-13"},-3]
[null,null,null,null,null,null,null,null,"Langfredag",null,{"$f":"K26-2","v":"2018-04-14"},{"$f":"L26-2","v":"2018-04-14"},-2]
[null,null,null,null,null,null,null,null,"Påskedag",null,{"$f":"DATE(År,J21,J20)","v":"2018-04-16"},{"$f":"DATE(År,J21,J20)","v":"2018-04-16"}]
[null,null,null,null,null,null,null,null,"2. påskedag",null,{"$f":"K26+1","v":"2018-04-17"},{"$f":"L26+1","v":"2018-04-17"},1]
[null,null,null,null,null,null,null,null,"1. s.e. påske",null,{"$f":"K26+7","v":"2018-04-23"}]
[null,null,null,null,null,null,null,null,"2. s.e. påske",null,{"$f":"K28+7","v":"2018-04-30"}]
[null,null,null,null,null,null,null,null,"3. s.e. påske",null,{"$f":"K29+7","v":"2018-05-07"}]
[null,null,null,null,null,null,null,null,"Store Bededag",null,{"$f":"K30+5","v":"2018-05-12"},{"$f":"L26+26","v":"2018-05-12"},26]
[null,null,null,null,null,null,null,null,"4. s.e. påske",null,{"$f":"K30+7","v":"2018-05-14"}]
[null,null,null,null,null,null,null,null,"5. s.e. påske",null,{"$f":"K32+7","v":"2018-05-21"}]
[null,null,null,null,null,null,null,null,"Kristi Himmelfart",null,{"$f":"K33+4","v":"2018-05-25"},{"$f":"L26+39","v":"2018-05-25"},39]
[null,null,null,null,null,null,null,null,"6.s.e. påske",null,{"$f":"K33+7","v":"2018-05-28"}]
[null,null,null,null,null,null,null,null,"Pinsedag",null,{"$f":"K35+7","v":"2018-06-04"},{"$f":"L26+49","v":"2018-06-04"},49]
[null,null,null,null,null,null,null,null,"2. pinsedag",null,{"$f":"K36+1","v":"2018-06-05"},{"$f":"L26+50","v":"2018-06-05"},50]

{"sheet":"Backend","index":1,"n_rows":55,"n_cols":15,"rows_kept":55,"cut":false,"hidden":false,"merged":[[1,6,1,10],[8,1,8,3],[16,6,16,10],[29,6,29,10]]}
[]
[null,"År:",{"$f":"Tidsreg!K1","v":2022},null,null,null,"Mødetider",null,null,null,null,null,"Fraværsgrunde. Hvis der tilføjes mere end rammen viser, skal der aktivt ændres i registreringsarket (Ark2)"]
[null,"Navn:",null,null,null,null,"Normtid:","Timer","Efter pause","Timer","Efter pause",null,"Flex-fri",null,"Fravær ændres i Data -> DavaValidering -> vælg Datavalidering i listen."]
[null,"Normaltimer:",37,null,null,null,"Ugedag","Lige uger","Sum","Ulige uger","Sum",null,"Ferie med løn"]
[null,{"$f":"C2-1","v":2021},{"$f":"D5/24","v":-0.17541666666666667},-4.21,null,1,"Mandag","07:24:00",{"$f":"IF(H5>K14,H5-K13,H5)","v":0.30833333333333335},"07:24:00",{"$f":"IF(J5>K14,J5-K13,J5)","v":0.30833333333333335},null,"Feriefridag"]
[null,{"$f":"C2-1","v":2021},3.2034722222222225,null,null,2,"Tirsdag","07:24:00",{"$f":"IF(H6>K14,H6-K13,H6)","v":0.30833333333333335},"07:24:00",{"$f":"IF(J6>K14,J6-K13,J6)","v":0.30833333333333335},null,"Sygdom"]
[null,"Helligdage der falder på hverdage:",{"$f":"SUM(C10:C25)","v":9},null,null,3,"Onsdag","07:24:00",{"$f":"IF(H7>K14,H7-K13,H7)","v":0.30833333333333335},"07:24:00",{"$f":"IF(J7>K14,J7-K13,J7)","v":0.30833333333333335},null,"Hjemmearbejdsdag"]
[null,null,null,null,null,4,"Torsdag","07:24:00",{"$f":"IF(H8>K14,H8-K13,H8)","v":0.30833333333333335},"07:24:00",{"$f":"IF(J8>K14,J8-K13,J8)","v":0.30833333333333335},null,"Kursus/Uddannelse"]
[null,"Årets helligdage og faste fridage",null,null,null,5,"Fredag","07:24:00",{"$f":"IF(H9>K14,H9-K13,H9)","v":0.30833333333333335},"07:24:00",{"$f":"IF(J9>K14,J9-K13,J9)","v":0.30833333333333335},null,"Andet (Skriv under bemærkninger)"]
[null,"Nytårsdag",{"$f":"IF(WEEKDAY(D10,2)<6,1,0)","v":1},"2016-12-31",null,6,"Lørdag","00:00:00",{"$f":"IF(H10>K14,H10-K13,H10)","v":0},"00:00:00",{"$f":"IF(J10>K14,J10-K13,J10)","v":0},null,"Tjenestefri"]
[null,"Palmesøndag",{"$f":"IF(WEEKDAY(D11,2)<6,1,0)","v":0},"2017-03-27",null,7,"Søndag","00:00:00",{"$f":"IF(H11>K14,H11-K13,H11)","v":0},"00:00:00",{"$f":"IF(J11>K14,J11-K13,J11)","v":0},null,"Ferie uden løn"]
[null,"Skærtorsdag",1,"2017-03-31",null,null,"I alt:",{"$f":"SUM(H5:H11)","v":1.5416666666666667},{"$f":"SUM(I5:I11)","v":1.5416666666666667},{"$f":"SUM(J5:J11)","v":1.5416666666666667},{"$f":"SUM(K5:K11)","v":1.5416666666666667},null,"Omsorgsdag"]
[null,"Langfredag",1,"2017-04-01",null,null,"Selvbetalte","Minutter selvbetalt frokost",null,null,0,null,"Barns sygedag"]
[null,"Påskedag",0,"2017-04-03",null,null,"pauser","Medregn ikke hvis arbejdsdag < eller =",null,null,0,null,"Barsel/Orlov"]
[null,"2. Påskedag",1,"2017-04-04"]
[null,"1. maj",0,"2017-04-30"]
[null,"Store Bededag",1,"2017-04-29",null,null,"Telefontider"]
[null,"Kristi Himmelfartsdag",1,"2017-05-12",null,null,"Normtid:","Timer","Efter pause","Timer","Efter pause"]
[null,"Pinsedag",0,"2017-05-22",null,null,"Ugedag","Lige uger","Sum","Ulige uger","Sum"]
[null,"2. Pinsedag",1,"2017-05-23",null,1,"Mandag","08:00:00",{"$f":"H20*0.8","v":0.26666666666666666},"08:00:00",{"$f":"J20*0.8","v":0.26666666666666666}]
[null,"Grundlovsdag",0,"2017-06-04",null,2,"Tirsdag","01:30:00",{"$f":"H21*0.8","v":0.05},"01:30:00",{"$f":"J21*0.8","v":0.05}]
[null,"Juleaftensdag",1,"2017-12-23",null,3,"Onsdag","07:00:00",0.23333333333333336,"07:00:00",0.23333333333333336,null,null,3.2638888888888891E-2]
[null,"Juledag",0,"2017-12-24",null,4,"Torsdag","07:00:00",0.23333333333333336,"07:00:00",0.23333333333333336,null,null,{"$f":"N22*24","v":0.78333333333333344},{"$f":"N23*1.25","v":0.97916666666666674}]
[null,"2. Juledag",0,"2017-12-25",null,5,"Fredag","06:00:00",0.2,"06:00:00",0.2]
[null,"Nytårsaftensdag",{"$f":"IF(WEEKDAY(D25,2)<6,1,0)","v":1},"2017-12-30",null,6,"Lørdag","00:00:00",0,"00:00:00",0,null,"Tid i tt:mm :",26.95,{"$f":"N25*1.25","v":33.6875}]
[null,"Sommertid start",null,{"$f":"DATE(C2,4,1)-WEEKDAY(DATE(C2,4,1)-1,1)","v":"2018-03-26"},null,7,"Søndag","00:00:00",0,"00:00:00",0,null,"Tid i Decimaler :",{"$f":"N25/24","v":1.1229166666666666}]
[null,"Sommertid slut",null,{"$f":"DATE(C2,11,1)-WEEKDAY(DATE(C2,11,1)-1,1)","v":"2018-10-29"},null,null,"I alt:",{"$f":"SUM(H20:H26)","v":1.2291666666666667},0.98333333333333339,{"$f":"SUM(J20:J26)","v":1.2291666666666667},0.98333333333333339]
[null,null,null,null,null,null,null,null,null,null,null,null,"Tid i decimaler :"]
[null,null,null,null,null,null,"Efter d.","01.05.2015",null,null,null,null,"Tid i tt:mm :"]
[null,"Udfyld grønne felter, så det passer med din arbejdstid.",null,null,null,null,"Telefontider"]
[null,null,null,null,null,null,"Normtid:","Timer","Efter pause","Timer","Efter pause"]
[null,"Helligdage",null,null,null,null,"Ugedag","Lige uger","Sum","Ulige uger","Sum"]
[null,null,null,null,null,null,"Mandag","08:00:00",{"$f":"H33*0.8","v":0.26666666666666666},"08:00:00",{"$f":"J33*0.8","v":0.26666666666666666}]
[null,"Følgende dage er helligdage for alle typer medarbejdere:",null,null,null,null,"Tirsdag","01:30:00",{"$f":"H34*0.8","v":0.05},"01:30:00",{"$f":"J34*0.8","v":0.05}]
[null,null,null,null,null,null,"Onsdag","07:00:00",0.23333333333333336,"07:00:00",0.23333333333333336]
[null,"Nytårsdag ",null,null,null,null,"Torsdag","07:00:00",0.23333333333333336,"07:00:00",0.23333333333333336]
[null,"Skærtorsdag ",null,null,null,null,"Fredag","06:00:00",0.2,"06:00:00",0.2]
[null,"Langfredag ",null,null,null,null,"Lørdag","00:00:00",0,"00:00:00",0]
[null,"2. påskedag ",null,null,null,null,"Søndag","00:00:00",0,"00:00:00",0]
[null,"St. Bededag ",null,null,null,null,"I alt:",{"$f":"SUM(H33:H39)","v":1.2291666666666667},0.98333333333333339,{"$f":"SUM(J33:J39)","v":1.2291666666666667},0.98333333333333339]
[null,"Kristi Himmelfart "]
[null,"2. pinsedag "]
[null,"1. og 2. juledag."]
[]
[null,"Medarbejdere omfattet af Industriens Overenskomst"]
[]
[null,"Medarbejdere der er omfattet af Industriens Overenskomst har som udgangspunkt fri på ovenstående helligdage."]
[]
[null,"Herudover er følgende dage fridage efter overenskomsten:"]
[]
[null,"1. maj "]
[null,"Grundlovsdag "]
[null,"24. december."]
[]
[null,"Fridagene regnes fra klokken 06.00 eller fra normal daglig arbejdstids begyndelse til samme tidspunkt næste dag."]

{"sheet":"Tidsreg","index":2,"n_rows":376,"n_cols":22,"rows_kept":376,"cut":false,"hidden":false,"merged":[]}
[{"$f":"TODAY()","v":"2017-11-03"},null,null,null,null,null,null,null,null,"Timeregistrering",2022,null,null,null,null,null,null,null,null,null,null,"Række 11 - 376 (375)"]
[]
[null,"Antal dage i året:",{"$f":"COUNTA(C11:C376)","v":365},null,null,null,null,null,null,"Sygedage:",{"$f":"COUNTIF($M$11:$M$376,\"Sygdom\")","v":0},null,null,"Arbejdsdage på kontoret:",{"$f":"SUM(F11:F376)","v":260}]
["Aktuel arbejdsdage i året:","Antal arbejdsdage i året:",{"$f":"COUNTIF(O11:O376,\">0\")","v":0},null,null,null,null,null,null,"Feriedage:",{"$f":"COUNTIF($M$11:$M$376,\"Ferie med løn\")","v":0},null,null,"Arbejdsdage hjemmefra:",{"$f":"SUM(G11:G376)","v":0}]
[null,"Helligdage på hverdage:",{"$f":"SUM(Backend!C10:C27)","v":9},null,null,null,null,null,null,"Feriefridage:",{"$f":"COUNTIF($M$11:$M$376,\"Feriefridag\")","v":0},null,null,"Arbejdsdage i weekender:",{"$f":"SUM(H11:H376)","v":0}]
[null,null,null,null,null,null,null,null,null,"Flexdage:",{"$f":"COUNTIF($M$11:$M$376,\"Flex-fri\")","v":0}]
["Weekend, ferie og helligdage i alt:",null,{"$f":"SUM(D11:E376)","v":105},null,null,null,null,null,null,"Fraværsdage i alt:",{"$f":"SUM(K3:K6)","v":0},null,null,"Arbejdsdage til skattekort i alt:"]
[]
[]
["Måned","Uge","Dato","Weekend og helligdage","Ferie og Flex","Arbejdspladsen","Hjemmefra","Ekstraarbejde","Diverse","Dag","Komme","Gå","Fravær","Bemærkning","Optjent","Decimaltal","Normal","Justering",{"$f":"\"+/-\"","v":"+/-"},"Saldo","Flex","Misc"]
[{"$f":"IF(DAY(C11)=1,C11,\"\")","v":"2017-12-31"},{"$f":"1+INT((C11-DATE(YEAR(C11+4-WEEKDAY(C11+6)),1,5)+WEEKDAY(DATE(YEAR(C11+4-WEEKDAY(C11+6)),1,3)))/7)","v":52},{"$f":"DATE(K1,1,1)","v":"2017-12-31"},{"$f":"IF(OR(WEEKDAY(C11)=1,WEEKDAY(C11)=7),1,\"\")","v":1},{"$f":"IF(OR(M11=\"Feriefridag\",M11=\"Ferie med løn\",M11=\"Flex-fri\"),1,\"\")","v":""},{"$f":"IF(AND(Q11<>\"\",G11=\"\"),1,\"\")","v":""},{"$f":"IF(AND(K11<>\"\",$M11=\"Hjemmearbejdsdag\"),1,\"\")","v":""},{"$f":"IF(AND(D11=1,K11<>\"\"),1,\"\")","v":""},null,{"$f":"IF(HelligdagsNavn(C11,0,0)<>\"\",HelligdagsNavn(C11,0,0),C11)","v":"Nytårsdag"},null,null,null,null,{"$f":"IF(OR(K11=\"\",L11=\"\"),0,IF(VALUE(K11)>=VALUE(L11),(TIME(TRUNC(L11/100),MOD(L11,100),0))+1-(TIME(TRUNC(K11/100),MOD(K11,100),0)),(TIME(TRUNC(L11/100),MOD(L11,100),0))-(TIME(TRUNC(K11/100),MOD(K11,100),0))))","v":0},{"$f":"O11*24","v":0},{"$f":"IF(OR(C11=\"\",D11=1),\"\",VLOOKUP(WEEKDAY($C11,2),Backend!$F$5:$K$11,4,FALSE))","v":""}]
[{"$f":"IF(DAY(C12)=1,C12,\"\")","v":""},{"$f":"IF(WEEKDAY(C12,2)=1,1+INT((C12-DATE(YEAR(C12+4-WEEKDAY(C12+6)),1,5)+WEEKDAY(DATE(YEAR(C12+4-WEEKDAY(C12+6)),1,3)))/7),\"\")","v":""},{"$f":"C11+1","v":"2018-01-01"},{"$f":"IF(OR(WEEKDAY(C12)=1,WEEKDAY(C12)=7),1,\"\")","v":1},{"$f":"IF(OR(M12=\"Feriefridag\",M12=\"Ferie med løn\",M12=\"Flex-fri\"),1,\"\")","v":""},{"$f":"IF(AND(Q12<>\"\",G12=\"\"),1,\"\")","v":""},"",{"$f":"IF(AND(D12=1,K12<>\"\"),1,\"\")","v":""},null,{"$f":"IF(HelligdagsNavn(C12,0,0)<>\"\",HelligdagsNavn(C12,0,0),C12)","v":"2018-01-01"},null,null,null,null,{"$f":"IF(OR(K12=\"\",L12=\"\"),0,IF(VALUE(K12)>=VALUE(L12),(TIME(TRUNC(L12/100),MOD(L12,100),0))+1-(TIME(TRUNC(K12/100),MOD(K12,100),0)),(TIME(TRUNC(L12/100),MOD(L12,100),0))-(TIME(TRUNC(K12/100),MOD(K12,100),0))))","v":0},{"$f":"O12*24","v":0},{"$f":"IF(OR(C12=\"\",D12=1),\"\",VLOOKUP(WEEKDAY($C12,2),Backend!$F$5:$K$11,4,FALSE))","v":""}]
["",1,{"$f":"C12+1","v":"2018-01-02"},"","",{"$f":"IF(AND(Q13<>\"\",G13=\"\"),1,\"\")","v":1},"",{"$f":"IF(AND(D13=1,K13<>\"\"),1,\"\")","v":""},null,{"$f":"IF(HelligdagsNavn(C13,0,0)<>\"\",HelligdagsNavn(C13,0,0),C13)","v":"2018-01-02"},null,null,null,null,0,0,{"$f":"IF(OR(C13=\"\",D13=1),\"\",VLOOKUP(WEEKDAY($C13,2),Backend!$F$5:$K$11,4,FALSE))","v":"07:24:00"}]
["","","2018-01-03","","",{"$f":"IF(AND(Q14<>\"\",G14=\"\"),1,\"\")","v":1},"",{"$f":"IF(AND(D14=1,K14<>\"\"),1,\"\")","v":""},null,{"$f":"IF(HelligdagsNavn(C14,0,0)<>\"\",HelligdagsNavn(C14,0,0),C14)","v":"2018-01-03"},null,null,null,null,0,0,{"$f":"IF(OR(C14=\"\",D14=1),\"\",VLOOKUP(WEEKDAY($C14,2),Backend!$F$5:$K$11,4,FALSE))","v":"07:24:00"}]
["","","2018-01-04","","",{"$f":"IF(AND(Q15<>\"\",G15=\"\"),1,\"\")","v":1},"",{"$f":"IF(AND(D15=1,K15<>\"\"),1,\"\")","v":""},null,{"$f":"IF(HelligdagsNavn(C15,0,0)<>\"\",HelligdagsNavn(C15,0,0),C15)","v":"Hellig Trekongersaften"},null,null,null,null,0,0,{"$f":"IF(OR(C15=\"\",D15=1),\"\",VLOOKUP(WEEKDAY($C15,2),Backend!$F$5:$K$11,4,FALSE))","v":"07:24:00"}]
["","","2018-01-05","","",{"$f":"IF(AND(Q16<>\"\",G16=\"\"),1,\"\")","v":1},{"$f":"IF(AND(K16<>\"\",$M16=\"Hjemmearbejdsdag\"),1,\"\")","v":""},{"$f":"IF(AND(D16=1,K16<>\"\"),1,\"\")","v":""},null,{"$f":"IF(HelligdagsNavn(C16,0,0)<>\"\",HelligdagsNavn(C16,0,0),C16)","v":"Hellig Trekongersdag"},null,null,null,null,0,0,{"$f":"IF(OR(C16=\"\",D16=1),\"\",VLOOKUP(WEEKDAY($C16,2),Backend!$F$5:$K$11,4,FALSE))","v":"07:24:00"}]
["","","2018-01-06","","",{"$f":"IF(AND(Q17<>\"\",G17=\"\"),1,\"\")","v":1},"",{"$f":"IF(AND(D17=1,K17<>\"\"),1,\"\")","v":""},null,{"$f":"IF(HelligdagsNavn(C17,0,0)<>\"\",HelligdagsNavn(C17,0,0),C17)","v":"2018-01-06"},null,null,null,null,0,0,{"$f":"IF(OR(C17=\"\",D17=1),\"\",VLOOKUP(WEEKDAY($C17,2),Backend!$F$5:$K$11,4,FALSE))","v":"07:24:00"}]
["","","2018-01-07",1,"",{"$f":"IF(AND(Q18<>\"\",G18=\"\"),1,\"\")","v":""},"",{"$f":"IF(AND(D18=1,K18<>\"\"),1,\"\")","v":""},null,{"$f":"IF(HelligdagsNavn(C18,0,0)<>\"\",HelligdagsNavn(C18,0,0),C18)","v":"2018-01-07"},null,null,null,null,0,0,{"$f":"IF(OR(C18=\"\",D18=1),\"\",VLOOKUP(WEEKDAY($C18,2),Backend!$F$5:$K$11,4,FALSE))","v":""}]
["","","2018-01-08",1,"",{"$f":"IF(AND(Q19<>\"\",G19=\"\"),1,\"\")","v":""},"",{"$f":"IF(AND(D19=1,K19<>\"\"),1,\"\")","v":""},null,{"$f":"IF(HelligdagsNavn(C19,0,0)<>\"\",HelligdagsNavn(C19,0,0),C19)","v":"2018-01-08"},null,null,null,null,0,0,{"$f":"IF(OR(C19=\"\",D19=1),\"\",VLOOKUP(WEEKDAY($C19,2),Backend!$F$5:$K$11,4,FALSE))","v":""}]
["",2,"2018-01-09","","",{"$f":"IF(AND(Q20<>\"\",G20=\"\"),1,\"\")","v":1},"",{"$f":"IF(AND(D20=1,K20<>\"\"),1,\"\")","v":""},null,{"$f":"IF(HelligdagsNavn(C20,0,0)<>\"\",HelligdagsNavn(C20,0,0),C20)","v":"2018-01-09"},null,null,null,null,0,0,{"$f":"IF(OR(C20=\"\",D20=1),\"\",VLOOKUP(WEEKDAY($C20,2),Backend!$F$5:$K$11,4,FALSE))","v":"07:24:00"}]
["","","2018-01-10","","",{"$f":"IF(AND(Q21<>\"\",G21=\"\"),1,\"\")","v":1},"",{"$f":"IF(AND(D21=1,K21<>\"\"),1,\"\")","v":""},null,{"$f":"IF(HelligdagsNavn(C21,0,0)<>\"\",HelligdagsNavn(C21,0,0),C21)","v":"2018-01-10"},null,null,null,null,0,0,{"$f":"IF(OR(C21=\"\",D21=1),\"\",VLOOKUP(WEEKDAY($C21,2),Backend!$F$5:$K$11,4,FALSE))","v":"07:24:00"}]
["","","2018-01-11","","",{"$f":"IF(AND(Q22<>\"\",G22=\"\"),1,\"\")","v":1},"",{"$f":"IF(AND(D22=1,K22<>\"\"),1,\"\")","v":""},null,{"$f":"IF(HelligdagsNavn(C22,0,0)<>\"\",HelligdagsNavn(C22,0,0),C22)","v":"2018-01-11"},null,null,null,null,0,0,{"$f":"IF(OR(C22=\"\",D22=1),\"\",VLOOKUP(WEEKDAY($C22,2),Backend!$F$5:$K$11,4,FALSE))","v":"07:24:00"}]
["","","2018-01-12","","",{"$f":"IF(AND(Q23<>\"\",G23=\"\"),1,\"\")","v":1},"",{"$f":"IF(AND(D23=1,K23<>\"\"),1,\"\")","v":""},null,{"$f":"IF(HelligdagsNavn(C23,0,0)<>\"\",HelligdagsNavn(C23,0,0),C23)","v":"2018-01-12"},null,null,null,null,0,0,{"$f":"IF(OR(C23=\"\",D23=1),\"\",VLOOKUP(WEEKDAY($C23,2),Backend!$F$5:$K$11,4,FALSE))","v":"07:24:00"}]
["","","2018-01-13","","",{"$f":"IF(AND(Q24<>\"\",G24=\"\"),1,\"\")","v":1},"",{"$f":"IF(AND(D24=1,K24<>\"\"),1,\"\")","v":""},null,{"$f":"IF(HelligdagsNavn(C24,0,0)<>\"\",HelligdagsNavn(C24,0,0),C24)","v":"2018-01-13"},null,null,null,null,0,0,{"$f":"IF(OR(C24=\"\",D24=1),\"\",VLOOKUP(WEEKDAY($C24,2),Backend!$F$5:$K$11,4,FALSE))","v":"07:24:00"}]
["","","2018-01-14",1,"",{"$f":"IF(AND(Q25<>\"\",G25=\"\"),1,\"\")","v":""},"",{"$f":"IF(AND(D25=1,K25<>\"\"),1,\"\")","v":""},null,{"$f":"IF(HelligdagsNavn(C25,0,0)<>\"\",HelligdagsNavn(C25,0,0),C25)","v":"2018-01-14"},null,null,null,null,0,0,{"$f":"IF(OR(C25=\"\",D25=1),\"\",VLOOKUP(WEEKDAY($C25,2),Backend!$F$5:$K$11,4,FALSE))","v":""}]
["","","2018-01-15",1,"",{"$f":"IF(AND(Q26<>\"\",G26=\"\"),1,\"\")","v":""},"",{"$f":"IF(AND(D26=1,K26<>\"\"),1,\"\")","v":""},null,{"$f":"IF(HelligdagsNavn(C26,0,0)<>\"\",HelligdagsNavn(C26,0,0),C26)","v":"2018-01-15"},null,null,null,null,0,0,{"$f":"IF(OR(C26=\"\",D26=1),\"\",VLOOKUP(WEEKDAY($C26,2),Backend!$F$5:$K$11,4,FALSE))","v":""}]
["",3,"2018-01-16","","",{"$f":"IF(AND(Q27<>\"\",G27=\"\"),1,\"\")","v":1},"",{"$f":"IF(AND(D27=1,K27<>\"\"),1,\"\")","v":""},null,{"$f":"IF(HelligdagsNavn(C27,0,0)<>\"\",HelligdagsNavn(C27,0,0),C27)","v":"2018-01-16"},null,null,null,null,0,0,{"$f":"IF(OR(C27=\"\",D27=1),\"\",VLOOKUP(WEEKDAY($C27,2),Backend!$F$5:$K$11,4,FALSE))","v":"07:24:00"}]
["","","2018-01-17","","",{"$f":"IF(AND(Q28<>\"\",G28=\"\"),1,\"\")","v":1},"",{"$f":"IF(AND(D28=1,K28<>\"\"),1,\"\")","v":""},null,{"$f":"IF(HelligdagsNavn(C28,0,0)<>\"\",HelligdagsNavn(C28,0,0),C28)","v":"2018-01-17"},null,null,null,null,0,0,{"$f":"IF(OR(C28=\"\",D28=1),\"\",VLOOKUP(WEEKDAY($C28,2),Backend!$F$5:$K$11,4,FALSE))","v":"07:24:00"}]
["","","2018-01-18","","",{"$f":"IF(AND(Q29<>\"\",G29=\"\"),1,\"\")","v":1},"",{"$f":"IF(AND(D29=1,K29<>\"\"),1,\"\")","v":""},null,{"$f":"IF(HelligdagsNavn(C29,0,0)<>\"\",HelligdagsNavn(C29,0,0),C29)","v":"2018-01-18"},null,null,null,null,0,0,{"$f":"IF(OR(C29=\"\",D29=1),\"\",VLOOKUP(WEEKDAY($C29,2),Backend!$F$5:$K$11,4,FALSE))","v":"07:24:00"}]
["","","2018-01-19","","",{"$f":"IF(AND(Q30<>\"\",G30=\"\"),1,\"\")","v":1},"",{"$f":"IF(AND(D30=1,K30<>\"\"),1,\"\")","v":""},null,{"$f":"IF(HelligdagsNavn(C30,0,0)<>\"\",HelligdagsNavn(C30,0,0),C30)","v":"2018-01-19"},null,null,null,null,0,0,{"$f":"IF(OR(C30=\"\",D30=1),\"\",VLOOKUP(WEEKDAY($C30,2),Backend!$F$5:$K$11,4,FALSE))","v":"07:24:00"}]
["","","2018-01-20","","",{"$f":"IF(AND(Q31<>\"\",G31=\"\"),1,\"\")","v":1},"",{"$f":"IF(AND(D31=1,K31<>\"\"),1,\"\")","v":""},null,{"$f":"IF(HelligdagsNavn(C31,0,0)<>\"\",HelligdagsNavn(C31,0,0),C31)","v":"2018-01-20"},null,null,null,null,0,0,{"$f":"IF(OR(C31=\"\",D31=1),\"\",VLOOKUP(WEEKDAY($C31,2),Backend!$F$5:$K$11,4,FALSE))","v":"07:24:00"}]
["","","2018-01-21",1,"",{"$f":"IF(AND(Q32<>\"\",G32=\"\"),1,\"\")","v":""},"",{"$f":"IF(AND(D32=1,K32<>\"\"),1,\"\")","v":""},null,{"$f":"IF(HelligdagsNavn(C32,0,0)<>\"\",HelligdagsNavn(C32,0,0),C32)","v":"2018-01-21"},null,null,null,null,0,0,{"$f":"IF(OR(C32=\"\",D32=1),\"\",VLOOKUP(WEEKDAY($C32,2),Backend!$F$5:$K$11,4,FALSE))","v":""}]
["","","2018-01-22",1,"",{"$f":"IF(AND(Q33<>\"\",G33=\"\"),1,\"\")","v":""},"",{"$f":"IF(AND(D33=1,K33<>\"\"),1,\"\")","v":""},null,{"$f":"IF(HelligdagsNavn(C33,0,0)<>\"\",HelligdagsNavn(C33,0,0),C33)","v":"2018-01-22"},null,null,null,null,0,0,{"$f":"IF(OR(C33=\"\",D33=1),\"\",VLOOKUP(WEEKDAY($C33,2),Backend!$F$5:$K$11,4,FALSE))","v":""}]
["",4,"2018-01-23","","",{"$f":"IF(AND(Q34<>\"\",G34=\"\"),1,\"\")","v":1},"",{"$f":"IF(AND(D34=1,K34<>\"\"),1,\"\")","v":""},null,{"$f":"IF(HelligdagsNavn(C34,0,0)<>\"\",HelligdagsNavn(C34,0,0),C34)","v":"2018-01-23"},null,null,null,null,0,0,{"$f":"IF(OR(C34=\"\",D34=1),\"\",VLOOKUP(WEEKDAY($C34,2),Backend!$F$5:$K$11,4,FALSE))","v":"07:24:00"}]
["","","2018-01-24","","",{"$f":"IF(AND(Q35<>\"\",G35=\"\"),1,\"\")","v":1},"",{"$f":"IF(AND(D35=1,K35<>\"\"),1,\"\")","v":""},null,{"$f":"IF(HelligdagsNavn(C35,0,0)<>\"\",HelligdagsNavn(C35,0,0),C35)","v":"2018-01-24"},null,null,null,null,0,0,{"$f":"IF(OR(C35=\"\",D35=1),\"\",VLOOKUP(WEEKDAY($C35,2),Backend!$F$5:$K$11,4,FALSE))","v":"07:24:00"}]
["","","2018-01-25","","",{"$f":"IF(AND(Q36<>\"\",G36=\"\"),1,\"\")","v":1},"",{"$f":"IF(AND(D36=1,K36<>\"\"),1,\"\")","v":""},null,{"$f":"IF(HelligdagsNavn(C36,0,0)<>\"\",HelligdagsNavn(C36,0,0),C36)","v":"2018-01-25"},null,null,null,null,0,0,{"$f":"IF(OR(C36=\"\",D36=1),\"\",VLOOKUP(WEEKDAY($C36,2),Backend!$F$5:$K$11,4,FALSE))","v":"07:24:00"}]
["","","2018-01-26","","",{"$f":"IF(AND(Q37<>\"\",G37=\"\"),1,\"\")","v":1},"",{"$f":"IF(AND(D37=1,K37<>\"\"),1,\"\")","v":""},null,{"$f":"IF(HelligdagsNavn(C37,0,0)<>\"\",HelligdagsNavn(C37,0,0),C37)","v":"2018-01-26"},null,null,null,null,0,0,{"$f":"IF(OR(C37=\"\",D37=1),\"\",VLOOKUP(WEEKDAY($C37,2),Backend!$F$5:$K$11,4,FALSE))","v":"07:24:00"}]
["","","2018-01-27","","",{"$f":"IF(AND(Q38<>\"\",G38=\"\"),1,\"\")","v":1},"",{"$f":"IF(AND(D38=1,K38<>\"\"),1,\"\")","v":""},null,{"$f":"IF(HelligdagsNavn(C38,0,0)<>\"\",HelligdagsNavn(C38,0,0),C38)","v":"2018-01-27"},null,null,null,null,0,0,{"$f":"IF(OR(C38=\"\",D38=1),\"\",VLOOKUP(WEEKDAY($C38,2),Backend!$F$5:$K$11,4,FALSE))","v":"07:24:00"}]
["","","2018-01-28",1,"",{"$f":"IF(AND(Q39<>\"\",G39=\"\"),1,\"\")","v":""},"",{"$f":"IF(AND(D39=1,K39<>\"\"),1,\"\")","v":""},null,{"$f":"IF(HelligdagsNavn(C39,0,0)<>\"\",HelligdagsNavn(C39,0,0),C39)","v":"2018-01-28"},null,null,null,null,0,0,{"$f":"IF(OR(C39=\"\",D39=1),\"\",VLOOKUP(WEEKDAY($C39,2),Backend!$F$5:$K$11,4,FALSE))","v":""}]
["","","2018-01-29",1,"",{"$f":"IF(AND(Q40<>\"\",G40=\"\"),1,\"\")","v":""},"",{"$f":"IF(AND(D40=1,K40<>\"\"),1,\"\")","v":""},null,{"$f":"IF(HelligdagsNavn(C40,0,0)<>\"\",HelligdagsNavn(C40,0,0),C40)","v":"2018-01-29"},null,null,null,null,0,0,{"$f":"IF(OR(C40=\"\",D40=1),\"\",VLOOKUP(WEEKDAY($C40,2),Backend!$F$5:$K$11,4,FALSE))","v":""}]
["",5,"2018-01-30","","",{"$f":"IF(AND(Q41<>\"\",G41=\"\"),1,\"\")","v":1},"",{"$f":"IF(AND(D41=1,K41<>\"\"),1,\"\")","v":""},null,{"$f":"IF(HelligdagsNavn(C41,0,0)<>\"\",HelligdagsNavn(C41,0,0),C41)","v":"2018-01-30"},null,null,null,null,0,0,{"$f":"IF(OR(C41=\"\",D41=1),\"\",VLOOKUP(WEEKDAY($C41,2),Backend!$F$5:$K$11,4,FALSE))","v":"07:24:00"}]
["2018-01-31","","2018-01-31","","",{"$f":"IF(AND(Q42<>\"\",G42=\"\"),1,\"\")","v":1},"",{"$f":"IF(AND(D42=1,K42<>\"\"),1,\"\")","v":""},null,{"$f":"IF(HelligdagsNavn(C42,0,0)<>\"\",HelligdagsNavn(C42,0,0),C42)","v":"2018-01-31"},null,null,null,null,0,0,{"$f":"IF(OR(C42=\"\",D42=1),\"\",VLOOKUP(WEEKDAY($C42,2),Backend!$F$5:$K$11,4,FALSE))","v":"07:24:00"}]
["","","2018-02-01","","",{"$f":"IF(AND(Q43<>\"\",G43=\"\"),1,\"\")","v":1},"",{"$f":"IF(AND(D43=1,K43<>\"\"),1,\"\")","v":""},null,{"$f":"IF(HelligdagsNavn(C43,0,0)<>\"\",HelligdagsNavn(C43,0,0),C43)","v":"Kyndelmisse"},null,null,null,null,0,0,{"$f":"IF(OR(C43=\"\",D43=1),\"\",VLOOKUP(WEEKDAY($C43,2),Backend!$F$5:$K$11,4,FALSE))","v":"07:24:00"}]
["","","2018-02-02","","",{"$f":"IF(AND(Q44<>\"\",G44=\"\"),1,\"\")","v":1},"",{"$f":"IF(AND(D44=1,K44<>\"\"),1,\"\")","v":""},null,{"$f":"IF(HelligdagsNavn(C44,0,0)<>\"\",HelligdagsNavn(C44,0,0),C44)","v":"2018-02-02"},null,null,null,null,0,0,{"$f":"IF(OR(C44=\"\",D44=1),\"\",VLOOKUP(WEEKDAY($C44,2),Backend!$F$5:$K$11,4,FALSE))","v":"07:24:00"}]
["","","2018-02-03","","",{"$f":"IF(AND(Q45<>\"\",G45=\"\"),1,\"\")","v":1},"",{"$f":"IF(AND(D45=1,K45<>\"\"),1,\"\")","v":""},null,{"$f":"IF(HelligdagsNavn(C45,0,0)<>\"\",HelligdagsNavn(C45,0,0),C45)","v":"2018-02-03"},null,null,null,null,0,0,{"$f":"IF(OR(C45=\"\",D45=1),\"\",VLOOKUP(WEEKDAY($C45,2),Backend!$F$5:$K$11,4,FALSE))","v":"07:24:00"}]
["","","2018-02-04",1,"",{"$f":"IF(AND(Q46<>\"\",G46=\"\"),1,\"\")","v":""},"",{"$f":"IF(AND(D46=1,K46<>\"\"),1,\"\")","v":""},null,{"$f":"IF(HelligdagsNavn(C46,0,0)<>\"\",HelligdagsNavn(C46,0,0),C46)","v":"2018-02-04"},null,null,null,null,0,0,{"$f":"IF(OR(C46=\"\",D46=1),\"\",VLOOKUP(WEEKDAY($C46,2),Backend!$F$5:$K$11,4,FALSE))","v":""}]
["","","2018-02-05",1,"",{"$f":"IF(AND(Q47<>\"\",G47=\"\"),1,\"\")","v":""},"",{"$f":"IF(AND(D47=1,K47<>\"\"),1,\"\")","v":""},null,{"$f":"IF(HelligdagsNavn(C47,0,0)<>\"\",HelligdagsNavn(C47,0,0),C47)","v":"2018-02-05"},null,null,null,null,0,0,{"$f":"IF(OR(C47=\"\",D47=1),\"\",VLOOKUP(WEEKDAY($C47,2),Backend!$F$5:$K$11,4,FALSE))","v":""}]
["",6,"2018-02-06","","",{"$f":"IF(AND(Q48<>\"\",G48=\"\"),1,\"\")","v":1},"",{"$f":"IF(AND(D48=1,K48<>\"\"),1,\"\")","v":""},null,{"$f":"IF(HelligdagsNavn(C48,0,0)<>\"\",HelligdagsNavn(C48,0,0),C48)","v":"2018-02-06"},null,null,null,null,0,0,{"$f":"IF(OR(C48=\"\",D48=1),\"\",VLOOKUP(WEEKDAY($C48,2),Backend!$F$5:$K$11,4,FALSE))","v":"07:24:00"}]
["","","2018-02-07","","",{"$f":"IF(AND(Q49<>\"\",G49=\"\"),1,\"\")","v":1},"",{"$f":"IF(AND(D49=1,K49<>\"\"),1,\"\")","v":""},null,{"$f":"IF(HelligdagsNavn(C49,0,0)<>\"\",HelligdagsNavn(C49,0,0),C49)","v":"2018-02-07"},null,null,null,null,0,0,{"$f":"IF(OR(C49=\"\",D49=1),\"\",VLOOKUP(WEEKDAY($C49,2),Backend!$F$5:$K$11,4,FALSE))","v":"07:24:00"}]
["","","2018-02-08","","",{"$f":"IF(AND(Q50<>\"\",G50=\"\"),1,\"\")","v":1},"",{"$f":"IF(AND(D50=1,K50<>\"\"),1,\"\")","v":""},null,{"$f":"IF(HelligdagsNavn(C50,0,0)<>\"\",HelligdagsNavn(C50,0,0),C50)","v":"2018-02-08"},null,null,null,null,0,0,{"$f":"IF(OR(C50=\"\",D50=1),\"\",VLOOKUP(WEEKDAY($C50,2),Backend!$F$5:$K$11,4,FALSE))","v":"07:24:00"}]
["","","2018-02-09","","",{"$f":"IF(AND(Q51<>\"\",G51=\"\"),1,\"\")","v":1},"",{"$f":"IF(AND(D51=1,K51<>\"\"),1,\"\")","v":""},null,{"$f":"IF(HelligdagsNavn(C51,0,0)<>\"\",HelligdagsNavn(C51,0,0),C51)","v":"2018-02-09"},null,null,null,null,0,0,{"$f":"IF(OR(C51=\"\",D51=1),\"\",VLOOKUP(WEEKDAY($C51,2),Backend!$F$5:$K$11,4,FALSE))","v":"07:24:00"}]
["","","2018-02-10","","",{"$f":"IF(AND(Q52<>\"\",G52=\"\"),1,\"\")","v":1},"",{"$f":"IF(AND(D52=1,K52<>\"\"),1,\"\")","v":""},null,{"$f":"IF(HelligdagsNavn(C52,0,0)<>\"\",HelligdagsNavn(C52,0,0),C52)","v":"2018-02-10"},null,null,null,null,0,0,{"$f":"IF(OR(C52=\"\",D52=1),\"\",VLOOKUP(WEEKDAY($C52,2),Backend!$F$5:$K$11,4,FALSE))","v":"07:24:00"}]
["","","2018-02-11",1,"",{"$f":"IF(AND(Q53<>\"\",G53=\"\"),1,\"\")","v":""},"",{"$f":"IF(AND(D53=1,K53<>\"\"),1,\"\")","v":""},null,{"$f":"IF(HelligdagsNavn(C53,0,0)<>\"\",HelligdagsNavn(C53,0,0),C53)","v":"2018-02-11"},null,null,null,null,0,0,{"$f":"IF(OR(C53=\"\",D53=1),\"\",VLOOKUP(WEEKDAY($C53,2),Backend!$F$5:$K$11,4,FALSE))","v":""}]
["","","2018-02-12",1,"",{"$f":"IF(AND(Q54<>\"\",G54=\"\"),1,\"\")","v":""},"",{"$f":"IF(AND(D54=1,K54<>\"\"),1,\"\")","v":""},null,{"$f":"IF(HelligdagsNavn(C54,0,0)<>\"\",HelligdagsNavn(C54,0,0),C54)","v":"2018-02-12"},null,null,null,null,0,0,{"$f":"IF(OR(C54=\"\",D54=1),\"\",VLOOKUP(WEEKDAY($C54,2),Backend!$F$5:$K$11,4,FALSE))","v":""}]
["",7,"2018-02-13","","",{"$f":"IF(AND(Q55<>\"\",G55=\"\"),1,\"\")","v":1},"",{"$f":"IF(AND(D55=1,K55<>\"\"),1,\"\")","v":""},null,{"$f":"IF(HelligdagsNavn(C55,0,0)<>\"\",HelligdagsNavn(C55,0,0),C55)","v":"Valentinsdag"},null,null,null,null,0,0,{"$f":"IF(OR(C55=\"\",D55=1),\"\",VLOOKUP(WEEKDAY($C55,2),Backend!$F$5:$K$11,4,FALSE))","v":"07:24:00"}]
["","","2018-02-14","","",{"$f":"IF(AND(Q56<>\"\",G56=\"\"),1,\"\")","v":1},"",{"$f":"IF(AND(D56=1,K56<>\"\"),1,\"\")","v":""},null,{"$f":"IF(HelligdagsNavn(C56,0,0)<>\"\",HelligdagsNavn(C56,0,0),C56)","v":"2018-02-14"},null,null,null,null,0,0,{"$f":"IF(OR(C56=\"\",D56=1),\"\",VLOOKUP(WEEKDAY($C56,2),Backend!$F$5:$K$11,4,FALSE))","v":"07:24:00"}]
["","","2018-02-15","","",{"$f":"IF(AND(Q57<>\"\",G57=\"\"),1,\"\")","v":1},"",{"$f":"IF(AND(D57=1,K57<>\"\"),1,\"\")","v":""},null,{"$f":"IF(HelligdagsNavn(C57,0,0)<>\"\",HelligdagsNavn(C57,0,0),C57)","v":"2018-02-15"},null,null,null,null,0,0,{"$f":"IF(OR(C57=\"\",D57=1),\"\",VLOOKUP(WEEKDAY($C57,2),Backend!$F$5:$K$11,4,FALSE))","v":"07:24:00"}]
["","","2018-02-16","","",{"$f":"IF(AND(Q58<>\"\",G58=\"\"),1,\"\")","v":1},"",{"$f":"IF(AND(D58=1,K58<>\"\"),1,\"\")","v":""},null,{"$f":"IF(HelligdagsNavn(C58,0,0)<>\"\",HelligdagsNavn(C58,0,0),C58)","v":"2018-02-16"},null,null,null,null,0,0,{"$f":"IF(OR(C58=\"\",D58=1),\"\",VLOOKUP(WEEKDAY($C58,2),Backend!$F$5:$K$11,4,FALSE))","v":"07:24:00"}]
["","","2018-02-17","","",{"$f":"IF(AND(Q59<>\"\",G59=\"\"),1,\"\")","v":1},"",{"$f":"IF(AND(D59=1,K59<>\"\"),1,\"\")","v":""},null,{"$f":"IF(HelligdagsNavn(C59,0,0)<>\"\",HelligdagsNavn(C59,0,0),C59)","v":"2018-02-17"},null,null,null,null,0,0,{"$f":"IF(OR(C59=\"\",D59=1),\"\",VLOOKUP(WEEKDAY($C59,2),Backend!$F$5:$K$11,4,FALSE))","v":"07:24:00"}]
["","","2018-02-18",1,"",{"$f":"IF(AND(Q60<>\"\",G60=\"\"),1,\"\")","v":""},"",{"$f":"IF(AND(D60=1,K60<>\"\"),1,\"\")","v":""},null,{"$f":"IF(HelligdagsNavn(C60,0,0)<>\"\",HelligdagsNavn(C60,0,0),C60)","v":"2018-02-18"},null,null,null,null,0,0,{"$f":"IF(OR(C60=\"\",D60=1),\"\",VLOOKUP(WEEKDAY($C60,2),Backend!$F$5:$K$11,4,FALSE))","v":""}]
["","","2018-02-19",1,"",{"$f":"IF(AND(Q61<>\"\",G61=\"\"),1,\"\")","v":""},"",{"$f":"IF(AND(D61=1,K61<>\"\"),1,\"\")","v":""},null,{"$f":"IF(HelligdagsNavn(C61,0,0)<>\"\",HelligdagsNavn(C61,0,0),C61)","v":"2018-02-19"},null,null,null,null,0,0,{"$f":"IF(OR(C61=\"\",D61=1),\"\",VLOOKUP(WEEKDAY($C61,2),Backend!$F$5:$K$11,4,FALSE))","v":""}]
["",8,"2018-02-20","","",{"$f":"IF(AND(Q62<>\"\",G62=\"\"),1,\"\")","v":1},"",{"$f":"IF(AND(D62=1,K62<>\"\"),1,\"\")","v":""},null,{"$f":"IF(HelligdagsNavn(C62,0,0)<>\"\",HelligdagsNavn(C62,0,0),C62)","v":"2018-02-20"},null,null,null,null,0,0,{"$f":"IF(OR(C62=\"\",D62=1),\"\",VLOOKUP(WEEKDAY($C62,2),Backend!$F$5:$K$11,4,FALSE))","v":"07:24:00"}]
["","","2018-02-21","","",{"$f":"IF(AND(Q63<>\"\",G63=\"\"),1,\"\")","v":1},"",{"$f":"IF(AND(D63=1,K63<>\"\"),1,\"\")","v":""},null,{"$f":"IF(HelligdagsNavn(C63,0,0)<>\"\",HelligdagsNavn(C63,0,0),C63)","v":"2018-02-21"},null,null,null,null,0,0,{"$f":"IF(OR(C63=\"\",D63=1),\"\",VLOOKUP(WEEKDAY($C63,2),Backend!$F$5:$K$11,4,FALSE))","v":"07:24:00"}]
["","","2018-02-22","","",{"$f":"IF(AND(Q64<>\"\",G64=\"\"),1,\"\")","v":1},"",{"$f":"IF(AND(D64=1,K64<>\"\"),1,\"\")","v":""},null,{"$f":"IF(HelligdagsNavn(C64,0,0)<>\"\",HelligdagsNavn(C64,0,0),C64)","v":"2018-02-22"},null,null,null,null,0,0,{"$f":"IF(OR(C64=\"\",D64=1),\"\",VLOOKUP(WEEKDAY($C64,2),Backend!$F$5:$K$11,4,FALSE))","v":"07:24:00"}]
["","","2018-02-23","","",{"$f":"IF(AND(Q65<>\"\",G65=\"\"),1,\"\")","v":1},"",{"$f":"IF(AND(D65=1,K65<>\"\"),1,\"\")","v":""},null,{"$f":"IF(HelligdagsNavn(C65,0,0)<>\"\",HelligdagsNavn(C65,0,0),C65)","v":"2018-02-23"},null,null,null,null,0,0,{"$f":"IF(OR(C65=\"\",D65=1),\"\",VLOOKUP(WEEKDAY($C65,2),Backend!$F$5:$K$11,4,FALSE))","v":"07:24:00"}]
["","","2018-02-24","","",{"$f":"IF(AND(Q66<>\"\",G66=\"\"),1,\"\")","v":1},"",{"$f":"IF(AND(D66=1,K66<>\"\"),1,\"\")","v":""},null,{"$f":"IF(HelligdagsNavn(C66,0,0)<>\"\",HelligdagsNavn(C66,0,0),C66)","v":"2018-02-24"},null,null,null,null,0,0,{"$f":"IF(OR(C66=\"\",D66=1),\"\",VLOOKUP(WEEKDAY($C66,2),Backend!$F$5:$K$11,4,FALSE))","v":"07:24:00"}]
["","","2018-02-25",1,"",{"$f":"IF(AND(Q67<>\"\",G67=\"\"),1,\"\")","v":""},"",{"$f":"IF(AND(D67=1,K67<>\"\"),1,\"\")","v":""},null,{"$f":"IF(HelligdagsNavn(C67,0,0)<>\"\",HelligdagsNavn(C67,0,0),C67)","v":"2018-02-25"},null,null,null,null,0,0,{"$f":"IF(OR(C67=\"\",D67=1),\"\",VLOOKUP(WEEKDAY($C67,2),Backend!$F$5:$K$11,4,FALSE))","v":""}]
["","","2018-02-26",1,"",{"$f":"IF(AND(Q68<>\"\",G68=\"\"),1,\"\")","v":""},"",{"$f":"IF(AND(D68=1,K68<>\"\"),1,\"\")","v":""},null,{"$f":"IF(HelligdagsNavn(C68,0,0)<>\"\",HelligdagsNavn(C68,0,0),C68)","v":"Fastelavn"},null,null,null,null,0,0,{"$f":"IF(OR(C68=\"\",D68=1),\"\",VLOOKUP(WEEKDAY($C68,2),Backend!$F$5:$K$11,4,FALSE))","v":""}]
["",9,"2018-02-27","","",{"$f":"IF(AND(Q69<>\"\",G69=\"\"),1,\"\")","v":1},"",{"$f":"IF(AND(D69=1,K69<>\"\"),1,\"\")","v":""},null,{"$f":"IF(HelligdagsNavn(C69,0,0)<>\"\",HelligdagsNavn(C69,0,0),C69)","v":"2018-02-27"},null,null,null,null,0,0,{"$f":"IF(OR(C69=\"\",D69=1),\"\",VLOOKUP(WEEKDAY($C69,2),Backend!$F$5:$K$11,4,FALSE))","v":"07:24:00"}]
["2018-02-28","","2018-02-28","","",{"$f":"IF(AND(Q70<>\"\",G70=\"\"),1,\"\")","v":1},"",{"$f":"IF(AND(D70=1,K70<>\"\"),1,\"\")","v":""},null,{"$f":"IF(HelligdagsNavn(C70,0,0)<>\"\",HelligdagsNavn(C70,0,0),C70)","v":"2018-02-28"},null,null,null,null,0,0,{"$f":"IF(OR(C70=\"\",D70=1),\"\",VLOOKUP(WEEKDAY($C70,2),Backend!$F$5:$K$11,4,FALSE))","v":"07:24:00"}]
["","","2018-03-01","","",{"$f":"IF(AND(Q71<>\"\",G71=\"\"),1,\"\")","v":1},"",{"$f":"IF(AND(D71=1,K71<>\"\"),1,\"\")","v":""},null,{"$f":"IF(HelligdagsNavn(C71,0,0)<>\"\",HelligdagsNavn(C71,0,0),C71)","v":"Askeonsdag"},null,null,null,null,0,0,{"$f":"IF(OR(C71=\"\",D71=1),\"\",VLOOKUP(WEEKDAY($C71,2),Backend!$F$5:$K$11,4,FALSE))","v":"07:24:00"}]
["","","2018-03-02","","",{"$f":"IF(AND(Q72<>\"\",G72=\"\"),1,\"\")","v":1},"",{"$f":"IF(AND(D72=1,K72<>\"\"),1,\"\")","v":""},null,{"$f":"IF(HelligdagsNavn(C72,0,0)<>\"\",HelligdagsNavn(C72,0,0),C72)","v":"2018-03-02"},null,null,null,null,0,0,{"$f":"IF(OR(C72=\"\",D72=1),\"\",VLOOKUP(WEEKDAY($C72,2),Backend!$F$5:$K$11,4,FALSE))","v":"07:24:00"}]
["","","2018-03-03","","",{"$f":"IF(AND(Q73<>\"\",G73=\"\"),1,\"\")","v":1},"",{"$f":"IF(AND(D73=1,K73<>\"\"),1,\"\")","v":""},null,{"$f":"IF(HelligdagsNavn(C73,0,0)<>\"\",HelligdagsNavn(C73,0,0),C73)","v":"2018-03-03"},null,null,null,null,0,0,{"$f":"IF(OR(C73=\"\",D73=1),\"\",VLOOKUP(WEEKDAY($C73,2),Backend!$F$5:$K$11,4,FALSE))","v":"07:24:00"}]
["","","2018-03-04",1,"",{"$f":"IF(AND(Q74<>\"\",G74=\"\"),1,\"\")","v":""},"",{"$f":"IF(AND(D74=1,K74<>\"\"),1,\"\")","v":""},null,{"$f":"IF(HelligdagsNavn(C74,0,0)<>\"\",HelligdagsNavn(C74,0,0),C74)","v":"2018-03-04"},null,null,null,null,0,0,{"$f":"IF(OR(C74=\"\",D74=1),\"\",VLOOKUP(WEEKDAY($C74,2),Backend!$F$5:$K$11,4,FALSE))","v":""}]
["","","2018-03-05",1,"",{"$f":"IF(AND(Q75<>\"\",G75=\"\"),1,\"\")","v":""},{"$f":"IF(AND(K75<>\"\",$M75=\"Hjemmearbejdsdag\"),1,\"\")","v":""},{"$f":"IF(AND(D75=1,K75<>\"\"),1,\"\")","v":""},null,{"$f":"IF(HelligdagsNavn(C75,0,0)<>\"\",HelligdagsNavn(C75,0,0),C75)","v":"2018-03-05"},null,null,null,null,0,0,{"$f":"IF(OR(C75=\"\",D75=1),\"\",VLOOKUP(WEEKDAY($C75,2),Backend!$F$5:$K$11,4,FALSE))","v":""}]
[{"$f":"IF(DAY(C76)=1,C76,\"\")","v":""},{"$f":"IF(WEEKDAY(C76,2)=1,1+INT((C76-DATE(YEAR(C76+4-WEEKDAY(C76+6)),1,5)+WEEKDAY(DATE(YEAR(C76+4-WEEKDAY(C76+6)),1,3)))/7),\"\")","v":10},"2018-03-06",{"$f":"IF(OR(WEEKDAY(C76)=1,WEEKDAY(C76)=7),1,\"\")","v":""},{"$f":"IF(OR(M76=\"Feriefridag\",M76=\"Ferie med løn\",M76=\"Flex-fri\"),1,\"\")","v":""},{"$f":"IF(AND(Q76<>\"\",G76=\"\"),1,\"\")","v":1},"",{"$f":"IF(AND(D76=1,K76<>\"\"),1,\"\")","v":""},null,{"$f":"IF(HelligdagsNavn(C76,0,0)<>\"\",HelligdagsNavn(C76,0,0),C76)","v":"2018-03-06"},null,null,null,null,{"$f":"IF(OR(K76=\"\",L76=\"\"),0,IF(VALUE(K76)>=VALUE(L76),(TIME(TRUNC(L76/100),MOD(L76,100),0))+1-(TIME(TRUNC(K76/100),MOD(K76,100),0)),(TIME(TRUNC(L76/100),MOD(L76,100),0))-(TIME(TRUNC(K76/100),MOD(K76,100),0))))","v":0},{"$f":"O76*24","v":0},{"$f":"IF(OR(C76=\"\",D76=1),\"\",VLOOKUP(WEEKDAY($C76,2),Backend!$F$5:$K$11,4,FALSE))","v":"07:24:00"}]
["","",{"$f":"C76+1","v":"2018-03-07"},"","",{"$f":"IF(AND(Q77<>\"\",G77=\"\"),1,\"\")","v":1},"",{"$f":"IF(AND(D77=1,K77<>\"\"),1,\"\")","v":""},null,{"$f":"IF(HelligdagsNavn(C77,0,0)<>\"\",HelligdagsNavn(C77,0,0),C77)","v":"2018-03-07"},null,null,null,null,0,0,{"$f":"IF(OR(C77=\"\",D77=1),\"\",VLOOKUP(WEEKDAY($C77,2),Backend!$F$5:$K$11,4,FALSE))","v":"07:24:00"}]
["","","2018-03-08","","",{"$f":"IF(AND(Q78<>\"\",G78=\"\"),1,\"\")","v":1},"",{"$f":"IF(AND(D78=1,K78<>\"\"),1,\"\")","v":""},null,{"$f":"IF(HelligdagsNavn(C78,0,0)<>\"\",HelligdagsNavn(C78,0,0),C78)","v":"2018-03-08"},null,null,null,null,0,0,{"$f":"IF(OR(C78=\"\",D78=1),\"\",VLOOKUP(WEEKDAY($C78,2),Backend!$F$5:$K$11,4,FALSE))","v":"07:24:00"}]
["","","2018-03-09","","",{"$f":"IF(AND(Q79<>\"\",G79=\"\"),1,\"\")","v":1},"",{"$f":"IF(AND(D79=1,K79<>\"\"),1,\"\")","v":""},null,{"$f":"IF(HelligdagsNavn(C79,0,0)<>\"\",HelligdagsNavn(C79,0,0),C79)","v":"2018-03-09"},null,null,null,null,0,0,{"$f":"IF(OR(C79=\"\",D79=1),\"\",VLOOKUP(WEEKDAY($C79,2),Backend!$F$5:$K$11,4,FALSE))","v":"07:24:00"}]
["","","2018-03-10","","",{"$f":"IF(AND(Q80<>\"\",G80=\"\"),1,\"\")","v":1},"",{"$f":"IF(AND(D80=1,K80<>\"\"),1,\"\")","v":""},null,{"$f":"IF(HelligdagsNavn(C80,0,0)<>\"\",HelligdagsNavn(C80,0,0),C80)","v":"2018-03-10"},null,null,null,null,0,0,{"$f":"IF(OR(C80=\"\",D80=1),\"\",VLOOKUP(WEEKDAY($C80,2),Backend!$F$5:$K$11,4,FALSE))","v":"07:24:00"}]
["","","2018-03-11",1,"",{"$f":"IF(AND(Q81<>\"\",G81=\"\"),1,\"\")","v":""},"",{"$f":"IF(AND(D81=1,K81<>\"\"),1,\"\")","v":""},null,{"$f":"IF(HelligdagsNavn(C81,0,0)<>\"\",HelligdagsNavn(C81,0,0),C81)","v":"2018-03-11"},null,null,null,null,0,0,{"$f":"IF(OR(C81=\"\",D81=1),\"\",VLOOKUP(WEEKDAY($C81,2),Backend!$F$5:$K$11,4,FALSE))","v":""}]
["","","2018-03-12",1,"",{"$f":"IF(AND(Q82<>\"\",G82=\"\"),1,\"\")","v":""},"",{"$f":"IF(AND(D82=1,K82<>\"\"),1,\"\")","v":""},null,{"$f":"IF(HelligdagsNavn(C82,0,0)<>\"\",HelligdagsNavn(C82,0,0),C82)","v":"2018-03-12"},null,null,null,null,0,0,{"$f":"IF(OR(C82=\"\",D82=1),\"\",VLOOKUP(WEEKDAY($C82,2),Backend!$F$5:$K$11,4,FALSE))","v":""}]
["",11,"2018-03-13","","",{"$f":"IF(AND(Q83<>\"\",G83=\"\"),1,\"\")","v":1},"",{"$f":"IF(AND(D83=1,K83<>\"\"),1,\"\")","v":""},null,{"$f":"IF(HelligdagsNavn(C83,0,0)<>\"\",HelligdagsNavn(C83,0,0),C83)","v":"2018-03-13"},null,null,null,null,0,0,{"$f":"IF(OR(C83=\"\",D83=1),\"\",VLOOKUP(WEEKDAY($C83,2),Backend!$F$5:$K$11,4,FALSE))","v":"07:24:00"}]
["","","2018-03-14","","",{"$f":"IF(AND(Q84<>\"\",G84=\"\"),1,\"\")","v":1},"",{"$f":"IF(AND(D84=1,K84<>\"\"),1,\"\")","v":""},null,{"$f":"IF(HelligdagsNavn(C84,0,0)<>\"\",HelligdagsNavn(C84,0,0),C84)","v":"2018-03-14"},null,null,null,null,0,0,{"$f":"IF(OR(C84=\"\",D84=1),\"\",VLOOKUP(WEEKDAY($C84,2),Backend!$F$5:$K$11,4,FALSE))","v":"07:24:00"}]
["","","2018-03-15","","",{"$f":"IF(AND(Q85<>\"\",G85=\"\"),1,\"\")","v":1},"",{"$f":"IF(AND(D85=1,K85<>\"\"),1,\"\")","v":""},null,{"$f":"IF(HelligdagsNavn(C85,0,0)<>\"\",HelligdagsNavn(C85,0,0),C85)","v":"2018-03-15"},null,null,null,null,0,0,{"$f":"IF(OR(C85=\"\",D85=1),\"\",VLOOKUP(WEEKDAY($C85,2),Backend!$F$5:$K$11,4,FALSE))","v":"07:24:00"}]
["","","2018-03-16","","",{"$f":"IF(AND(Q86<>\"\",G86=\"\"),1,\"\")","v":1},"",{"$f":"IF(AND(D86=1,K86<>\"\"),1,\"\")","v":""},null,{"$f":"IF(HelligdagsNavn(C86,0,0)<>\"\",HelligdagsNavn(C86,0,0),C86)","v":"2018-03-16"},null,null,null,null,0,0,{"$f":"IF(OR(C86=\"\",D86=1),\"\",VLOOKUP(WEEKDAY($C86,2),Backend!$F$5:$K$11,4,FALSE))","v":"07:24:00"}]
["","","2018-03-17","","",{"$f":"IF(AND(Q87<>\"\",G87=\"\"),1,\"\")","v":1},"",{"$f":"IF(AND(D87=1,K87<>\"\"),1,\"\")","v":""},null,{"$f":"IF(HelligdagsNavn(C87,0,0)<>\"\",HelligdagsNavn(C87,0,0),C87)","v":"2018-03-17"},null,null,null,null,0,0,{"$f":"IF(OR(C87=\"\",D87=1),\"\",VLOOKUP(WEEKDAY($C87,2),Backend!$F$5:$K$11,4,FALSE))","v":"07:24:00"}]
["","","2018-03-18",1,"",{"$f":"IF(AND(Q88<>\"\",G88=\"\"),1,\"\")","v":""},"",{"$f":"IF(AND(D88=1,K88<>\"\"),1,\"\")","v":""},null,{"$f":"IF(HelligdagsNavn(C88,0,0)<>\"\",HelligdagsNavn(C88,0,0),C88)","v":"2018-03-18"},null,null,null,null,0,0,{"$f":"IF(OR(C88=\"\",D88=1),\"\",VLOOKUP(WEEKDAY($C88,2),Backend!$F$5:$K$11,4,FALSE))","v":""}]
["","","2018-03-19",1,"",{"$f":"IF(AND(Q89<>\"\",G89=\"\"),1,\"\")","v":""},"",{"$f":"IF(AND(D89=1,K89<>\"\"),1,\"\")","v":""},null,{"$f":"IF(HelligdagsNavn(C89,0,0)<>\"\",HelligdagsNavn(C89,0,0),C89)","v":"Forårsjævndøgn"},null,null,null,null,0,0,{"$f":"IF(OR(C89=\"\",D89=1),\"\",VLOOKUP(WEEKDAY($C89,2),Backend!$F$5:$K$11,4,FALSE))","v":""}]
["",12,"2018-03-20","","",{"$f":"IF(AND(Q90<>\"\",G90=\"\"),1,\"\")","v":1},"",{"$f":"IF(AND(D90=1,K90<>\"\"),1,\"\")","v":""},null,{"$f":"IF(HelligdagsNavn(C90,0,0)<>\"\",HelligdagsNavn(C90,0,0),C90)","v":"2018-03-20"},null,null,null,null,0,0,{"$f":"IF(OR(C90=\"\",D90=1),\"\",VLOOKUP(WEEKDAY($C90,2),Backend!$F$5:$K$11,4,FALSE))","v":"07:24:00"}]
["","","2018-03-21","","",{"$f":"IF(AND(Q91<>\"\",G91=\"\"),1,\"\")","v":1},"",{"$f":"IF(AND(D91=1,K91<>\"\"),1,\"\")","v":""},null,{"$f":"IF(HelligdagsNavn(C91,0,0)<>\"\",HelligdagsNavn(C91,0,0),C91)","v":"2018-03-21"},null,null,null,null,0,0,{"$f":"IF(OR(C91=\"\",D91=1),\"\",VLOOKUP(WEEKDAY($C91,2),Backend!$F$5:$K$11,4,FALSE))","v":"07:24:00"}]
["","","2018-03-22","","",{"$f":"IF(AND(Q92<>\"\",G92=\"\"),1,\"\")","v":1},"",{"$f":"IF(AND(D92=1,K92<>\"\"),1,\"\")","v":""},null,{"$f":"IF(HelligdagsNavn(C92,0,0)<>\"\",HelligdagsNavn(C92,0,0),C92)","v":"2018-03-22"},null,null,null,null,0,0,{"$f":"IF(OR(C92=\"\",D92=1),\"\",VLOOKUP(WEEKDAY($C92,2),Backend!$F$5:$K$11,4,FALSE))","v":"07:24:00"}]
["","","2018-03-23","","",{"$f":"IF(AND(Q93<>\"\",G93=\"\"),1,\"\")","v":1},"",{"$f":"IF(AND(D93=1,K93<>\"\"),1,\"\")","v":""},null,{"$f":"IF(HelligdagsNavn(C93,0,0)<>\"\",HelligdagsNavn(C93,0,0),C93)","v":"2018-03-23"},null,null,null,null,0,0,{"$f":"IF(OR(C93=\"\",D93=1),\"\",VLOOKUP(WEEKDAY($C93,2),Backend!$F$5:$K$11,4,FALSE))","v":"07:24:00"}]
["","","2018-03-24","","",{"$f":"IF(AND(Q94<>\"\",G94=\"\"),1,\"\")","v":1},"",{"$f":"IF(AND(D94=1,K94<>\"\"),1,\"\")","v":""},null,{"$f":"IF(HelligdagsNavn(C94,0,0)<>\"\",HelligdagsNavn(C94,0,0),C94)","v":"2018-03-24"},null,null,null,null,0,0,{"$f":"IF(OR(C94=\"\",D94=1),\"\",VLOOKUP(WEEKDAY($C94,2),Backend!$F$5:$K$11,4,FALSE))","v":"07:24:00"}]
["","","2018-03-25",1,"",{"$f":"IF(AND(Q95<>\"\",G95=\"\"),1,\"\")","v":""},"",{"$f":"IF(AND(D95=1,K95<>\"\"),1,\"\")","v":""},null,{"$f":"IF(HelligdagsNavn(C95,0,0)<>\"\",HelligdagsNavn(C95,0,0),C95)","v":"2018-03-25"},null,null,null,null,0,0,{"$f":"IF(OR(C95=\"\",D95=1),\"\",VLOOKUP(WEEKDAY($C95,2),Backend!$F$5:$K$11,4,FALSE))","v":""}]
["","","2018-03-26",1,"",{"$f":"IF(AND(Q96<>\"\",G96=\"\"),1,\"\")","v":""},"",{"$f":"IF(AND(D96=1,K96<>\"\"),1,\"\")","v":""},null,{"$f":"IF(HelligdagsNavn(C96,0,0)<>\"\",HelligdagsNavn(C96,0,0),C96)","v":"Sommertid kl. 2 - kl. 3"},null,null,null,null,0,0,{"$f":"IF(OR(C96=\"\",D96=1),\"\",VLOOKUP(WEEKDAY($C96,2),Backend!$F$5:$K$11,4,FALSE))","v":""}]
["",13,"2018-03-27","","",{"$f":"IF(AND(Q97<>\"\",G97=\"\"),1,\"\")","v":1},"",{"$f":"IF(AND(D97=1,K97<>\"\"),1,\"\")","v":""},null,{"$f":"IF(HelligdagsNavn(C97,0,0)<>\"\",HelligdagsNavn(C97,0,0),C97)","v":"2018-03-27"},null,null,null,null,0,0,{"$f":"IF(OR(C97=\"\",D97=1),\"\",VLOOKUP(WEEKDAY($C97,2),Backend!$F$5:$K$11,4,FALSE))","v":"07:24:00"}]
["","","2018-03-28","","",{"$f":"IF(AND(Q98<>\"\",G98=\"\"),1,\"\")","v":1},"",{"$f":"IF(AND(D98=1,K98<>\"\"),1,\"\")","v":""},null,{"$f":"IF(HelligdagsNavn(C98,0,0)<>\"\",HelligdagsNavn(C98,0,0),C98)","v":"2018-03-28"},null,null,null,null,0,0,{"$f":"IF(OR(C98=\"\",D98=1),\"\",VLOOKUP(WEEKDAY($C98,2),Backend!$F$5:$K$11,4,FALSE))","v":"07:24:00"}]
["","","2018-03-29","","",{"$f":"IF(AND(Q99<>\"\",G99=\"\"),1,\"\")","v":1},"",{"$f":"IF(AND(D99=1,K99<>\"\"),1,\"\")","v":""},null,{"$f":"IF(HelligdagsNavn(C99,0,0)<>\"\",HelligdagsNavn(C99,0,0),C99)","v":"2018-03-29"},null,null,null,null,0,0,{"$f":"IF(OR(C99=\"\",D99=1),\"\",VLOOKUP(WEEKDAY($C99,2),Backend!$F$5:$K$11,4,FALSE))","v":"07:24:00"}]
["","","2018-03-30","","",{"$f":"IF(AND(Q100<>\"\",G100=\"\"),1,\"\")","v":1},"",{"$f":"IF(AND(D100=1,K100<>\"\"),1,\"\")","v":""},null,{"$f":"IF(HelligdagsNavn(C100,0,0)<>\"\",HelligdagsNavn(C100,0,0),C100)","v":"2018-03-30"},null,null,null,null,0,0,{"$f":"IF(OR(C100=\"\",D100=1),\"\",VLOOKUP(WEEKDAY($C100,2),Backend!$F$5:$K$11,4,FALSE))","v":"07:24:00"}]
["2018-03-31","","2018-03-31","","",{"$f":"IF(AND(Q101<>\"\",G101=\"\"),1,\"\")","v":1},"",{"$f":"IF(AND(D101=1,K101<>\"\"),1,\"\")","v":""},null,{"$f":"IF(HelligdagsNavn(C101,0,0)<>\"\",HelligdagsNavn(C101,0,0),C101)","v":"2018-03-31"},null,null,null,null,0,0,{"$f":"IF(OR(C101=\"\",D101=1),\"\",VLOOKUP(WEEKDAY($C101,2),Backend!$F$5:$K$11,4,FALSE))","v":"07:24:00"}]
["","","2018-04-01",1,"",{"$f":"IF(AND(Q102<>\"\",G102=\"\"),1,\"\")","v":""},"",{"$f":"IF(AND(D102=1,K102<>\"\"),1,\"\")","v":""},null,{"$f":"IF(HelligdagsNavn(C102,0,0)<>\"\",HelligdagsNavn(C102,0,0),C102)","v":"2018-04-01"},null,null,null,null,0,0,{"$f":"IF(OR(C102=\"\",D102=1),\"\",VLOOKUP(WEEKDAY($C102,2),Backend!$F$5:$K$11,4,FALSE))","v":""}]
["","","2018-04-02",1,"",{"$f":"IF(AND(Q103<>\"\",G103=\"\"),1,\"\")","v":""},"",{"$f":"IF(AND(D103=1,K103<>\"\"),1,\"\")","v":""},null,{"$f":"IF(HelligdagsNavn(C103,0,0)<>\"\",HelligdagsNavn(C103,0,0),C103)","v":"Maria Bebudelsesdag"},null,null,null,null,0,0,{"$f":"IF(OR(C103=\"\",D103=1),\"\",VLOOKUP(WEEKDAY($C103,2),Backend!$F$5:$K$11,4,FALSE))","v":""}]
["",14,"2018-04-03","","",{"$f":"IF(AND(Q104<>\"\",G104=\"\"),1,\"\")","v":1},"",{"$f":"IF(AND(D104=1,K104<>\"\"),1,\"\")","v":""},null,{"$f":"IF(HelligdagsNavn(C104,0,0)<>\"\",HelligdagsNavn(C104,0,0),C104)","v":"2018-04-03"},null,null,null,null,0,0,{"$f":"IF(OR(C104=\"\",D104=1),\"\",VLOOKUP(WEEKDAY($C104,2),Backend!$F$5:$K$11,4,FALSE))","v":"07:24:00"}]
["","","2018-04-04","","",{"$f":"IF(AND(Q105<>\"\",G105=\"\"),1,\"\")","v":1},"",{"$f":"IF(AND(D105=1,K105<>\"\"),1,\"\")","v":""},null,{"$f":"IF(HelligdagsNavn(C105,0,0)<>\"\",HelligdagsNavn(C105,0,0),C105)","v":"2018-04-04"},null,null,null,null,0,0,{"$f":"IF(OR(C105=\"\",D105=1),\"\",VLOOKUP(WEEKDAY($C105,2),Backend!$F$5:$K$11,4,FALSE))","v":"07:24:00"}]
["","","2018-04-05","","",{"$f":"IF(AND(Q106<>\"\",G106=\"\"),1,\"\")","v":1},"",{"$f":"IF(AND(D106=1,K106<>\"\"),1,\"\")","v":""},null,{"$f":"IF(HelligdagsNavn(C106,0,0)<>\"\",HelligdagsNavn(C106,0,0),C106)","v":"2018-04-05"},null,null,null,null,0,0,{"$f":"IF(OR(C106=\"\",D106=1),\"\",VLOOKUP(WEEKDAY($C106,2),Backend!$F$5:$K$11,4,FALSE))","v":"07:24:00"}]
["","","2018-04-06","","",{"$f":"IF(AND(Q107<>\"\",G107=\"\"),1,\"\")","v":1},"",{"$f":"IF(AND(D107=1,K107<>\"\"),1,\"\")","v":""},null,{"$f":"IF(HelligdagsNavn(C107,0,0)<>\"\",HelligdagsNavn(C107,0,0),C107)","v":"2018-04-06"},null,null,null,null,0,0,{"$f":"IF(OR(C107=\"\",D107=1),\"\",VLOOKUP(WEEKDAY($C107,2),Backend!$F$5:$K$11,4,FALSE))","v":"07:24:00"}]
["","","2018-04-07","","",{"$f":"IF(AND(Q108<>\"\",G108=\"\"),1,\"\")","v":1},"",{"$f":"IF(AND(D108=1,K108<>\"\"),1,\"\")","v":""},null,{"$f":"IF(HelligdagsNavn(C108,0,0)<>\"\",HelligdagsNavn(C108,0,0),C108)","v":"2018-04-07"},null,null,null,null,0,0,{"$f":"IF(OR(C108=\"\",D108=1),\"\",VLOOKUP(WEEKDAY($C108,2),Backend!$F$5:$K$11,4,FALSE))","v":"07:24:00"}]
["","","2018-04-08",1,"",{"$f":"IF(AND(Q109<>\"\",G109=\"\"),1,\"\")","v":""},"",{"$f":"IF(AND(D109=1,K109<>\"\"),1,\"\")","v":""},null,{"$f":"IF(HelligdagsNavn(C109,0,0)<>\"\",HelligdagsNavn(C109,0,0),C109)","v":"Danmarks Besættelse"},null,null,null,null,0,0,{"$f":"IF(OR(C109=\"\",D109=1),\"\",VLOOKUP(WEEKDAY($C109,2),Backend!$F$5:$K$11,4,FALSE))","v":""}]
["","","2018-04-09",1,"",{"$f":"IF(AND(Q110<>\"\",G110=\"\"),1,\"\")","v":""},"",{"$f":"IF(AND(D110=1,K110<>\"\"),1,\"\")","v":""},null,{"$f":"IF(HelligdagsNavn(C110,0,0)<>\"\",HelligdagsNavn(C110,0,0),C110)","v":"2018-04-09"},null,null,null,null,0,0,{"$f":"IF(OR(C110=\"\",D110=1),\"\",VLOOKUP(WEEKDAY($C110,2),Backend!$F$5:$K$11,4,FALSE))","v":""}]
["",15,"2018-04-10","","",{"$f":"IF(AND(Q111<>\"\",G111=\"\"),1,\"\")","v":1},"",{"$f":"IF(AND(D111=1,K111<>\"\"),1,\"\")","v":""},null,{"$f":"IF(HelligdagsNavn(C111,0,0)<>\"\",HelligdagsNavn(C111,0,0),C111)","v":"2018-04-10"},null,null,null,null,0,0,{"$f":"IF(OR(C111=\"\",D111=1),\"\",VLOOKUP(WEEKDAY($C111,2),Backend!$F$5:$K$11,4,FALSE))","v":"07:24:00"}]
["","","2018-04-11","","",{"$f":"IF(AND(Q112<>\"\",G112=\"\"),1,\"\")","v":1},"",{"$f":"IF(AND(D112=1,K112<>\"\"),1,\"\")","v":""},null,{"$f":"IF(HelligdagsNavn(C112,0,0)<>\"\",HelligdagsNavn(C112,0,0),C112)","v":"2018-04-11"},null,null,null,null,0,0,{"$f":"IF(OR(C112=\"\",D112=1),\"\",VLOOKUP(WEEKDAY($C112,2),Backend!$F$5:$K$11,4,FALSE))","v":"07:24:00"}]
["","","2018-04-12","","",{"$f":"IF(AND(Q113<>\"\",G113=\"\"),1,\"\")","v":1},"",{"$f":"IF(AND(D113=1,K113<>\"\"),1,\"\")","v":""},null,{"$f":"IF(HelligdagsNavn(C113,0,0)<>\"\",HelligdagsNavn(C113,0,0),C113)","v":"2018-04-12"},null,null,null,null,0,0,{"$f":"IF(OR(C113=\"\",D113=1),\"\",VLOOKUP(WEEKDAY($C113,2),Backend!$F$5:$K$11,4,FALSE))","v":"07:24:00"}]
["","","2018-04-13","","",{"$f":"IF(AND(Q114<>\"\",G114=\"\"),1,\"\")","v":1},"",{"$f":"IF(AND(D114=1,K114<>\"\"),1,\"\")","v":""},null,{"$f":"IF(HelligdagsNavn(C114,0,0)<>\"\",HelligdagsNavn(C114,0,0),C114)","v":"Skærtorsdag"},null,null,null,null,0,0,{"$f":"IF(OR(C114=\"\",D114=1),\"\",VLOOKUP(WEEKDAY($C114,2),Backend!$F$5:$K$11,4,FALSE))","v":"07:24:00"}]
["","","2018-04-14","","",{"$f":"IF(AND(Q115<>\"\",G115=\"\"),1,\"\")","v":1},"",{"$f":"IF(AND(D115=1,K115<>\"\"),1,\"\")","v":""},null,{"$f":"IF(HelligdagsNavn(C115,0,0)<>\"\",HelligdagsNavn(C115,0,0),C115)","v":"Langfredag"},null,null,null,null,0,0,{"$f":"IF(OR(C115=\"\",D115=1),\"\",VLOOKUP(WEEKDAY($C115,2),Backend!$F$5:$K$11,4,FALSE))","v":"07:24:00"}]
["","","2018-04-15",1,"",{"$f":"IF(AND(Q116<>\"\",G116=\"\"),1,\"\")","v":""},"",{"$f":"IF(AND(D116=1,K116<>\"\"),1,\"\")","v":""},null,{"$f":"IF(HelligdagsNavn(C116,0,0)<>\"\",HelligdagsNavn(C116,0,0),C116)","v":"2018-04-15"},null,null,null,null,0,0,{"$f":"IF(OR(C116=\"\",D116=1),\"\",VLOOKUP(WEEKDAY($C116,2),Backend!$F$5:$K$11,4,FALSE))","v":""}]
["","","2018-04-16",1,"",{"$f":"IF(AND(Q117<>\"\",G117=\"\"),1,\"\")","v":""},"",{"$f":"IF(AND(D117=1,K117<>\"\"),1,\"\")","v":""},null,{"$f":"IF(HelligdagsNavn(C117,0,0)<>\"\",HelligdagsNavn(C117,0,0),C117)","v":"Påskedag"},null,null,null,null,0,0,{"$f":"IF(OR(C117=\"\",D117=1),\"\",VLOOKUP(WEEKDAY($C117,2),Backend!$F$5:$K$11,4,FALSE))","v":""}]
["",16,"2018-04-17","","",{"$f":"IF(AND(Q118<>\"\",G118=\"\"),1,\"\")","v":1},"",{"$f":"IF(AND(D118=1,K118<>\"\"),1,\"\")","v":""},null,{"$f":"IF(HelligdagsNavn(C118,0,0)<>\"\",HelligdagsNavn(C118,0,0),C118)","v":"2. Påskedag"},null,null,null,null,0,0,{"$f":"IF(OR(C118=\"\",D118=1),\"\",VLOOKUP(WEEKDAY($C118,2),Backend!$F$5:$K$11,4,FALSE))","v":"07:24:00"}]
["","","2018-04-18","","",{"$f":"IF(AND(Q119<>\"\",G119=\"\"),1,\"\")","v":1},"",{"$f":"IF(AND(D119=1,K119<>\"\"),1,\"\")","v":""},null,{"$f":"IF(HelligdagsNavn(C119,0,0)<>\"\",HelligdagsNavn(C119,0,0),C119)","v":"3. Påskedag"},null,null,null,null,0,0,{"$f":"IF(OR(C119=\"\",D119=1),\"\",VLOOKUP(WEEKDAY($C119,2),Backend!$F$5:$K$11,4,FALSE))","v":"07:24:00"}]
["","","2018-04-19","","",{"$f":"IF(AND(Q120<>\"\",G120=\"\"),1,\"\")","v":1},"",{"$f":"IF(AND(D120=1,K120<>\"\"),1,\"\")","v":""},null,{"$f":"IF(HelligdagsNavn(C120,0,0)<>\"\",HelligdagsNavn(C120,0,0),C120)","v":"2018-04-19"},null,null,null,null,0,0,{"$f":"IF(OR(C120=\"\",D120=1),\"\",VLOOKUP(WEEKDAY($C120,2),Backend!$F$5:$K$11,4,FALSE))","v":"07:24:00"}]
["","","2018-04-20","","",{"$f":"IF(AND(Q121<>\"\",G121=\"\"),1,\"\")","v":1},"",{"$f":"IF(AND(D121=1,K121<>\"\"),1,\"\")","v":""},null,{"$f":"IF(HelligdagsNavn(C121,0,0)<>\"\",HelligdagsNavn(C121,0,0),C121)","v":"2018-04-20"},null,null,null,null,0,0,{"$f":"IF(OR(C121=\"\",D121=1),\"\",VLOOKUP(WEEKDAY($C121,2),Backend!$F$5:$K$11,4,FALSE))","v":"07:24:00"}]
["","","2018-04-21","","",{"$f":"IF(AND(Q122<>\"\",G122=\"\"),1,\"\")","v":1},"",{"$f":"IF(AND(D122=1,K122<>\"\"),1,\"\")","v":""},null,{"$f":"IF(HelligdagsNavn(C122,0,0)<>\"\",HelligdagsNavn(C122,0,0),C122)","v":"2018-04-21"},null,null,null,null,0,0,{"$f":"IF(OR(C122=\"\",D122=1),\"\",VLOOKUP(WEEKDAY($C122,2),Backend!$F$5:$K$11,4,FALSE))","v":"07:24:00"}]
["","","2018-04-22",1,"",{"$f":"IF(AND(Q123<>\"\",G123=\"\"),1,\"\")","v":""},"",{"$f":"IF(AND(D123=1,K123<>\"\"),1,\"\")","v":""},null,{"$f":"IF(HelligdagsNavn(C123,0,0)<>\"\",HelligdagsNavn(C123,0,0),C123)","v":"2018-04-22"},null,null,null,null,0,0,{"$f":"IF(OR(C123=\"\",D123=1),\"\",VLOOKUP(WEEKDAY($C123,2),Backend!$F$5:$K$11,4,FALSE))","v":""}]
["","","2018-04-23",1,"",{"$f":"IF(AND(Q124<>\"\",G124=\"\"),1,\"\")","v":""},"",{"$f":"IF(AND(D124=1,K124<>\"\"),1,\"\")","v":""},null,{"$f":"IF(HelligdagsNavn(C124,0,0)<>\"\",HelligdagsNavn(C124,0,0),C124)","v":"2018-04-23"},null,null,null,null,0,0,{"$f":"IF(OR(C124=\"\",D124=1),\"\",VLOOKUP(WEEKDAY($C124,2),Backend!$F$5:$K$11,4,FALSE))","v":""}]
["",17,"2018-04-24","","",{"$f":"IF(AND(Q125<>\"\",G125=\"\"),1,\"\")","v":1},"",{"$f":"IF(AND(D125=1,K125<>\"\"),1,\"\")","v":""},null,{"$f":"IF(HelligdagsNavn(C125,0,0)<>\"\",HelligdagsNavn(C125,0,0),C125)","v":"2018-04-24"},null,null,null,null,0,0,{"$f":"IF(OR(C125=\"\",D125=1),\"\",VLOOKUP(WEEKDAY($C125,2),Backend!$F$5:$K$11,4,FALSE))","v":"07:24:00"}]
["","","2018-04-25","","",{"$f":"IF(AND(Q126<>\"\",G126=\"\"),1,\"\")","v":1},"",{"$f":"IF(AND(D126=1,K126<>\"\"),1,\"\")","v":""},null,{"$f":"IF(HelligdagsNavn(C126,0,0)<>\"\",HelligdagsNavn(C126,0,0),C126)","v":"2018-04-25"},null,null,null,null,0,0,{"$f":"IF(OR(C126=\"\",D126=1),\"\",VLOOKUP(WEEKDAY($C126,2),Backend!$F$5:$K$11,4,FALSE))","v":"07:24:00"}]
["","","2018-04-26","","",{"$f":"IF(AND(Q127<>\"\",G127=\"\"),1,\"\")","v":1},"",{"$f":"IF(AND(D127=1,K127<>\"\"),1,\"\")","v":""},null,{"$f":"IF(HelligdagsNavn(C127,0,0)<>\"\",HelligdagsNavn(C127,0,0),C127)","v":"2018-04-26"},null,null,null,null,0,0,{"$f":"IF(OR(C127=\"\",D127=1),\"\",VLOOKUP(WEEKDAY($C127,2),Backend!$F$5:$K$11,4,FALSE))","v":"07:24:00"}]
["","","2018-04-27","","",{"$f":"IF(AND(Q128<>\"\",G128=\"\"),1,\"\")","v":1},"",{"$f":"IF(AND(D128=1,K128<>\"\"),1,\"\")","v":""},null,{"$f":"IF(HelligdagsNavn(C128,0,0)<>\"\",HelligdagsNavn(C128,0,0),C128)","v":"2018-04-27"},null,null,null,null,0,0,{"$f":"IF(OR(C128=\"\",D128=1),\"\",VLOOKUP(WEEKDAY($C128,2),Backend!$F$5:$K$11,4,FALSE))","v":"07:24:00"}]
["","","2018-04-28","","",{"$f":"IF(AND(Q129<>\"\",G129=\"\"),1,\"\")","v":1},"",{"$f":"IF(AND(D129=1,K129<>\"\"),1,\"\")","v":""},null,{"$f":"IF(HelligdagsNavn(C129,0,0)<>\"\",HelligdagsNavn(C129,0,0),C129)","v":"2018-04-28"},null,null,null,null,0,0,{"$f":"IF(OR(C129=\"\",D129=1),\"\",VLOOKUP(WEEKDAY($C129,2),Backend!$F$5:$K$11,4,FALSE))","v":"07:24:00"}]
["","","2018-04-29",1,"",{"$f":"IF(AND(Q130<>\"\",G130=\"\"),1,\"\")","v":""},"",{"$f":"IF(AND(D130=1,K130<>\"\"),1,\"\")","v":""},null,{"$f":"IF(HelligdagsNavn(C130,0,0)<>\"\",HelligdagsNavn(C130,0,0),C130)","v":"2018-04-29"},null,null,null,null,0,0,{"$f":"IF(OR(C130=\"\",D130=1),\"\",VLOOKUP(WEEKDAY($C130,2),Backend!$F$5:$K$11,4,FALSE))","v":""}]
["2018-04-30","","2018-04-30",1,"",{"$f":"IF(AND(Q131<>\"\",G131=\"\"),1,\"\")","v":""},"",{"$f":"IF(AND(D131=1,K131<>\"\"),1,\"\")","v":""},null,{"$f":"IF(HelligdagsNavn(C131,0,0)<>\"\",HelligdagsNavn(C131,0,0),C131)","v":"Arbejdernes Kampdag"},null,null,null,null,0,0,{"$f":"IF(OR(C131=\"\",D131=1),\"\",VLOOKUP(WEEKDAY($C131,2),Backend!$F$5:$K$11,4,FALSE))","v":""}]
["",18,"2018-05-01","","",{"$f":"IF(AND(Q132<>\"\",G132=\"\"),1,\"\")","v":1},"",{"$f":"IF(AND(D132=1,K132<>\"\"),1,\"\")","v":""},null,{"$f":"IF(HelligdagsNavn(C132,0,0)<>\"\",HelligdagsNavn(C132,0,0),C132)","v":"2018-05-01"},null,null,null,null,0,0,{"$f":"IF(OR(C132=\"\",D132=1),\"\",VLOOKUP(WEEKDAY($C132,2),Backend!$F$5:$K$11,4,FALSE))","v":"07:24:00"}]
["","","2018-05-02","","",{"$f":"IF(AND(Q133<>\"\",G133=\"\"),1,\"\")","v":1},"",{"$f":"IF(AND(D133=1,K133<>\"\"),1,\"\")","v":""},null,{"$f":"IF(HelligdagsNavn(C133,0,0)<>\"\",HelligdagsNavn(C133,0,0),C133)","v":"2018-05-02"},null,null,null,null,0,0,{"$f":"IF(OR(C133=\"\",D133=1),\"\",VLOOKUP(WEEKDAY($C133,2),Backend!$F$5:$K$11,4,FALSE))","v":"07:24:00"}]
["","","2018-05-03","","",{"$f":"IF(AND(Q134<>\"\",G134=\"\"),1,\"\")","v":1},"",{"$f":"IF(AND(D134=1,K134<>\"\"),1,\"\")","v":""},null,{"$f":"IF(HelligdagsNavn(C134,0,0)<>\"\",HelligdagsNavn(C134,0,0),C134)","v":"2018-05-03"},null,null,null,null,0,0,{"$f":"IF(OR(C134=\"\",D134=1),\"\",VLOOKUP(WEEKDAY($C134,2),Backend!$F$5:$K$11,4,FALSE))","v":"07:24:00"}]
["","","2018-05-04","","",{"$f":"IF(AND(Q135<>\"\",G135=\"\"),1,\"\")","v":1},"",{"$f":"IF(AND(D135=1,K135<>\"\"),1,\"\")","v":""},null,{"$f":"IF(HelligdagsNavn(C135,0,0)<>\"\",HelligdagsNavn(C135,0,0),C135)","v":"Danmarks Befrielse"},null,null,null,null,0,0,{"$f":"IF(OR(C135=\"\",D135=1),\"\",VLOOKUP(WEEKDAY($C135,2),Backend!$F$5:$K$11,4,FALSE))","v":"07:24:00"}]
["","","2018-05-05","","",{"$f":"IF(AND(Q136<>\"\",G136=\"\"),1,\"\")","v":1},"",{"$f":"IF(AND(D136=1,K136<>\"\"),1,\"\")","v":""},null,{"$f":"IF(HelligdagsNavn(C136,0,0)<>\"\",HelligdagsNavn(C136,0,0),C136)","v":"2018-05-05"},null,null,null,null,0,0,{"$f":"IF(OR(C136=\"\",D136=1),\"\",VLOOKUP(WEEKDAY($C136,2),Backend!$F$5:$K$11,4,FALSE))","v":"07:24:00"}]
["","","2018-05-06",1,"",{"$f":"IF(AND(Q137<>\"\",G137=\"\"),1,\"\")","v":""},"",{"$f":"IF(AND(D137=1,K137<>\"\"),1,\"\")","v":""},null,{"$f":"IF(HelligdagsNavn(C137,0,0)<>\"\",HelligdagsNavn(C137,0,0),C137)","v":"2018-05-06"},null,null,null,null,0,0,{"$f":"IF(OR(C137=\"\",D137=1),\"\",VLOOKUP(WEEKDAY($C137,2),Backend!$F$5:$K$11,4,FALSE))","v":""}]
["","","2018-05-07",1,"",{"$f":"IF(AND(Q138<>\"\",G138=\"\"),1,\"\")","v":""},"",{"$f":"IF(AND(D138=1,K138<>\"\"),1,\"\")","v":""},null,{"$f":"IF(HelligdagsNavn(C138,0,0)<>\"\",HelligdagsNavn(C138,0,0),C138)","v":"Mors Dag"},null,null,null,null,0,0,{"$f":"IF(OR(C138=\"\",D138=1),\"\",VLOOKUP(WEEKDAY($C138,2),Backend!$F$5:$K$11,4,FALSE))","v":""}]
["",19,"2018-05-08","","",{"$f":"IF(AND(Q139<>\"\",G139=\"\"),1,\"\")","v":1},{"$f":"IF(AND(K139<>\"\",$M139=\"Hjemmearbejdsdag\"),1,\"\")","v":""},{"$f":"IF(AND(D139=1,K139<>\"\"),1,\"\")","v":""},null,{"$f":"IF(HelligdagsNavn(C139,0,0)<>\"\",HelligdagsNavn(C139,0,0),C139)","v":"2018-05-08"},null,null,null,null,0,0,{"$f":"IF(OR(C139=\"\",D139=1),\"\",VLOOKUP(WEEKDAY($C139,2),Backend!$F$5:$K$11,4,FALSE))","v":"07:24:00"}]
[{"$f":"IF(DAY(C140)=1,C140,\"\")","v":""},{"$f":"IF(WEEKDAY(C140,2)=1,1+INT((C140-DATE(YEAR(C140+4-WEEKDAY(C140+6)),1,5)+WEEKDAY(DATE(YEAR(C140+4-WEEKDAY(C140+6)),1,3)))/7),\"\")","v":""},"2018-05-09",{"$f":"IF(OR(WEEKDAY(C140)=1,WEEKDAY(C140)=7),1,\"\")","v":""},{"$f":"IF(OR(M140=\"Feriefridag\",M140=\"Ferie med løn\",M140=\"Flex-fri\"),1,\"\")","v":""},{"$f":"IF(AND(Q140<>\"\",G140=\"\"),1,\"\")","v":1},"",{"$f":"IF(AND(D140=1,K140<>\"\"),1,\"\")","v":""},null,{"$f":"IF(HelligdagsNavn(C140,0,0)<>\"\",HelligdagsNavn(C140,0,0),C140)","v":"2018-05-09"},null,null,null,null,{"$f":"IF(OR(K140=\"\",L140=\"\"),0,IF(VALUE(K140)>=VALUE(L140),(TIME(TRUNC(L140/100),MOD(L140,100),0))+1-(TIME(TRUNC(K140/100),MOD(K140,100),0)),(TIME(TRUNC(L140/100),MOD(L140,100),0))-(TIME(TRUNC(K140/100),MOD(K140,100),0))))","v":0},{"$f":"O140*24","v":0},{"$f":"IF(OR(C140=\"\",D140=1),\"\",VLOOKUP(WEEKDAY($C140,2),Backend!$F$5:$K$11,4,FALSE))","v":"07:24:00"}]
["","",{"$f":"C140+1","v":"2018-05-10"},"","",{"$f":"IF(AND(Q141<>\"\",G141=\"\"),1,\"\")","v":1},"",{"$f":"IF(AND(D141=1,K141<>\"\"),1,\"\")","v":""},null,{"$f":"IF(HelligdagsNavn(C141,0,0)<>\"\",HelligdagsNavn(C141,0,0),C141)","v":"2018-05-10"},null,null,null,null,0,0,{"$f":"IF(OR(C141=\"\",D141=1),\"\",VLOOKUP(WEEKDAY($C141,2),Backend!$F$5:$K$11,4,FALSE))","v":"07:24:00"}]
["","","2018-05-11","","",{"$f":"IF(AND(Q142<>\"\",G142=\"\"),1,\"\")","v":1},"",{"$f":"IF(AND(D142=1,K142<>\"\"),1,\"\")","v":""},null,{"$f":"IF(HelligdagsNavn(C142,0,0)<>\"\",HelligdagsNavn(C142,0,0),C142)","v":"2018-05-11"},null,null,null,null,0,0,{"$f":"IF(OR(C142=\"\",D142=1),\"\",VLOOKUP(WEEKDAY($C142,2),Backend!$F$5:$K$11,4,FALSE))","v":"07:24:00"}]
["","","2018-05-12","","",{"$f":"IF(AND(Q143<>\"\",G143=\"\"),1,\"\")","v":1},"",{"$f":"IF(AND(D143=1,K143<>\"\"),1,\"\")","v":""},null,{"$f":"IF(HelligdagsNavn(C143,0,0)<>\"\",HelligdagsNavn(C143,0,0),C143)","v":"Store Bededag"},null,null,null,null,0,0,{"$f":"IF(OR(C143=\"\",D143=1),\"\",VLOOKUP(WEEKDAY($C143,2),Backend!$F$5:$K$11,4,FALSE))","v":"07:24:00"}]
["","","2018-05-13",1,"",{"$f":"IF(AND(Q144<>\"\",G144=\"\"),1,\"\")","v":""},"",{"$f":"IF(AND(D144=1,K144<>\"\"),1,\"\")","v":""},null,{"$f":"IF(HelligdagsNavn(C144,0,0)<>\"\",HelligdagsNavn(C144,0,0),C144)","v":"2018-05-13"},null,null,null,null,0,0,{"$f":"IF(OR(C144=\"\",D144=1),\"\",VLOOKUP(WEEKDAY($C144,2),Backend!$F$5:$K$11,4,FALSE))","v":""}]
["","","2018-05-14",1,"",{"$f":"IF(AND(Q145<>\"\",G145=\"\"),1,\"\")","v":""},"",{"$f":"IF(AND(D145=1,K145<>\"\"),1,\"\")","v":""},null,{"$f":"IF(HelligdagsNavn(C145,0,0)<>\"\",HelligdagsNavn(C145,0,0),C145)","v":"2018-05-14"},null,null,null,null,0,0,{"$f":"IF(OR(C145=\"\",D145=1),\"\",VLOOKUP(WEEKDAY($C145,2),Backend!$F$5:$K$11,4,FALSE))","v":""}]
["",20,"2018-05-15","","",{"$f":"IF(AND(Q146<>\"\",G146=\"\"),1,\"\")","v":1},"",{"$f":"IF(AND(D146=1,K146<>\"\"),1,\"\")","v":""},null,{"$f":"IF(HelligdagsNavn(C146,0,0)<>\"\",HelligdagsNavn(C146,0,0),C146)","v":"2018-05-15"},null,null,null,null,0,0,{"$f":"IF(OR(C146=\"\",D146=1),\"\",VLOOKUP(WEEKDAY($C146,2),Backend!$F$5:$K$11,4,FALSE))","v":"07:24:00"}]
["","","2018-05-16","","",{"$f":"IF(AND(Q147<>\"\",G147=\"\"),1,\"\")","v":1},"",{"$f":"IF(AND(D147=1,K147<>\"\"),1,\"\")","v":""},null,{"$f":"IF(HelligdagsNavn(C147,0,0)<>\"\",HelligdagsNavn(C147,0,0),C147)","v":"2018-05-16"},null,null,null,null,0,0,{"$f":"IF(OR(C147=\"\",D147=1),\"\",VLOOKUP(WEEKDAY($C147,2),Backend!$F$5:$K$11,4,FALSE))","v":"07:24:00"}]
["","","2018-05-17","","",{"$f":"IF(AND(Q148<>\"\",G148=\"\"),1,\"\")","v":1},"",{"$f":"IF(AND(D148=1,K148<>\"\"),1,\"\")","v":""},null,{"$f":"IF(HelligdagsNavn(C148,0,0)<>\"\",HelligdagsNavn(C148,0,0),C148)","v":"2018-05-17"},null,null,null,null,0,0,{"$f":"IF(OR(C148=\"\",D148=1),\"\",VLOOKUP(WEEKDAY($C148,2),Backend!$F$5:$K$11,4,FALSE))","v":"07:24:00"}]
["","","2018-05-18","","",{"$f":"IF(AND(Q149<>\"\",G149=\"\"),1,\"\")","v":1},"",{"$f":"IF(AND(D149=1,K149<>\"\"),1,\"\")","v":""},null,{"$f":"IF(HelligdagsNavn(C149,0,0)<>\"\",HelligdagsNavn(C149,0,0),C149)","v":"2018-05-18"},null,null,null,null,0,0,{"$f":"IF(OR(C149=\"\",D149=1),\"\",VLOOKUP(WEEKDAY($C149,2),Backend!$F$5:$K$11,4,FALSE))","v":"07:24:00"}]
["","","2018-05-19","","",{"$f":"IF(AND(Q150<>\"\",G150=\"\"),1,\"\")","v":1},"",{"$f":"IF(AND(D150=1,K150<>\"\"),1,\"\")","v":""},null,{"$f":"IF(HelligdagsNavn(C150,0,0)<>\"\",HelligdagsNavn(C150,0,0),C150)","v":"2018-05-19"},null,null,null,null,0,0,{"$f":"IF(OR(C150=\"\",D150=1),\"\",VLOOKUP(WEEKDAY($C150,2),Backend!$F$5:$K$11,4,FALSE))","v":"07:24:00"}]
["","","2018-05-20",1,"",{"$f":"IF(AND(Q151<>\"\",G151=\"\"),1,\"\")","v":""},"",{"$f":"IF(AND(D151=1,K151<>\"\"),1,\"\")","v":""},null,{"$f":"IF(HelligdagsNavn(C151,0,0)<>\"\",HelligdagsNavn(C151,0,0),C151)","v":"2018-05-20"},null,null,null,null,0,0,{"$f":"IF(OR(C151=\"\",D151=1),\"\",VLOOKUP(WEEKDAY($C151,2),Backend!$F$5:$K$11,4,FALSE))","v":""}]
["","","2018-05-21",1,"",{"$f":"IF(AND(Q152<>\"\",G152=\"\"),1,\"\")","v":""},"",{"$f":"IF(AND(D152=1,K152<>\"\"),1,\"\")","v":""},null,{"$f":"IF(HelligdagsNavn(C152,0,0)<>\"\",HelligdagsNavn(C152,0,0),C152)","v":"2018-05-21"},null,null,null,null,0,0,{"$f":"IF(OR(C152=\"\",D152=1),\"\",VLOOKUP(WEEKDAY($C152,2),Backend!$F$5:$K$11,4,FALSE))","v":""}]
["",21,"2018-05-22","","",{"$f":"IF(AND(Q153<>\"\",G153=\"\"),1,\"\")","v":1},"",{"$f":"IF(AND(D153=1,K153<>\"\"),1,\"\")","v":""},null,{"$f":"IF(HelligdagsNavn(C153,0,0)<>\"\",HelligdagsNavn(C153,0,0),C153)","v":"2018-05-22"},null,null,null,null,0,0,{"$f":"IF(OR(C153=\"\",D153=1),\"\",VLOOKUP(WEEKDAY($C153,2),Backend!$F$5:$K$11,4,FALSE))","v":"07:24:00"}]
["","","2018-05-23","","",{"$f":"IF(AND(Q154<>\"\",G154=\"\"),1,\"\")","v":1},"",{"$f":"IF(AND(D154=1,K154<>\"\"),1,\"\")","v":""},null,{"$f":"IF(HelligdagsNavn(C154,0,0)<>\"\",HelligdagsNavn(C154,0,0),C154)","v":"2018-05-23"},null,null,null,null,0,0,{"$f":"IF(OR(C154=\"\",D154=1),\"\",VLOOKUP(WEEKDAY($C154,2),Backend!$F$5:$K$11,4,FALSE))","v":"07:24:00"}]
["","","2018-05-24","","",{"$f":"IF(AND(Q155<>\"\",G155=\"\"),1,\"\")","v":1},"",{"$f":"IF(AND(D155=1,K155<>\"\"),1,\"\")","v":""},null,{"$f":"IF(HelligdagsNavn(C155,0,0)<>\"\",HelligdagsNavn(C155,0,0),C155)","v":"2018-05-24"},null,null,null,null,0,0,{"$f":"IF(OR(C155=\"\",D155=1),\"\",VLOOKUP(WEEKDAY($C155,2),Backend!$F$5:$K$11,4,FALSE))","v":"07:24:00"}]
["","","2018-05-25","","",{"$f":"IF(AND(Q156<>\"\",G156=\"\"),1,\"\")","v":1},"",{"$f":"IF(AND(D156=1,K156<>\"\"),1,\"\")","v":""},null,{"$f":"IF(HelligdagsNavn(C156,0,0)<>\"\",HelligdagsNavn(C156,0,0),C156)","v":"Kristi Himmelfartsdag"},null,null,null,null,0,0,{"$f":"IF(OR(C156=\"\",D156=1),\"\",VLOOKUP(WEEKDAY($C156,2),Backend!$F$5:$K$11,4,FALSE))","v":"07:24:00"}]
["","","2018-05-26","","",{"$f":"IF(AND(Q157<>\"\",G157=\"\"),1,\"\")","v":1},"",{"$f":"IF(AND(D157=1,K157<>\"\"),1,\"\")","v":""},null,{"$f":"IF(HelligdagsNavn(C157,0,0)<>\"\",HelligdagsNavn(C157,0,0),C157)","v":"2018-05-26"},null,null,null,null,0,0,{"$f":"IF(OR(C157=\"\",D157=1),\"\",VLOOKUP(WEEKDAY($C157,2),Backend!$F$5:$K$11,4,FALSE))","v":"07:24:00"}]
["","","2018-05-27",1,"",{"$f":"IF(AND(Q158<>\"\",G158=\"\"),1,\"\")","v":""},"",{"$f":"IF(AND(D158=1,K158<>\"\"),1,\"\")","v":""},null,{"$f":"IF(HelligdagsNavn(C158,0,0)<>\"\",HelligdagsNavn(C158,0,0),C158)","v":"2018-05-27"},null,null,null,null,0,0,{"$f":"IF(OR(C158=\"\",D158=1),\"\",VLOOKUP(WEEKDAY($C158,2),Backend!$F$5:$K$11,4,FALSE))","v":""}]
["","","2018-05-28",1,"",{"$f":"IF(AND(Q159<>\"\",G159=\"\"),1,\"\")","v":""},"",{"$f":"IF(AND(D159=1,K159<>\"\"),1,\"\")","v":""},null,{"$f":"IF(HelligdagsNavn(C159,0,0)<>\"\",HelligdagsNavn(C159,0,0),C159)","v":"2018-05-28"},null,null,null,null,0,0,{"$f":"IF(OR(C159=\"\",D159=1),\"\",VLOOKUP(WEEKDAY($C159,2),Backend!$F$5:$K$11,4,FALSE))","v":""}]
["",22,"2018-05-29","","",{"$f":"IF(AND(Q160<>\"\",G160=\"\"),1,\"\")","v":1},"",{"$f":"IF(AND(D160=1,K160<>\"\"),1,\"\")","v":""},null,{"$f":"IF(HelligdagsNavn(C160,0,0)<>\"\",HelligdagsNavn(C160,0,0),C160)","v":"2018-05-29"},null,null,null,null,0,0,{"$f":"IF(OR(C160=\"\",D160=1),\"\",VLOOKUP(WEEKDAY($C160,2),Backend!$F$5:$K$11,4,FALSE))","v":"07:24:00"}]
["","","2018-05-30","","",{"$f":"IF(AND(Q161<>\"\",G161=\"\"),1,\"\")","v":1},"",{"$f":"IF(AND(D161=1,K161<>\"\"),1,\"\")","v":""},null,{"$f":"IF(HelligdagsNavn(C161,0,0)<>\"\",HelligdagsNavn(C161,0,0),C161)","v":"2018-05-30"},null,null,null,null,0,0,{"$f":"IF(OR(C161=\"\",D161=1),\"\",VLOOKUP(WEEKDAY($C161,2),Backend!$F$5:$K$11,4,FALSE))","v":"07:24:00"}]
["2018-05-31","","2018-05-31","","",{"$f":"IF(AND(Q162<>\"\",G162=\"\"),1,\"\")","v":1},"",{"$f":"IF(AND(D162=1,K162<>\"\"),1,\"\")","v":""},null,{"$f":"IF(HelligdagsNavn(C162,0,0)<>\"\",HelligdagsNavn(C162,0,0),C162)","v":"2018-05-31"},null,null,null,null,0,0,{"$f":"IF(OR(C162=\"\",D162=1),\"\",VLOOKUP(WEEKDAY($C162,2),Backend!$F$5:$K$11,4,FALSE))","v":"07:24:00"}]
["","","2018-06-01","","",{"$f":"IF(AND(Q163<>\"\",G163=\"\"),1,\"\")","v":1},"",{"$f":"IF(AND(D163=1,K163<>\"\"),1,\"\")","v":""},null,{"$f":"IF(HelligdagsNavn(C163,0,0)<>\"\",HelligdagsNavn(C163,0,0),C163)","v":"2018-06-01"},null,null,null,null,0,0,{"$f":"IF(OR(C163=\"\",D163=1),\"\",VLOOKUP(WEEKDAY($C163,2),Backend!$F$5:$K$11,4,FALSE))","v":"07:24:00"}]
["","","2018-06-02","","",{"$f":"IF(AND(Q164<>\"\",G164=\"\"),1,\"\")","v":1},"",{"$f":"IF(AND(D164=1,K164<>\"\"),1,\"\")","v":""},null,{"$f":"IF(HelligdagsNavn(C164,0,0)<>\"\",HelligdagsNavn(C164,0,0),C164)","v":"2018-06-02"},null,null,null,null,0,0,{"$f":"IF(OR(C164=\"\",D164=1),\"\",VLOOKUP(WEEKDAY($C164,2),Backend!$F$5:$K$11,4,FALSE))","v":"07:24:00"}]
["","","2018-06-03",1,"",{"$f":"IF(AND(Q165<>\"\",G165=\"\"),1,\"\")","v":""},"",{"$f":"IF(AND(D165=1,K165<>\"\"),1,\"\")","v":""},null,{"$f":"IF(HelligdagsNavn(C165,0,0)<>\"\",HelligdagsNavn(C165,0,0),C165)","v":"2018-06-03"},null,null,null,null,0,0,{"$f":"IF(OR(C165=\"\",D165=1),\"\",VLOOKUP(WEEKDAY($C165,2),Backend!$F$5:$K$11,4,FALSE))","v":""}]
["","","2018-06-04",1,"",{"$f":"IF(AND(Q166<>\"\",G166=\"\"),1,\"\")","v":""},"",{"$f":"IF(AND(D166=1,K166<>\"\"),1,\"\")","v":""},null,{"$f":"IF(HelligdagsNavn(C166,0,0)<>\"\",HelligdagsNavn(C166,0,0),C166)","v":"Pinsedag"},null,null,null,null,0,0,{"$f":"IF(OR(C166=\"\",D166=1),\"\",VLOOKUP(WEEKDAY($C166,2),Backend!$F$5:$K$11,4,FALSE))","v":""}]
["",23,"2018-06-05","","",{"$f":"IF(AND(Q167<>\"\",G167=\"\"),1,\"\")","v":1},"",{"$f":"IF(AND(D167=1,K167<>\"\"),1,\"\")","v":""},null,{"$f":"IF(HelligdagsNavn(C167,0,0)<>\"\",HelligdagsNavn(C167,0,0),C167)","v":"2. Pinsedag"},null,null,null,null,0,0,{"$f":"IF(OR(C167=\"\",D167=1),\"\",VLOOKUP(WEEKDAY($C167,2),Backend!$F$5:$K$11,4,FALSE))","v":"07:24:00"}]
["","","2018-06-06","","",{"$f":"IF(AND(Q168<>\"\",G168=\"\"),1,\"\")","v":1},"",{"$f":"IF(AND(D168=1,K168<>\"\"),1,\"\")","v":""},null,{"$f":"IF(HelligdagsNavn(C168,0,0)<>\"\",HelligdagsNavn(C168,0,0),C168)","v":"2018-06-06"},null,null,null,null,0,0,{"$f":"IF(OR(C168=\"\",D168=1),\"\",VLOOKUP(WEEKDAY($C168,2),Backend!$F$5:$K$11,4,FALSE))","v":"07:24:00"}]
["","","2018-06-07","","",{"$f":"IF(AND(Q169<>\"\",G169=\"\"),1,\"\")","v":1},"",{"$f":"IF(AND(D169=1,K169<>\"\"),1,\"\")","v":""},null,{"$f":"IF(HelligdagsNavn(C169,0,0)<>\"\",HelligdagsNavn(C169,0,0),C169)","v":"2018-06-07"},null,null,null,null,0,0,{"$f":"IF(OR(C169=\"\",D169=1),\"\",VLOOKUP(WEEKDAY($C169,2),Backend!$F$5:$K$11,4,FALSE))","v":"07:24:00"}]
["","","2018-06-08","","",{"$f":"IF(AND(Q170<>\"\",G170=\"\"),1,\"\")","v":1},"",{"$f":"IF(AND(D170=1,K170<>\"\"),1,\"\")","v":""},null,{"$f":"IF(HelligdagsNavn(C170,0,0)<>\"\",HelligdagsNavn(C170,0,0),C170)","v":"2018-06-08"},null,null,null,null,0,0,{"$f":"IF(OR(C170=\"\",D170=1),\"\",VLOOKUP(WEEKDAY($C170,2),Backend!$F$5:$K$11,4,FALSE))","v":"07:24:00"}]
["","","2018-06-09","","",{"$f":"IF(AND(Q171<>\"\",G171=\"\"),1,\"\")","v":1},"",{"$f":"IF(AND(D171=1,K171<>\"\"),1,\"\")","v":""},null,{"$f":"IF(HelligdagsNavn(C171,0,0)<>\"\",HelligdagsNavn(C171,0,0),C171)","v":"2018-06-09"},null,null,null,null,0,0,{"$f":"IF(OR(C171=\"\",D171=1),\"\",VLOOKUP(WEEKDAY($C171,2),Backend!$F$5:$K$11,4,FALSE))","v":"07:24:00"}]
["","","2018-06-10",1,"",{"$f":"IF(AND(Q172<>\"\",G172=\"\"),1,\"\")","v":""},"",{"$f":"IF(AND(D172=1,K172<>\"\"),1,\"\")","v":""},null,{"$f":"IF(HelligdagsNavn(C172,0,0)<>\"\",HelligdagsNavn(C172,0,0),C172)","v":"2018-06-10"},null,null,null,null,0,0,{"$f":"IF(OR(C172=\"\",D172=1),\"\",VLOOKUP(WEEKDAY($C172,2),Backend!$F$5:$K$11,4,FALSE))","v":""}]
["","","2018-06-11",1,"",{"$f":"IF(AND(Q173<>\"\",G173=\"\"),1,\"\")","v":""},"",{"$f":"IF(AND(D173=1,K173<>\"\"),1,\"\")","v":""},null,{"$f":"IF(HelligdagsNavn(C173,0,0)<>\"\",HelligdagsNavn(C173,0,0),C173)","v":"2018-06-11"},null,null,null,null,0,0,{"$f":"IF(OR(C173=\"\",D173=1),\"\",VLOOKUP(WEEKDAY($C173,2),Backend!$F$5:$K$11,4,FALSE))","v":""}]
["",24,"2018-06-12","","",{"$f":"IF(AND(Q174<>\"\",G174=\"\"),1,\"\")","v":1},"",{"$f":"IF(AND(D174=1,K174<>\"\"),1,\"\")","v":""},null,{"$f":"IF(HelligdagsNavn(C174,0,0)<>\"\",HelligdagsNavn(C174,0,0),C174)","v":"2018-06-12"},null,null,null,null,0,0,{"$f":"IF(OR(C174=\"\",D174=1),\"\",VLOOKUP(WEEKDAY($C174,2),Backend!$F$5:$K$11,4,FALSE))","v":"07:24:00"}]
["","","2018-06-13","","",{"$f":"IF(AND(Q175<>\"\",G175=\"\"),1,\"\")","v":1},"",{"$f":"IF(AND(D175=1,K175<>\"\"),1,\"\")","v":""},null,{"$f":"IF(HelligdagsNavn(C175,0,0)<>\"\",HelligdagsNavn(C175,0,0),C175)","v":"2018-06-13"},null,null,null,null,0,0,{"$f":"IF(OR(C175=\"\",D175=1),\"\",VLOOKUP(WEEKDAY($C175,2),Backend!$F$5:$K$11,4,FALSE))","v":"07:24:00"}]
["","","2018-06-14","","",{"$f":"IF(AND(Q176<>\"\",G176=\"\"),1,\"\")","v":1},"",{"$f":"IF(AND(D176=1,K176<>\"\"),1,\"\")","v":""},null,{"$f":"IF(HelligdagsNavn(C176,0,0)<>\"\",HelligdagsNavn(C176,0,0),C176)","v":"Valdemarsdag"},null,null,null,null,0,0,{"$f":"IF(OR(C176=\"\",D176=1),\"\",VLOOKUP(WEEKDAY($C176,2),Backend!$F$5:$K$11,4,FALSE))","v":"07:24:00"}]
["","","2018-06-15","","",{"$f":"IF(AND(Q177<>\"\",G177=\"\"),1,\"\")","v":1},"",{"$f":"IF(AND(D177=1,K177<>\"\"),1,\"\")","v":""},null,{"$f":"IF(HelligdagsNavn(C177,0,0)<>\"\",HelligdagsNavn(C177,0,0),C177)","v":"2018-06-15"},null,null,null,null,0,0,{"$f":"IF(OR(C177=\"\",D177=1),\"\",VLOOKUP(WEEKDAY($C177,2),Backend!$F$5:$K$11,4,FALSE))","v":"07:24:00"}]
["","","2018-06-16","","",{"$f":"IF(AND(Q178<>\"\",G178=\"\"),1,\"\")","v":1},"",{"$f":"IF(AND(D178=1,K178<>\"\"),1,\"\")","v":""},null,{"$f":"IF(HelligdagsNavn(C178,0,0)<>\"\",HelligdagsNavn(C178,0,0),C178)","v":"2018-06-16"},null,null,null,null,0,0,{"$f":"IF(OR(C178=\"\",D178=1),\"\",VLOOKUP(WEEKDAY($C178,2),Backend!$F$5:$K$11,4,FALSE))","v":"07:24:00"}]
["","","2018-06-17",1,"",{"$f":"IF(AND(Q179<>\"\",G179=\"\"),1,\"\")","v":""},"",{"$f":"IF(AND(D179=1,K179<>\"\"),1,\"\")","v":""},null,{"$f":"IF(HelligdagsNavn(C179,0,0)<>\"\",HelligdagsNavn(C179,0,0),C179)","v":"2018-06-17"},null,null,null,null,0,0,{"$f":"IF(OR(C179=\"\",D179=1),\"\",VLOOKUP(WEEKDAY($C179,2),Backend!$F$5:$K$11,4,FALSE))","v":""}]
["","","2018-06-18",1,"",{"$f":"IF(AND(Q180<>\"\",G180=\"\"),1,\"\")","v":""},"",{"$f":"IF(AND(D180=1,K180<>\"\"),1,\"\")","v":""},null,{"$f":"IF(HelligdagsNavn(C180,0,0)<>\"\",HelligdagsNavn(C180,0,0),C180)","v":"2018-06-18"},null,null,null,null,0,0,{"$f":"IF(OR(C180=\"\",D180=1),\"\",VLOOKUP(WEEKDAY($C180,2),Backend!$F$5:$K$11,4,FALSE))","v":""}]
["",25,"2018-06-19","","",{"$f":"IF(AND(Q181<>\"\",G181=\"\"),1,\"\")","v":1},"",{"$f":"IF(AND(D181=1,K181<>\"\"),1,\"\")","v":""},null,{"$f":"IF(HelligdagsNavn(C181,0,0)<>\"\",HelligdagsNavn(C181,0,0),C181)","v":"2018-06-19"},null,null,null,null,0,0,{"$f":"IF(OR(C181=\"\",D181=1),\"\",VLOOKUP(WEEKDAY($C181,2),Backend!$F$5:$K$11,4,FALSE))","v":"07:24:00"}]
["","","2018-06-20","","",{"$f":"IF(AND(Q182<>\"\",G182=\"\"),1,\"\")","v":1},"",{"$f":"IF(AND(D182=1,K182<>\"\"),1,\"\")","v":""},null,{"$f":"IF(HelligdagsNavn(C182,0,0)<>\"\",HelligdagsNavn(C182,0,0),C182)","v":"Sommersolhverv"},null,null,null,null,0,0,{"$f":"IF(OR(C182=\"\",D182=1),\"\",VLOOKUP(WEEKDAY($C182,2),Backend!$F$5:$K$11,4,FALSE))","v":"07:24:00"}]
["","","2018-06-21","","",{"$f":"IF(AND(Q183<>\"\",G183=\"\"),1,\"\")","v":1},"",{"$f":"IF(AND(D183=1,K183<>\"\"),1,\"\")","v":""},null,{"$f":"IF(HelligdagsNavn(C183,0,0)<>\"\",HelligdagsNavn(C183,0,0),C183)","v":"2018-06-21"},null,null,null,null,0,0,{"$f":"IF(OR(C183=\"\",D183=1),\"\",VLOOKUP(WEEKDAY($C183,2),Backend!$F$5:$K$11,4,FALSE))","v":"07:24:00"}]
["","","2018-06-22","","",{"$f":"IF(AND(Q184<>\"\",G184=\"\"),1,\"\")","v":1},"",{"$f":"IF(AND(D184=1,K184<>\"\"),1,\"\")","v":""},null,{"$f":"IF(HelligdagsNavn(C184,0,0)<>\"\",HelligdagsNavn(C184,0,0),C184)","v":"Sankt Hansaften"},null,null,null,null,0,0,{"$f":"IF(OR(C184=\"\",D184=1),\"\",VLOOKUP(WEEKDAY($C184,2),Backend!$F$5:$K$11,4,FALSE))","v":"07:24:00"}]
["","","2018-06-23","","",{"$f":"IF(AND(Q185<>\"\",G185=\"\"),1,\"\")","v":1},"",{"$f":"IF(AND(D185=1,K185<>\"\"),1,\"\")","v":""},null,{"$f":"IF(HelligdagsNavn(C185,0,0)<>\"\",HelligdagsNavn(C185,0,0),C185)","v":"Sankt Hansdag"},null,null,null,null,0,0,{"$f":"IF(OR(C185=\"\",D185=1),\"\",VLOOKUP(WEEKDAY($C185,2),Backend!$F$5:$K$11,4,FALSE))","v":"07:24:00"}]
["","","2018-06-24",1,"",{"$f":"IF(AND(Q186<>\"\",G186=\"\"),1,\"\")","v":""},"",{"$f":"IF(AND(D186=1,K186<>\"\"),1,\"\")","v":""},null,{"$f":"IF(HelligdagsNavn(C186,0,0)<>\"\",HelligdagsNavn(C186,0,0),C186)","v":"2018-06-24"},null,null,null,null,0,0,{"$f":"IF(OR(C186=\"\",D186=1),\"\",VLOOKUP(WEEKDAY($C186,2),Backend!$F$5:$K$11,4,FALSE))","v":""}]
["","","2018-06-25",1,"",{"$f":"IF(AND(Q187<>\"\",G187=\"\"),1,\"\")","v":""},"",{"$f":"IF(AND(D187=1,K187<>\"\"),1,\"\")","v":""},null,{"$f":"IF(HelligdagsNavn(C187,0,0)<>\"\",HelligdagsNavn(C187,0,0),C187)","v":"2018-06-25"},null,null,null,null,0,0,{"$f":"IF(OR(C187=\"\",D187=1),\"\",VLOOKUP(WEEKDAY($C187,2),Backend!$F$5:$K$11,4,FALSE))","v":""}]
["",26,"2018-06-26","","",{"$f":"IF(AND(Q188<>\"\",G188=\"\"),1,\"\")","v":1},"",{"$f":"IF(AND(D188=1,K188<>\"\"),1,\"\")","v":""},null,{"$f":"IF(HelligdagsNavn(C188,0,0)<>\"\",HelligdagsNavn(C188,0,0),C188)","v":"2018-06-26"},null,null,null,null,0,0,{"$f":"IF(OR(C188=\"\",D188=1),\"\",VLOOKUP(WEEKDAY($C188,2),Backend!$F$5:$K$11,4,FALSE))","v":"07:24:00"}]
["","","2018-06-27","","",{"$f":"IF(AND(Q189<>\"\",G189=\"\"),1,\"\")","v":1},"",{"$f":"IF(AND(D189=1,K189<>\"\"),1,\"\")","v":""},null,{"$f":"IF(HelligdagsNavn(C189,0,0)<>\"\",HelligdagsNavn(C189,0,0),C189)","v":"2018-06-27"},null,null,null,null,0,0,{"$f":"IF(OR(C189=\"\",D189=1),\"\",VLOOKUP(WEEKDAY($C189,2),Backend!$F$5:$K$11,4,FALSE))","v":"07:24:00"}]
["","","2018-06-28","","",{"$f":"IF(AND(Q190<>\"\",G190=\"\"),1,\"\")","v":1},"",{"$f":"IF(AND(D190=1,K190<>\"\"),1,\"\")","v":""},null,{"$f":"IF(HelligdagsNavn(C190,0,0)<>\"\",HelligdagsNavn(C190,0,0),C190)","v":"2018-06-28"},null,null,null,null,0,0,{"$f":"IF(OR(C190=\"\",D190=1),\"\",VLOOKUP(WEEKDAY($C190,2),Backend!$F$5:$K$11,4,FALSE))","v":"07:24:00"}]
["","","2018-06-29","","",{"$f":"IF(AND(Q191<>\"\",G191=\"\"),1,\"\")","v":1},"",{"$f":"IF(AND(D191=1,K191<>\"\"),1,\"\")","v":""},null,{"$f":"IF(HelligdagsNavn(C191,0,0)<>\"\",HelligdagsNavn(C191,0,0),C191)","v":"2018-06-29"},null,null,null,null,0,0,{"$f":"IF(OR(C191=\"\",D191=1),\"\",VLOOKUP(WEEKDAY($C191,2),Backend!$F$5:$K$11,4,FALSE))","v":"07:24:00"}]
["2018-06-30","","2018-06-30","","",{"$f":"IF(AND(Q192<>\"\",G192=\"\"),1,\"\")","v":1},"",{"$f":"IF(AND(D192=1,K192<>\"\"),1,\"\")","v":""},null,{"$f":"IF(HelligdagsNavn(C192,0,0)<>\"\",HelligdagsNavn(C192,0,0),C192)","v":"2018-06-30"},null,null,null,null,0,0,{"$f":"IF(OR(C192=\"\",D192=1),\"\",VLOOKUP(WEEKDAY($C192,2),Backend!$F$5:$K$11,4,FALSE))","v":"07:24:00"}]
["","","2018-07-01",1,"",{"$f":"IF(AND(Q193<>\"\",G193=\"\"),1,\"\")","v":""},"",{"$f":"IF(AND(D193=1,K193<>\"\"),1,\"\")","v":""},null,{"$f":"IF(HelligdagsNavn(C193,0,0)<>\"\",HelligdagsNavn(C193,0,0),C193)","v":"Maria Besøgelsesdag"},null,null,null,null,0,0,{"$f":"IF(OR(C193=\"\",D193=1),\"\",VLOOKUP(WEEKDAY($C193,2),Backend!$F$5:$K$11,4,FALSE))","v":""}]
["","","2018-07-02",1,"",{"$f":"IF(AND(Q194<>\"\",G194=\"\"),1,\"\")","v":""},"",{"$f":"IF(AND(D194=1,K194<>\"\"),1,\"\")","v":""},null,{"$f":"IF(HelligdagsNavn(C194,0,0)<>\"\",HelligdagsNavn(C194,0,0),C194)","v":"2018-07-02"},null,null,null,null,0,0,{"$f":"IF(OR(C194=\"\",D194=1),\"\",VLOOKUP(WEEKDAY($C194,2),Backend!$F$5:$K$11,4,FALSE))","v":""}]
["",27,"2018-07-03","","",{"$f":"IF(AND(Q195<>\"\",G195=\"\"),1,\"\")","v":1},"",{"$f":"IF(AND(D195=1,K195<>\"\"),1,\"\")","v":""},null,{"$f":"IF(HelligdagsNavn(C195,0,0)<>\"\",HelligdagsNavn(C195,0,0),C195)","v":"2018-07-03"},null,null,null,null,0,0,{"$f":"IF(OR(C195=\"\",D195=1),\"\",VLOOKUP(WEEKDAY($C195,2),Backend!$F$5:$K$11,4,FALSE))","v":"07:24:00"}]
["","","2018-07-04","","",{"$f":"IF(AND(Q196<>\"\",G196=\"\"),1,\"\")","v":1},"",{"$f":"IF(AND(D196=1,K196<>\"\"),1,\"\")","v":""},null,{"$f":"IF(HelligdagsNavn(C196,0,0)<>\"\",HelligdagsNavn(C196,0,0),C196)","v":"2018-07-04"},null,null,null,null,0,0,{"$f":"IF(OR(C196=\"\",D196=1),\"\",VLOOKUP(WEEKDAY($C196,2),Backend!$F$5:$K$11,4,FALSE))","v":"07:24:00"}]
["","","2018-07-05","","",{"$f":"IF(AND(Q197<>\"\",G197=\"\"),1,\"\")","v":1},"",{"$f":"IF(AND(D197=1,K197<>\"\"),1,\"\")","v":""},null,{"$f":"IF(HelligdagsNavn(C197,0,0)<>\"\",HelligdagsNavn(C197,0,0),C197)","v":"2018-07-05"},null,null,null,null,0,0,{"$f":"IF(OR(C197=\"\",D197=1),\"\",VLOOKUP(WEEKDAY($C197,2),Backend!$F$5:$K$11,4,FALSE))","v":"07:24:00"}]
["","","2018-07-06","","",{"$f":"IF(AND(Q198<>\"\",G198=\"\"),1,\"\")","v":1},"",{"$f":"IF(AND(D198=1,K198<>\"\"),1,\"\")","v":""},null,{"$f":"IF(HelligdagsNavn(C198,0,0)<>\"\",HelligdagsNavn(C198,0,0),C198)","v":"2018-07-06"},null,null,null,null,0,0,{"$f":"IF(OR(C198=\"\",D198=1),\"\",VLOOKUP(WEEKDAY($C198,2),Backend!$F$5:$K$11,4,FALSE))","v":"07:24:00"}]
["","","2018-07-07","","",{"$f":"IF(AND(Q199<>\"\",G199=\"\"),1,\"\")","v":1},"",{"$f":"IF(AND(D199=1,K199<>\"\"),1,\"\")","v":""},null,{"$f":"IF(HelligdagsNavn(C199,0,0)<>\"\",HelligdagsNavn(C199,0,0),C199)","v":"2018-07-07"},null,null,null,null,0,0,{"$f":"IF(OR(C199=\"\",D199=1),\"\",VLOOKUP(WEEKDAY($C199,2),Backend!$F$5:$K$11,4,FALSE))","v":"07:24:00"}]
["","","2018-07-08",1,"",{"$f":"IF(AND(Q200<>\"\",G200=\"\"),1,\"\")","v":""},"",{"$f":"IF(AND(D200=1,K200<>\"\"),1,\"\")","v":""},null,{"$f":"IF(HelligdagsNavn(C200,0,0)<>\"\",HelligdagsNavn(C200,0,0),C200)","v":"2018-07-08"},null,null,null,null,0,0,{"$f":"IF(OR(C200=\"\",D200=1),\"\",VLOOKUP(WEEKDAY($C200,2),Backend!$F$5:$K$11,4,FALSE))","v":""}]
["","","2018-07-09",1,"",{"$f":"IF(AND(Q201<>\"\",G201=\"\"),1,\"\")","v":""},"",{"$f":"IF(AND(D201=1,K201<>\"\"),1,\"\")","v":""},null,{"$f":"IF(HelligdagsNavn(C201,0,0)<>\"\",HelligdagsNavn(C201,0,0),C201)","v":"2018-07-09"},null,null,null,null,0,0,{"$f":"IF(OR(C201=\"\",D201=1),\"\",VLOOKUP(WEEKDAY($C201,2),Backend!$F$5:$K$11,4,FALSE))","v":""}]
["",28,"2018-07-10","","",{"$f":"IF(AND(Q202<>\"\",G202=\"\"),1,\"\")","v":1},"",{"$f":"IF(AND(D202=1,K202<>\"\"),1,\"\")","v":""},null,{"$f":"IF(HelligdagsNavn(C202,0,0)<>\"\",HelligdagsNavn(C202,0,0),C202)","v":"2018-07-10"},null,null,null,null,0,0,{"$f":"IF(OR(C202=\"\",D202=1),\"\",VLOOKUP(WEEKDAY($C202,2),Backend!$F$5:$K$11,4,FALSE))","v":"07:24:00"}]
["","","2018-07-11","","",{"$f":"IF(AND(Q203<>\"\",G203=\"\"),1,\"\")","v":1},{"$f":"IF(AND(K203<>\"\",$M203=\"Hjemmearbejdsdag\"),1,\"\")","v":""},{"$f":"IF(AND(D203=1,K203<>\"\"),1,\"\")","v":""},null,{"$f":"IF(HelligdagsNavn(C203,0,0)<>\"\",HelligdagsNavn(C203,0,0),C203)","v":"2018-07-11"},null,null,null,null,0,0,{"$f":"IF(OR(C203=\"\",D203=1),\"\",VLOOKUP(WEEKDAY($C203,2),Backend!$F$5:$K$11,4,FALSE))","v":"07:24:00"}]
[{"$f":"IF(DAY(C204)=1,C204,\"\")","v":""},{"$f":"IF(WEEKDAY(C204,2)=1,1+INT((C204-DATE(YEAR(C204+4-WEEKDAY(C204+6)),1,5)+WEEKDAY(DATE(YEAR(C204+4-WEEKDAY(C204+6)),1,3)))/7),\"\")","v":""},"2018-07-12",{"$f":"IF(OR(WEEKDAY(C204)=1,WEEKDAY(C204)=7),1,\"\")","v":""},{"$f":"IF(OR(M204=\"Feriefridag\",M204=\"Ferie med løn\",M204=\"Flex-fri\"),1,\"\")","v":""},{"$f":"IF(AND(Q204<>\"\",G204=\"\"),1,\"\")","v":1},"",{"$f":"IF(AND(D204=1,K204<>\"\"),1,\"\")","v":""},null,{"$f":"IF(HelligdagsNavn(C204,0,0)<>\"\",HelligdagsNavn(C204,0,0),C204)","v":"2018-07-12"},null,null,null,null,{"$f":"IF(OR(K204=\"\",L204=\"\"),0,IF(VALUE(K204)>=VALUE(L204),(TIME(TRUNC(L204/100),MOD(L204,100),0))+1-(TIME(TRUNC(K204/100),MOD(K204,100),0)),(TIME(TRUNC(L204/100),MOD(L204,100),0))-(TIME(TRUNC(K204/100),MOD(K204,100),0))))","v":0},{"$f":"O204*24","v":0},{"$f":"IF(OR(C204=\"\",D204=1),\"\",VLOOKUP(WEEKDAY($C204,2),Backend!$F$5:$K$11,4,FALSE))","v":"07:24:00"}]
["","",{"$f":"C204+1","v":"2018-07-13"},"","",{"$f":"IF(AND(Q205<>\"\",G205=\"\"),1,\"\")","v":1},"",{"$f":"IF(AND(D205=1,K205<>\"\"),1,\"\")","v":""},null,{"$f":"IF(HelligdagsNavn(C205,0,0)<>\"\",HelligdagsNavn(C205,0,0),C205)","v":"2018-07-13"},null,null,null,null,0,0,{"$f":"IF(OR(C205=\"\",D205=1),\"\",VLOOKUP(WEEKDAY($C205,2),Backend!$F$5:$K$11,4,FALSE))","v":"07:24:00"}]
["","","2018-07-14","","",{"$f":"IF(AND(Q206<>\"\",G206=\"\"),1,\"\")","v":1},"",{"$f":"IF(AND(D206=1,K206<>\"\"),1,\"\")","v":""},null,{"$f":"IF(HelligdagsNavn(C206,0,0)<>\"\",HelligdagsNavn(C206,0,0),C206)","v":"2018-07-14"},null,null,null,null,0,0,{"$f":"IF(OR(C206=\"\",D206=1),\"\",VLOOKUP(WEEKDAY($C206,2),Backend!$F$5:$K$11,4,FALSE))","v":"07:24:00"}]
["","","2018-07-15",1,"",{"$f":"IF(AND(Q207<>\"\",G207=\"\"),1,\"\")","v":""},"",{"$f":"IF(AND(D207=1,K207<>\"\"),1,\"\")","v":""},null,{"$f":"IF(HelligdagsNavn(C207,0,0)<>\"\",HelligdagsNavn(C207,0,0),C207)","v":"2018-07-15"},null,null,null,null,0,0,{"$f":"IF(OR(C207=\"\",D207=1),\"\",VLOOKUP(WEEKDAY($C207,2),Backend!$F$5:$K$11,4,FALSE))","v":""}]
["","","2018-07-16",1,"",{"$f":"IF(AND(Q208<>\"\",G208=\"\"),1,\"\")","v":""},"",{"$f":"IF(AND(D208=1,K208<>\"\"),1,\"\")","v":""},null,{"$f":"IF(HelligdagsNavn(C208,0,0)<>\"\",HelligdagsNavn(C208,0,0),C208)","v":"2018-07-16"},null,null,null,null,0,0,{"$f":"IF(OR(C208=\"\",D208=1),\"\",VLOOKUP(WEEKDAY($C208,2),Backend!$F$5:$K$11,4,FALSE))","v":""}]
["",29,"2018-07-17","","",{"$f":"IF(AND(Q209<>\"\",G209=\"\"),1,\"\")","v":1},"",{"$f":"IF(AND(D209=1,K209<>\"\"),1,\"\")","v":""},null,{"$f":"IF(HelligdagsNavn(C209,0,0)<>\"\",HelligdagsNavn(C209,0,0),C209)","v":"2018-07-17"},null,null,null,null,0,0,{"$f":"IF(OR(C209=\"\",D209=1),\"\",VLOOKUP(WEEKDAY($C209,2),Backend!$F$5:$K$11,4,FALSE))","v":"07:24:00"}]
["","","2018-07-18","","",{"$f":"IF(AND(Q210<>\"\",G210=\"\"),1,\"\")","v":1},"",{"$f":"IF(AND(D210=1,K210<>\"\"),1,\"\")","v":""},null,{"$f":"IF(HelligdagsNavn(C210,0,0)<>\"\",HelligdagsNavn(C210,0,0),C210)","v":"2018-07-18"},null,null,null,null,0,0,{"$f":"IF(OR(C210=\"\",D210=1),\"\",VLOOKUP(WEEKDAY($C210,2),Backend!$F$5:$K$11,4,FALSE))","v":"07:24:00"}]
["","","2018-07-19","","",{"$f":"IF(AND(Q211<>\"\",G211=\"\"),1,\"\")","v":1},"",{"$f":"IF(AND(D211=1,K211<>\"\"),1,\"\")","v":""},null,{"$f":"IF(HelligdagsNavn(C211,0,0)<>\"\",HelligdagsNavn(C211,0,0),C211)","v":"2018-07-19"},null,null,null,null,0,0,{"$f":"IF(OR(C211=\"\",D211=1),\"\",VLOOKUP(WEEKDAY($C211,2),Backend!$F$5:$K$11,4,FALSE))","v":"07:24:00"}]
["","","2018-07-20","","",{"$f":"IF(AND(Q212<>\"\",G212=\"\"),1,\"\")","v":1},"",{"$f":"IF(AND(D212=1,K212<>\"\"),1,\"\")","v":""},null,{"$f":"IF(HelligdagsNavn(C212,0,0)<>\"\",HelligdagsNavn(C212,0,0),C212)","v":"2018-07-20"},null,null,null,null,0,0,{"$f":"IF(OR(C212=\"\",D212=1),\"\",VLOOKUP(WEEKDAY($C212,2),Backend!$F$5:$K$11,4,FALSE))","v":"07:24:00"}]
["","","2018-07-21","","",{"$f":"IF(AND(Q213<>\"\",G213=\"\"),1,\"\")","v":1},"",{"$f":"IF(AND(D213=1,K213<>\"\"),1,\"\")","v":""},null,{"$f":"IF(HelligdagsNavn(C213,0,0)<>\"\",HelligdagsNavn(C213,0,0),C213)","v":"2018-07-21"},null,null,null,null,0,0,{"$f":"IF(OR(C213=\"\",D213=1),\"\",VLOOKUP(WEEKDAY($C213,2),Backend!$F$5:$K$11,4,FALSE))","v":"07:24:00"}]
["","","2018-07-22",1,"",{"$f":"IF(AND(Q214<>\"\",G214=\"\"),1,\"\")","v":""},"",{"$f":"IF(AND(D214=1,K214<>\"\"),1,\"\")","v":""},null,{"$f":"IF(HelligdagsNavn(C214,0,0)<>\"\",HelligdagsNavn(C214,0,0),C214)","v":"2018-07-22"},null,null,null,null,0,0,{"$f":"IF(OR(C214=\"\",D214=1),\"\",VLOOKUP(WEEKDAY($C214,2),Backend!$F$5:$K$11,4,FALSE))","v":""}]
["","","2018-07-23",1,"",{"$f":"IF(AND(Q215<>\"\",G215=\"\"),1,\"\")","v":""},"",{"$f":"IF(AND(D215=1,K215<>\"\"),1,\"\")","v":""},null,{"$f":"IF(HelligdagsNavn(C215,0,0)<>\"\",HelligdagsNavn(C215,0,0),C215)","v":"2018-07-23"},null,null,null,null,0,0,{"$f":"IF(OR(C215=\"\",D215=1),\"\",VLOOKUP(WEEKDAY($C215,2),Backend!$F$5:$K$11,4,FALSE))","v":""}]
["",30,"2018-07-24","","",{"$f":"IF(AND(Q216<>\"\",G216=\"\"),1,\"\")","v":1},"",{"$f":"IF(AND(D216=1,K216<>\"\"),1,\"\")","v":""},null,{"$f":"IF(HelligdagsNavn(C216,0,0)<>\"\",HelligdagsNavn(C216,0,0),C216)","v":"2018-07-24"},null,null,null,null,0,0,{"$f":"IF(OR(C216=\"\",D216=1),\"\",VLOOKUP(WEEKDAY($C216,2),Backend!$F$5:$K$11,4,FALSE))","v":"07:24:00"}]
["","","2018-07-25","","",{"$f":"IF(AND(Q217<>\"\",G217=\"\"),1,\"\")","v":1},"",{"$f":"IF(AND(D217=1,K217<>\"\"),1,\"\")","v":""},null,{"$f":"IF(HelligdagsNavn(C217,0,0)<>\"\",HelligdagsNavn(C217,0,0),C217)","v":"2018-07-25"},null,null,null,null,0,0,{"$f":"IF(OR(C217=\"\",D217=1),\"\",VLOOKUP(WEEKDAY($C217,2),Backend!$F$5:$K$11,4,FALSE))","v":"07:24:00"}]
["","","2018-07-26","","",{"$f":"IF(AND(Q218<>\"\",G218=\"\"),1,\"\")","v":1},"",{"$f":"IF(AND(D218=1,K218<>\"\"),1,\"\")","v":""},null,{"$f":"IF(HelligdagsNavn(C218,0,0)<>\"\",HelligdagsNavn(C218,0,0),C218)","v":"2018-07-26"},null,null,null,null,0,0,{"$f":"IF(OR(C218=\"\",D218=1),\"\",VLOOKUP(WEEKDAY($C218,2),Backend!$F$5:$K$11,4,FALSE))","v":"07:24:00"}]
["","","2018-07-27","","",{"$f":"IF(AND(Q219<>\"\",G219=\"\"),1,\"\")","v":1},"",{"$f":"IF(AND(D219=1,K219<>\"\"),1,\"\")","v":""},null,{"$f":"IF(HelligdagsNavn(C219,0,0)<>\"\",HelligdagsNavn(C219,0,0),C219)","v":"2018-07-27"},null,null,null,null,0,0,{"$f":"IF(OR(C219=\"\",D219=1),\"\",VLOOKUP(WEEKDAY($C219,2),Backend!$F$5:$K$11,4,FALSE))","v":"07:24:00"}]
["","","2018-07-28","","",{"$f":"IF(AND(Q220<>\"\",G220=\"\"),1,\"\")","v":1},"",{"$f":"IF(AND(D220=1,K220<>\"\"),1,\"\")","v":""},null,{"$f":"IF(HelligdagsNavn(C220,0,0)<>\"\",HelligdagsNavn(C220,0,0),C220)","v":"2018-07-28"},null,null,null,null,0,0,{"$f":"IF(OR(C220=\"\",D220=1),\"\",VLOOKUP(WEEKDAY($C220,2),Backend!$F$5:$K$11,4,FALSE))","v":"07:24:00"}]
["","","2018-07-29",1,"",{"$f":"IF(AND(Q221<>\"\",G221=\"\"),1,\"\")","v":""},"",{"$f":"IF(AND(D221=1,K221<>\"\"),1,\"\")","v":""},null,{"$f":"IF(HelligdagsNavn(C221,0,0)<>\"\",HelligdagsNavn(C221,0,0),C221)","v":"2018-07-29"},null,null,null,null,0,0,{"$f":"IF(OR(C221=\"\",D221=1),\"\",VLOOKUP(WEEKDAY($C221,2),Backend!$F$5:$K$11,4,FALSE))","v":""}]
["","","2018-07-30",1,"",{"$f":"IF(AND(Q222<>\"\",G222=\"\"),1,\"\")","v":""},"",{"$f":"IF(AND(D222=1,K222<>\"\"),1,\"\")","v":""},null,{"$f":"IF(HelligdagsNavn(C222,0,0)<>\"\",HelligdagsNavn(C222,0,0),C222)","v":"2018-07-30"},null,null,null,null,0,0,{"$f":"IF(OR(C222=\"\",D222=1),\"\",VLOOKUP(WEEKDAY($C222,2),Backend!$F$5:$K$11,4,FALSE))","v":""}]
["2018-07-31",31,"2018-07-31","","",{"$f":"IF(AND(Q223<>\"\",G223=\"\"),1,\"\")","v":1},"",{"$f":"IF(AND(D223=1,K223<>\"\"),1,\"\")","v":""},null,{"$f":"IF(HelligdagsNavn(C223,0,0)<>\"\",HelligdagsNavn(C223,0,0),C223)","v":"2018-07-31"},null,null,null,null,0,0,{"$f":"IF(OR(C223=\"\",D223=1),\"\",VLOOKUP(WEEKDAY($C223,2),Backend!$F$5:$K$11,4,FALSE))","v":"07:24:00"}]
["","","2018-08-01","","",{"$f":"IF(AND(Q224<>\"\",G224=\"\"),1,\"\")","v":1},"",{"$f":"IF(AND(D224=1,K224<>\"\"),1,\"\")","v":""},null,{"$f":"IF(HelligdagsNavn(C224,0,0)<>\"\",HelligdagsNavn(C224,0,0),C224)","v":"2018-08-01"},null,null,null,null,0,0,{"$f":"IF(OR(C224=\"\",D224=1),\"\",VLOOKUP(WEEKDAY($C224,2),Backend!$F$5:$K$11,4,FALSE))","v":"07:24:00"}]
["","","2018-08-02","","",{"$f":"IF(AND(Q225<>\"\",G225=\"\"),1,\"\")","v":1},"",{"$f":"IF(AND(D225=1,K225<>\"\"),1,\"\")","v":""},null,{"$f":"IF(HelligdagsNavn(C225,0,0)<>\"\",HelligdagsNavn(C225,0,0),C225)","v":"2018-08-02"},null,null,null,null,0,0,{"$f":"IF(OR(C225=\"\",D225=1),\"\",VLOOKUP(WEEKDAY($C225,2),Backend!$F$5:$K$11,4,FALSE))","v":"07:24:00"}]
["","","2018-08-03","","",{"$f":"IF(AND(Q226<>\"\",G226=\"\"),1,\"\")","v":1},"",{"$f":"IF(AND(D226=1,K226<>\"\"),1,\"\")","v":""},null,{"$f":"IF(HelligdagsNavn(C226,0,0)<>\"\",HelligdagsNavn(C226,0,0),C226)","v":"2018-08-03"},null,null,null,null,0,0,{"$f":"IF(OR(C226=\"\",D226=1),\"\",VLOOKUP(WEEKDAY($C226,2),Backend!$F$5:$K$11,4,FALSE))","v":"07:24:00"}]
["","","2018-08-04","","",{"$f":"IF(AND(Q227<>\"\",G227=\"\"),1,\"\")","v":1},"",{"$f":"IF(AND(D227=1,K227<>\"\"),1,\"\")","v":""},null,{"$f":"IF(HelligdagsNavn(C227,0,0)<>\"\",HelligdagsNavn(C227,0,0),C227)","v":"2018-08-04"},null,null,null,null,0,0,{"$f":"IF(OR(C227=\"\",D227=1),\"\",VLOOKUP(WEEKDAY($C227,2),Backend!$F$5:$K$11,4,FALSE))","v":"07:24:00"}]
["","","2018-08-05",1,"",{"$f":"IF(AND(Q228<>\"\",G228=\"\"),1,\"\")","v":""},"",{"$f":"IF(AND(D228=1,K228<>\"\"),1,\"\")","v":""},null,{"$f":"IF(HelligdagsNavn(C228,0,0)<>\"\",HelligdagsNavn(C228,0,0),C228)","v":"2018-08-05"},null,null,null,null,0,0,{"$f":"IF(OR(C228=\"\",D228=1),\"\",VLOOKUP(WEEKDAY($C228,2),Backend!$F$5:$K$11,4,FALSE))","v":""}]
["","","2018-08-06",1,"",{"$f":"IF(AND(Q229<>\"\",G229=\"\"),1,\"\")","v":""},"",{"$f":"IF(AND(D229=1,K229<>\"\"),1,\"\")","v":""},null,{"$f":"IF(HelligdagsNavn(C229,0,0)<>\"\",HelligdagsNavn(C229,0,0),C229)","v":"2018-08-06"},null,null,null,null,0,0,{"$f":"IF(OR(C229=\"\",D229=1),\"\",VLOOKUP(WEEKDAY($C229,2),Backend!$F$5:$K$11,4,FALSE))","v":""}]
["",32,"2018-08-07","","",{"$f":"IF(AND(Q230<>\"\",G230=\"\"),1,\"\")","v":1},"",{"$f":"IF(AND(D230=1,K230<>\"\"),1,\"\")","v":""},null,{"$f":"IF(HelligdagsNavn(C230,0,0)<>\"\",HelligdagsNavn(C230,0,0),C230)","v":"2018-08-07"},null,null,null,null,0,0,{"$f":"IF(OR(C230=\"\",D230=1),\"\",VLOOKUP(WEEKDAY($C230,2),Backend!$F$5:$K$11,4,FALSE))","v":"07:24:00"}]
["","","2018-08-08","","",{"$f":"IF(AND(Q231<>\"\",G231=\"\"),1,\"\")","v":1},"",{"$f":"IF(AND(D231=1,K231<>\"\"),1,\"\")","v":""},null,{"$f":"IF(HelligdagsNavn(C231,0,0)<>\"\",HelligdagsNavn(C231,0,0),C231)","v":"2018-08-08"},null,null,null,null,0,0,{"$f":"IF(OR(C231=\"\",D231=1),\"\",VLOOKUP(WEEKDAY($C231,2),Backend!$F$5:$K$11,4,FALSE))","v":"07:24:00"}]
["","","2018-08-09","","",{"$f":"IF(AND(Q232<>\"\",G232=\"\"),1,\"\")","v":1},"",{"$f":"IF(AND(D232=1,K232<>\"\"),1,\"\")","v":""},null,{"$f":"IF(HelligdagsNavn(C232,0,0)<>\"\",HelligdagsNavn(C232,0,0),C232)","v":"2018-08-09"},null,null,null,null,0,0,{"$f":"IF(OR(C232=\"\",D232=1),\"\",VLOOKUP(WEEKDAY($C232,2),Backend!$F$5:$K$11,4,FALSE))","v":"07:24:00"}]
["","","2018-08-10","","",{"$f":"IF(AND(Q233<>\"\",G233=\"\"),1,\"\")","v":1},"",{"$f":"IF(AND(D233=1,K233<>\"\"),1,\"\")","v":""},null,{"$f":"IF(HelligdagsNavn(C233,0,0)<>\"\",HelligdagsNavn(C233,0,0),C233)","v":"2018-08-10"},null,null,null,null,0,0,{"$f":"IF(OR(C233=\"\",D233=1),\"\",VLOOKUP(WEEKDAY($C233,2),Backend!$F$5:$K$11,4,FALSE))","v":"07:24:00"}]
["","","2018-08-11","","",{"$f":"IF(AND(Q234<>\"\",G234=\"\"),1,\"\")","v":1},"",{"$f":"IF(AND(D234=1,K234<>\"\"),1,\"\")","v":""},null,{"$f":"IF(HelligdagsNavn(C234,0,0)<>\"\",HelligdagsNavn(C234,0,0),C234)","v":"2018-08-11"},null,null,null,null,0,0,{"$f":"IF(OR(C234=\"\",D234=1),\"\",VLOOKUP(WEEKDAY($C234,2),Backend!$F$5:$K$11,4,FALSE))","v":"07:24:00"}]
["","","2018-08-12",1,"",{"$f":"IF(AND(Q235<>\"\",G235=\"\"),1,\"\")","v":""},"",{"$f":"IF(AND(D235=1,K235<>\"\"),1,\"\")","v":""},null,{"$f":"IF(HelligdagsNavn(C235,0,0)<>\"\",HelligdagsNavn(C235,0,0),C235)","v":"2018-08-12"},null,null,null,null,0,0,{"$f":"IF(OR(C235=\"\",D235=1),\"\",VLOOKUP(WEEKDAY($C235,2),Backend!$F$5:$K$11,4,FALSE))","v":""}]
["","","2018-08-13",1,"",{"$f":"IF(AND(Q236<>\"\",G236=\"\"),1,\"\")","v":""},"",{"$f":"IF(AND(D236=1,K236<>\"\"),1,\"\")","v":""},null,{"$f":"IF(HelligdagsNavn(C236,0,0)<>\"\",HelligdagsNavn(C236,0,0),C236)","v":"2018-08-13"},null,null,null,null,0,0,{"$f":"IF(OR(C236=\"\",D236=1),\"\",VLOOKUP(WEEKDAY($C236,2),Backend!$F$5:$K$11,4,FALSE))","v":""}]
["",33,"2018-08-14","","",{"$f":"IF(AND(Q237<>\"\",G237=\"\"),1,\"\")","v":1},"",{"$f":"IF(AND(D237=1,K237<>\"\"),1,\"\")","v":""},null,{"$f":"IF(HelligdagsNavn(C237,0,0)<>\"\",HelligdagsNavn(C237,0,0),C237)","v":"2018-08-14"},null,null,null,null,0,0,{"$f":"IF(OR(C237=\"\",D237=1),\"\",VLOOKUP(WEEKDAY($C237,2),Backend!$F$5:$K$11,4,FALSE))","v":"07:24:00"}]
["","","2018-08-15","","",{"$f":"IF(AND(Q238<>\"\",G238=\"\"),1,\"\")","v":1},"",{"$f":"IF(AND(D238=1,K238<>\"\"),1,\"\")","v":""},null,{"$f":"IF(HelligdagsNavn(C238,0,0)<>\"\",HelligdagsNavn(C238,0,0),C238)","v":"2018-08-15"},null,null,null,null,0,0,{"$f":"IF(OR(C238=\"\",D238=1),\"\",VLOOKUP(WEEKDAY($C238,2),Backend!$F$5:$K$11,4,FALSE))","v":"07:24:00"}]
["","","2018-08-16","","",{"$f":"IF(AND(Q239<>\"\",G239=\"\"),1,\"\")","v":1},"",{"$f":"IF(AND(D239=1,K239<>\"\"),1,\"\")","v":""},null,{"$f":"IF(HelligdagsNavn(C239,0,0)<>\"\",HelligdagsNavn(C239,0,0),C239)","v":"2018-08-16"},null,null,null,null,0,0,{"$f":"IF(OR(C239=\"\",D239=1),\"\",VLOOKUP(WEEKDAY($C239,2),Backend!$F$5:$K$11,4,FALSE))","v":"07:24:00"}]
["","","2018-08-17","","",{"$f":"IF(AND(Q240<>\"\",G240=\"\"),1,\"\")","v":1},"",{"$f":"IF(AND(D240=1,K240<>\"\"),1,\"\")","v":""},null,{"$f":"IF(HelligdagsNavn(C240,0,0)<>\"\",HelligdagsNavn(C240,0,0),C240)","v":"2018-08-17"},null,null,null,null,0,0,{"$f":"IF(OR(C240=\"\",D240=1),\"\",VLOOKUP(WEEKDAY($C240,2),Backend!$F$5:$K$11,4,FALSE))","v":"07:24:00"}]
["","","2018-08-18","","",{"$f":"IF(AND(Q241<>\"\",G241=\"\"),1,\"\")","v":1},"",{"$f":"IF(AND(D241=1,K241<>\"\"),1,\"\")","v":""},null,{"$f":"IF(HelligdagsNavn(C241,0,0)<>\"\",HelligdagsNavn(C241,0,0),C241)","v":"2018-08-18"},null,null,null,null,0,0,{"$f":"IF(OR(C241=\"\",D241=1),\"\",VLOOKUP(WEEKDAY($C241,2),Backend!$F$5:$K$11,4,FALSE))","v":"07:24:00"}]
["","","2018-08-19",1,"",{"$f":"IF(AND(Q242<>\"\",G242=\"\"),1,\"\")","v":""},"",{"$f":"IF(AND(D242=1,K242<>\"\"),1,\"\")","v":""},null,{"$f":"IF(HelligdagsNavn(C242,0,0)<>\"\",HelligdagsNavn(C242,0,0),C242)","v":"2018-08-19"},null,null,null,null,0,0,{"$f":"IF(OR(C242=\"\",D242=1),\"\",VLOOKUP(WEEKDAY($C242,2),Backend!$F$5:$K$11,4,FALSE))","v":""}]
["","","2018-08-20",1,"",{"$f":"IF(AND(Q243<>\"\",G243=\"\"),1,\"\")","v":""},"",{"$f":"IF(AND(D243=1,K243<>\"\"),1,\"\")","v":""},null,{"$f":"IF(HelligdagsNavn(C243,0,0)<>\"\",HelligdagsNavn(C243,0,0),C243)","v":"2018-08-20"},null,null,null,null,0,0,{"$f":"IF(OR(C243=\"\",D243=1),\"\",VLOOKUP(WEEKDAY($C243,2),Backend!$F$5:$K$11,4,FALSE))","v":""}]
["",34,"2018-08-21","","",{"$f":"IF(AND(Q244<>\"\",G244=\"\"),1,\"\")","v":1},"",{"$f":"IF(AND(D244=1,K244<>\"\"),1,\"\")","v":""},null,{"$f":"IF(HelligdagsNavn(C244,0,0)<>\"\",HelligdagsNavn(C244,0,0),C244)","v":"2018-08-21"},null,null,null,null,0,0,{"$f":"IF(OR(C244=\"\",D244=1),\"\",VLOOKUP(WEEKDAY($C244,2),Backend!$F$5:$K$11,4,FALSE))","v":"07:24:00"}]
["","","2018-08-22","","",{"$f":"IF(AND(Q245<>\"\",G245=\"\"),1,\"\")","v":1},"",{"$f":"IF(AND(D245=1,K245<>\"\"),1,\"\")","v":""},null,{"$f":"IF(HelligdagsNavn(C245,0,0)<>\"\",HelligdagsNavn(C245,0,0),C245)","v":"2018-08-22"},null,null,null,null,0,0,{"$f":"IF(OR(C245=\"\",D245=1),\"\",VLOOKUP(WEEKDAY($C245,2),Backend!$F$5:$K$11,4,FALSE))","v":"07:24:00"}]
["","","2018-08-23","","",{"$f":"IF(AND(Q246<>\"\",G246=\"\"),1,\"\")","v":1},"",{"$f":"IF(AND(D246=1,K246<>\"\"),1,\"\")","v":""},null,{"$f":"IF(HelligdagsNavn(C246,0,0)<>\"\",HelligdagsNavn(C246,0,0),C246)","v":"2018-08-23"},null,null,null,null,0,0,{"$f":"IF(OR(C246=\"\",D246=1),\"\",VLOOKUP(WEEKDAY($C246,2),Backend!$F$5:$K$11,4,FALSE))","v":"07:24:00"}]
["","","2018-08-24","","",{"$f":"IF(AND(Q247<>\"\",G247=\"\"),1,\"\")","v":1},"",{"$f":"IF(AND(D247=1,K247<>\"\"),1,\"\")","v":""},null,{"$f":"IF(HelligdagsNavn(C247,0,0)<>\"\",HelligdagsNavn(C247,0,0),C247)","v":"2018-08-24"},null,null,null,null,0,0,{"$f":"IF(OR(C247=\"\",D247=1),\"\",VLOOKUP(WEEKDAY($C247,2),Backend!$F$5:$K$11,4,FALSE))","v":"07:24:00"}]
["","","2018-08-25","","",{"$f":"IF(AND(Q248<>\"\",G248=\"\"),1,\"\")","v":1},"",{"$f":"IF(AND(D248=1,K248<>\"\"),1,\"\")","v":""},null,{"$f":"IF(HelligdagsNavn(C248,0,0)<>\"\",HelligdagsNavn(C248,0,0),C248)","v":"2018-08-25"},null,null,null,null,0,0,{"$f":"IF(OR(C248=\"\",D248=1),\"\",VLOOKUP(WEEKDAY($C248,2),Backend!$F$5:$K$11,4,FALSE))","v":"07:24:00"}]
["","","2018-08-26",1,"",{"$f":"IF(AND(Q249<>\"\",G249=\"\"),1,\"\")","v":""},"",{"$f":"IF(AND(D249=1,K249<>\"\"),1,\"\")","v":""},null,{"$f":"IF(HelligdagsNavn(C249,0,0)<>\"\",HelligdagsNavn(C249,0,0),C249)","v":"2018-08-26"},null,null,null,null,0,0,{"$f":"IF(OR(C249=\"\",D249=1),\"\",VLOOKUP(WEEKDAY($C249,2),Backend!$F$5:$K$11,4,FALSE))","v":""}]
["","","2018-08-27",1,"",{"$f":"IF(AND(Q250<>\"\",G250=\"\"),1,\"\")","v":""},"",{"$f":"IF(AND(D250=1,K250<>\"\"),1,\"\")","v":""},null,{"$f":"IF(HelligdagsNavn(C250,0,0)<>\"\",HelligdagsNavn(C250,0,0),C250)","v":"2018-08-27"},null,null,null,null,0,0,{"$f":"IF(OR(C250=\"\",D250=1),\"\",VLOOKUP(WEEKDAY($C250,2),Backend!$F$5:$K$11,4,FALSE))","v":""}]
["",35,"2018-08-28","","",{"$f":"IF(AND(Q251<>\"\",G251=\"\"),1,\"\")","v":1},"",{"$f":"IF(AND(D251=1,K251<>\"\"),1,\"\")","v":""},null,{"$f":"IF(HelligdagsNavn(C251,0,0)<>\"\",HelligdagsNavn(C251,0,0),C251)","v":"2018-08-28"},null,null,null,null,0,0,{"$f":"IF(OR(C251=\"\",D251=1),\"\",VLOOKUP(WEEKDAY($C251,2),Backend!$F$5:$K$11,4,FALSE))","v":"07:24:00"}]
["","","2018-08-29","","",{"$f":"IF(AND(Q252<>\"\",G252=\"\"),1,\"\")","v":1},"",{"$f":"IF(AND(D252=1,K252<>\"\"),1,\"\")","v":""},null,{"$f":"IF(HelligdagsNavn(C252,0,0)<>\"\",HelligdagsNavn(C252,0,0),C252)","v":"2018-08-29"},null,null,null,null,0,0,{"$f":"IF(OR(C252=\"\",D252=1),\"\",VLOOKUP(WEEKDAY($C252,2),Backend!$F$5:$K$11,4,FALSE))","v":"07:24:00"}]
["","","2018-08-30","","",{"$f":"IF(AND(Q253<>\"\",G253=\"\"),1,\"\")","v":1},"",{"$f":"IF(AND(D253=1,K253<>\"\"),1,\"\")","v":""},null,{"$f":"IF(HelligdagsNavn(C253,0,0)<>\"\",HelligdagsNavn(C253,0,0),C253)","v":"2018-08-30"},null,null,null,null,0,0,{"$f":"IF(OR(C253=\"\",D253=1),\"\",VLOOKUP(WEEKDAY($C253,2),Backend!$F$5:$K$11,4,FALSE))","v":"07:24:00"}]
["2018-08-31","","2018-08-31","","",{"$f":"IF(AND(Q254<>\"\",G254=\"\"),1,\"\")","v":1},"",{"$f":"IF(AND(D254=1,K254<>\"\"),1,\"\")","v":""},null,{"$f":"IF(HelligdagsNavn(C254,0,0)<>\"\",HelligdagsNavn(C254,0,0),C254)","v":"2018-08-31"},null,null,null,null,0,0,{"$f":"IF(OR(C254=\"\",D254=1),\"\",VLOOKUP(WEEKDAY($C254,2),Backend!$F$5:$K$11,4,FALSE))","v":"07:24:00"}]
["","","2018-09-01","","",{"$f":"IF(AND(Q255<>\"\",G255=\"\"),1,\"\")","v":1},"",{"$f":"IF(AND(D255=1,K255<>\"\"),1,\"\")","v":""},null,{"$f":"IF(HelligdagsNavn(C255,0,0)<>\"\",HelligdagsNavn(C255,0,0),C255)","v":"2018-09-01"},null,null,null,null,0,0,{"$f":"IF(OR(C255=\"\",D255=1),\"\",VLOOKUP(WEEKDAY($C255,2),Backend!$F$5:$K$11,4,FALSE))","v":"07:24:00"}]
["","","2018-09-02",1,"",{"$f":"IF(AND(Q256<>\"\",G256=\"\"),1,\"\")","v":""},"",{"$f":"IF(AND(D256=1,K256<>\"\"),1,\"\")","v":""},null,{"$f":"IF(HelligdagsNavn(C256,0,0)<>\"\",HelligdagsNavn(C256,0,0),C256)","v":"2018-09-02"},null,null,null,null,0,0,{"$f":"IF(OR(C256=\"\",D256=1),\"\",VLOOKUP(WEEKDAY($C256,2),Backend!$F$5:$K$11,4,FALSE))","v":""}]
["","","2018-09-03",1,"",{"$f":"IF(AND(Q257<>\"\",G257=\"\"),1,\"\")","v":""},"",{"$f":"IF(AND(D257=1,K257<>\"\"),1,\"\")","v":""},null,{"$f":"IF(HelligdagsNavn(C257,0,0)<>\"\",HelligdagsNavn(C257,0,0),C257)","v":"2018-09-03"},null,null,null,null,0,0,{"$f":"IF(OR(C257=\"\",D257=1),\"\",VLOOKUP(WEEKDAY($C257,2),Backend!$F$5:$K$11,4,FALSE))","v":""}]
["",36,"2018-09-04","","",{"$f":"IF(AND(Q258<>\"\",G258=\"\"),1,\"\")","v":1},"",{"$f":"IF(AND(D258=1,K258<>\"\"),1,\"\")","v":""},null,{"$f":"IF(HelligdagsNavn(C258,0,0)<>\"\",HelligdagsNavn(C258,0,0),C258)","v":"2018-09-04"},null,null,null,null,0,0,{"$f":"IF(OR(C258=\"\",D258=1),\"\",VLOOKUP(WEEKDAY($C258,2),Backend!$F$5:$K$11,4,FALSE))","v":"07:24:00"}]
["","","2018-09-05","","",{"$f":"IF(AND(Q259<>\"\",G259=\"\"),1,\"\")","v":1},"",{"$f":"IF(AND(D259=1,K259<>\"\"),1,\"\")","v":""},null,{"$f":"IF(HelligdagsNavn(C259,0,0)<>\"\",HelligdagsNavn(C259,0,0),C259)","v":"2018-09-05"},null,null,null,null,0,0,{"$f":"IF(OR(C259=\"\",D259=1),\"\",VLOOKUP(WEEKDAY($C259,2),Backend!$F$5:$K$11,4,FALSE))","v":"07:24:00"}]
["","","2018-09-06","","",{"$f":"IF(AND(Q260<>\"\",G260=\"\"),1,\"\")","v":1},"",{"$f":"IF(AND(D260=1,K260<>\"\"),1,\"\")","v":""},null,{"$f":"IF(HelligdagsNavn(C260,0,0)<>\"\",HelligdagsNavn(C260,0,0),C260)","v":"2018-09-06"},null,null,null,null,0,0,{"$f":"IF(OR(C260=\"\",D260=1),\"\",VLOOKUP(WEEKDAY($C260,2),Backend!$F$5:$K$11,4,FALSE))","v":"07:24:00"}]
["","","2018-09-07","","",{"$f":"IF(AND(Q261<>\"\",G261=\"\"),1,\"\")","v":1},"",{"$f":"IF(AND(D261=1,K261<>\"\"),1,\"\")","v":""},null,{"$f":"IF(HelligdagsNavn(C261,0,0)<>\"\",HelligdagsNavn(C261,0,0),C261)","v":"2018-09-07"},null,null,null,null,0,0,{"$f":"IF(OR(C261=\"\",D261=1),\"\",VLOOKUP(WEEKDAY($C261,2),Backend!$F$5:$K$11,4,FALSE))","v":"07:24:00"}]
["","","2018-09-08","","",{"$f":"IF(AND(Q262<>\"\",G262=\"\"),1,\"\")","v":1},"",{"$f":"IF(AND(D262=1,K262<>\"\"),1,\"\")","v":""},null,{"$f":"IF(HelligdagsNavn(C262,0,0)<>\"\",HelligdagsNavn(C262,0,0),C262)","v":"2018-09-08"},null,null,null,null,0,0,{"$f":"IF(OR(C262=\"\",D262=1),\"\",VLOOKUP(WEEKDAY($C262,2),Backend!$F$5:$K$11,4,FALSE))","v":"07:24:00"}]
["","","2018-09-09",1,"",{"$f":"IF(AND(Q263<>\"\",G263=\"\"),1,\"\")","v":""},"",{"$f":"IF(AND(D263=1,K263<>\"\"),1,\"\")","v":""},null,{"$f":"IF(HelligdagsNavn(C263,0,0)<>\"\",HelligdagsNavn(C263,0,0),C263)","v":"2018-09-09"},null,null,null,null,0,0,{"$f":"IF(OR(C263=\"\",D263=1),\"\",VLOOKUP(WEEKDAY($C263,2),Backend!$F$5:$K$11,4,FALSE))","v":""}]
["","","2018-09-10",1,"",{"$f":"IF(AND(Q264<>\"\",G264=\"\"),1,\"\")","v":""},"",{"$f":"IF(AND(D264=1,K264<>\"\"),1,\"\")","v":""},null,{"$f":"IF(HelligdagsNavn(C264,0,0)<>\"\",HelligdagsNavn(C264,0,0),C264)","v":"2018-09-10"},null,null,null,null,0,0,{"$f":"IF(OR(C264=\"\",D264=1),\"\",VLOOKUP(WEEKDAY($C264,2),Backend!$F$5:$K$11,4,FALSE))","v":""}]
["",37,"2018-09-11","","",{"$f":"IF(AND(Q265<>\"\",G265=\"\"),1,\"\")","v":1},"",{"$f":"IF(AND(D265=1,K265<>\"\"),1,\"\")","v":""},null,{"$f":"IF(HelligdagsNavn(C265,0,0)<>\"\",HelligdagsNavn(C265,0,0),C265)","v":"2018-09-11"},null,null,null,null,0,0,{"$f":"IF(OR(C265=\"\",D265=1),\"\",VLOOKUP(WEEKDAY($C265,2),Backend!$F$5:$K$11,4,FALSE))","v":"07:24:00"}]
["","","2018-09-12","","",{"$f":"IF(AND(Q266<>\"\",G266=\"\"),1,\"\")","v":1},"",{"$f":"IF(AND(D266=1,K266<>\"\"),1,\"\")","v":""},null,{"$f":"IF(HelligdagsNavn(C266,0,0)<>\"\",HelligdagsNavn(C266,0,0),C266)","v":"2018-09-12"},null,null,null,null,0,0,{"$f":"IF(OR(C266=\"\",D266=1),\"\",VLOOKUP(WEEKDAY($C266,2),Backend!$F$5:$K$11,4,FALSE))","v":"07:24:00"}]
["","","2018-09-13","","",{"$f":"IF(AND(Q267<>\"\",G267=\"\"),1,\"\")","v":1},{"$f":"IF(AND(K267<>\"\",$M267=\"Hjemmearbejdsdag\"),1,\"\")","v":""},{"$f":"IF(AND(D267=1,K267<>\"\"),1,\"\")","v":""},null,{"$f":"IF(HelligdagsNavn(C267,0,0)<>\"\",HelligdagsNavn(C267,0,0),C267)","v":"2018-09-13"},null,null,null,null,0,0,{"$f":"IF(OR(C267=\"\",D267=1),\"\",VLOOKUP(WEEKDAY($C267,2),Backend!$F$5:$K$11,4,FALSE))","v":"07:24:00"}]
[{"$f":"IF(DAY(C268)=1,C268,\"\")","v":""},{"$f":"IF(WEEKDAY(C268,2)=1,1+INT((C268-DATE(YEAR(C268+4-WEEKDAY(C268+6)),1,5)+WEEKDAY(DATE(YEAR(C268+4-WEEKDAY(C268+6)),1,3)))/7),\"\")","v":""},"2018-09-14",{"$f":"IF(OR(WEEKDAY(C268)=1,WEEKDAY(C268)=7),1,\"\")","v":""},{"$f":"IF(OR(M268=\"Feriefridag\",M268=\"Ferie med løn\",M268=\"Flex-fri\"),1,\"\")","v":""},{"$f":"IF(AND(Q268<>\"\",G268=\"\"),1,\"\")","v":1},"",{"$f":"IF(AND(D268=1,K268<>\"\"),1,\"\")","v":""},null,{"$f":"IF(HelligdagsNavn(C268,0,0)<>\"\",HelligdagsNavn(C268,0,0),C268)","v":"2018-09-14"},null,null,null,null,{"$f":"IF(OR(K268=\"\",L268=\"\"),0,IF(VALUE(K268)>=VALUE(L268),(TIME(TRUNC(L268/100),MOD(L268,100),0))+1-(TIME(TRUNC(K268/100),MOD(K268,100),0)),(TIME(TRUNC(L268/100),MOD(L268,100),0))-(TIME(TRUNC(K268/100),MOD(K268,100),0))))","v":0},{"$f":"O268*24","v":0},{"$f":"IF(OR(C268=\"\",D268=1),\"\",VLOOKUP(WEEKDAY($C268,2),Backend!$F$5:$K$11,4,FALSE))","v":"07:24:00"}]
["","",{"$f":"C268+1","v":"2018-09-15"},"","",{"$f":"IF(AND(Q269<>\"\",G269=\"\"),1,\"\")","v":1},"",{"$f":"IF(AND(D269=1,K269<>\"\"),1,\"\")","v":""},null,{"$f":"IF(HelligdagsNavn(C269,0,0)<>\"\",HelligdagsNavn(C269,0,0),C269)","v":"2018-09-15"},null,null,null,null,0,0,{"$f":"IF(OR(C269=\"\",D269=1),\"\",VLOOKUP(WEEKDAY($C269,2),Backend!$F$5:$K$11,4,FALSE))","v":"07:24:00"}]
["","","2018-09-16",1,"",{"$f":"IF(AND(Q270<>\"\",G270=\"\"),1,\"\")","v":""},"",{"$f":"IF(AND(D270=1,K270<>\"\"),1,\"\")","v":""},null,{"$f":"IF(HelligdagsNavn(C270,0,0)<>\"\",HelligdagsNavn(C270,0,0),C270)","v":"2018-09-16"},null,null,null,null,0,0,{"$f":"IF(OR(C270=\"\",D270=1),\"\",VLOOKUP(WEEKDAY($C270,2),Backend!$F$5:$K$11,4,FALSE))","v":""}]
["","","2018-09-17",1,"",{"$f":"IF(AND(Q271<>\"\",G271=\"\"),1,\"\")","v":""},"",{"$f":"IF(AND(D271=1,K271<>\"\"),1,\"\")","v":""},null,{"$f":"IF(HelligdagsNavn(C271,0,0)<>\"\",HelligdagsNavn(C271,0,0),C271)","v":"2018-09-17"},null,null,null,null,0,0,{"$f":"IF(OR(C271=\"\",D271=1),\"\",VLOOKUP(WEEKDAY($C271,2),Backend!$F$5:$K$11,4,FALSE))","v":""}]
["",38,"2018-09-18","","",{"$f":"IF(AND(Q272<>\"\",G272=\"\"),1,\"\")","v":1},"",{"$f":"IF(AND(D272=1,K272<>\"\"),1,\"\")","v":""},null,{"$f":"IF(HelligdagsNavn(C272,0,0)<>\"\",HelligdagsNavn(C272,0,0),C272)","v":"2018-09-18"},null,null,null,null,0,0,{"$f":"IF(OR(C272=\"\",D272=1),\"\",VLOOKUP(WEEKDAY($C272,2),Backend!$F$5:$K$11,4,FALSE))","v":"07:24:00"}]
["","","2018-09-19","","",{"$f":"IF(AND(Q273<>\"\",G273=\"\"),1,\"\")","v":1},"",{"$f":"IF(AND(D273=1,K273<>\"\"),1,\"\")","v":""},null,{"$f":"IF(HelligdagsNavn(C273,0,0)<>\"\",HelligdagsNavn(C273,0,0),C273)","v":"2018-09-19"},null,null,null,null,0,0,{"$f":"IF(OR(C273=\"\",D273=1),\"\",VLOOKUP(WEEKDAY($C273,2),Backend!$F$5:$K$11,4,FALSE))","v":"07:24:00"}]
["","","2018-09-20","","",{"$f":"IF(AND(Q274<>\"\",G274=\"\"),1,\"\")","v":1},"",{"$f":"IF(AND(D274=1,K274<>\"\"),1,\"\")","v":""},null,{"$f":"IF(HelligdagsNavn(C274,0,0)<>\"\",HelligdagsNavn(C274,0,0),C274)","v":"2018-09-20"},null,null,null,null,0,0,{"$f":"IF(OR(C274=\"\",D274=1),\"\",VLOOKUP(WEEKDAY($C274,2),Backend!$F$5:$K$11,4,FALSE))","v":"07:24:00"}]
["","","2018-09-21","","",{"$f":"IF(AND(Q275<>\"\",G275=\"\"),1,\"\")","v":1},"",{"$f":"IF(AND(D275=1,K275<>\"\"),1,\"\")","v":""},null,{"$f":"IF(HelligdagsNavn(C275,0,0)<>\"\",HelligdagsNavn(C275,0,0),C275)","v":"2018-09-21"},null,null,null,null,0,0,{"$f":"IF(OR(C275=\"\",D275=1),\"\",VLOOKUP(WEEKDAY($C275,2),Backend!$F$5:$K$11,4,FALSE))","v":"07:24:00"}]
["","","2018-09-22","","",{"$f":"IF(AND(Q276<>\"\",G276=\"\"),1,\"\")","v":1},"",{"$f":"IF(AND(D276=1,K276<>\"\"),1,\"\")","v":""},null,{"$f":"IF(HelligdagsNavn(C276,0,0)<>\"\",HelligdagsNavn(C276,0,0),C276)","v":"Efterårsjævndøgn"},null,null,null,null,0,0,{"$f":"IF(OR(C276=\"\",D276=1),\"\",VLOOKUP(WEEKDAY($C276,2),Backend!$F$5:$K$11,4,FALSE))","v":"07:24:00"}]
["","","2018-09-23",1,"",{"$f":"IF(AND(Q277<>\"\",G277=\"\"),1,\"\")","v":""},"",{"$f":"IF(AND(D277=1,K277<>\"\"),1,\"\")","v":""},null,{"$f":"IF(HelligdagsNavn(C277,0,0)<>\"\",HelligdagsNavn(C277,0,0),C277)","v":"2018-09-23"},null,null,null,null,0,0,{"$f":"IF(OR(C277=\"\",D277=1),\"\",VLOOKUP(WEEKDAY($C277,2),Backend!$F$5:$K$11,4,FALSE))","v":""}]
["","","2018-09-24",1,"",{"$f":"IF(AND(Q278<>\"\",G278=\"\"),1,\"\")","v":""},"",{"$f":"IF(AND(D278=1,K278<>\"\"),1,\"\")","v":""},null,{"$f":"IF(HelligdagsNavn(C278,0,0)<>\"\",HelligdagsNavn(C278,0,0),C278)","v":"2018-09-24"},null,null,null,null,0,0,{"$f":"IF(OR(C278=\"\",D278=1),\"\",VLOOKUP(WEEKDAY($C278,2),Backend!$F$5:$K$11,4,FALSE))","v":""}]
["",39,"2018-09-25","","",{"$f":"IF(AND(Q279<>\"\",G279=\"\"),1,\"\")","v":1},"",{"$f":"IF(AND(D279=1,K279<>\"\"),1,\"\")","v":""},null,{"$f":"IF(HelligdagsNavn(C279,0,0)<>\"\",HelligdagsNavn(C279,0,0),C279)","v":"2018-09-25"},null,null,null,null,0,0,{"$f":"IF(OR(C279=\"\",D279=1),\"\",VLOOKUP(WEEKDAY($C279,2),Backend!$F$5:$K$11,4,FALSE))","v":"07:24:00"}]
["","","2018-09-26","","",{"$f":"IF(AND(Q280<>\"\",G280=\"\"),1,\"\")","v":1},"",{"$f":"IF(AND(D280=1,K280<>\"\"),1,\"\")","v":""},null,{"$f":"IF(HelligdagsNavn(C280,0,0)<>\"\",HelligdagsNavn(C280,0,0),C280)","v":"2018-09-26"},null,null,null,null,0,0,{"$f":"IF(OR(C280=\"\",D280=1),\"\",VLOOKUP(WEEKDAY($C280,2),Backend!$F$5:$K$11,4,FALSE))","v":"07:24:00"}]
["","","2018-09-27","","",{"$f":"IF(AND(Q281<>\"\",G281=\"\"),1,\"\")","v":1},"",{"$f":"IF(AND(D281=1,K281<>\"\"),1,\"\")","v":""},null,{"$f":"IF(HelligdagsNavn(C281,0,0)<>\"\",HelligdagsNavn(C281,0,0),C281)","v":"2018-09-27"},null,null,null,null,0,0,{"$f":"IF(OR(C281=\"\",D281=1),\"\",VLOOKUP(WEEKDAY($C281,2),Backend!$F$5:$K$11,4,FALSE))","v":"07:24:00"}]
["","","2018-09-28","","",{"$f":"IF(AND(Q282<>\"\",G282=\"\"),1,\"\")","v":1},"",{"$f":"IF(AND(D282=1,K282<>\"\"),1,\"\")","v":""},null,{"$f":"IF(HelligdagsNavn(C282,0,0)<>\"\",HelligdagsNavn(C282,0,0),C282)","v":"Mikkelsdag"},null,null,null,null,0,0,{"$f":"IF(OR(C282=\"\",D282=1),\"\",VLOOKUP(WEEKDAY($C282,2),Backend!$F$5:$K$11,4,FALSE))","v":"07:24:00"}]
["","","2018-09-29","","",{"$f":"IF(AND(Q283<>\"\",G283=\"\"),1,\"\")","v":1},"",{"$f":"IF(AND(D283=1,K283<>\"\"),1,\"\")","v":""},null,{"$f":"IF(HelligdagsNavn(C283,0,0)<>\"\",HelligdagsNavn(C283,0,0),C283)","v":"2018-09-29"},null,null,null,null,0,0,{"$f":"IF(OR(C283=\"\",D283=1),\"\",VLOOKUP(WEEKDAY($C283,2),Backend!$F$5:$K$11,4,FALSE))","v":"07:24:00"}]
["2018-09-30","","2018-09-30",1,"",{"$f":"IF(AND(Q284<>\"\",G284=\"\"),1,\"\")","v":""},"",{"$f":"IF(AND(D284=1,K284<>\"\"),1,\"\")","v":""},null,{"$f":"IF(HelligdagsNavn(C284,0,0)<>\"\",HelligdagsNavn(C284,0,0),C284)","v":"2018-09-30"},null,null,null,null,0,0,{"$f":"IF(OR(C284=\"\",D284=1),\"\",VLOOKUP(WEEKDAY($C284,2),Backend!$F$5:$K$11,4,FALSE))","v":""}]
["","","2018-10-01",1,"",{"$f":"IF(AND(Q285<>\"\",G285=\"\"),1,\"\")","v":""},"",{"$f":"IF(AND(D285=1,K285<>\"\"),1,\"\")","v":""},null,{"$f":"IF(HelligdagsNavn(C285,0,0)<>\"\",HelligdagsNavn(C285,0,0),C285)","v":"2018-10-01"},null,null,null,null,0,0,{"$f":"IF(OR(C285=\"\",D285=1),\"\",VLOOKUP(WEEKDAY($C285,2),Backend!$F$5:$K$11,4,FALSE))","v":""}]
["",40,"2018-10-02","","",{"$f":"IF(AND(Q286<>\"\",G286=\"\"),1,\"\")","v":1},"",{"$f":"IF(AND(D286=1,K286<>\"\"),1,\"\")","v":""},null,{"$f":"IF(HelligdagsNavn(C286,0,0)<>\"\",HelligdagsNavn(C286,0,0),C286)","v":"2018-10-02"},null,null,null,null,0,0,{"$f":"IF(OR(C286=\"\",D286=1),\"\",VLOOKUP(WEEKDAY($C286,2),Backend!$F$5:$K$11,4,FALSE))","v":"07:24:00"}]
["","","2018-10-03","","",{"$f":"IF(AND(Q287<>\"\",G287=\"\"),1,\"\")","v":1},"",{"$f":"IF(AND(D287=1,K287<>\"\"),1,\"\")","v":""},null,{"$f":"IF(HelligdagsNavn(C287,0,0)<>\"\",HelligdagsNavn(C287,0,0),C287)","v":"2018-10-03"},null,null,null,null,0,0,{"$f":"IF(OR(C287=\"\",D287=1),\"\",VLOOKUP(WEEKDAY($C287,2),Backend!$F$5:$K$11,4,FALSE))","v":"07:24:00"}]
["","","2018-10-04","","",{"$f":"IF(AND(Q288<>\"\",G288=\"\"),1,\"\")","v":1},"",{"$f":"IF(AND(D288=1,K288<>\"\"),1,\"\")","v":""},null,{"$f":"IF(HelligdagsNavn(C288,0,0)<>\"\",HelligdagsNavn(C288,0,0),C288)","v":"2018-10-04"},null,null,null,null,0,0,{"$f":"IF(OR(C288=\"\",D288=1),\"\",VLOOKUP(WEEKDAY($C288,2),Backend!$F$5:$K$11,4,FALSE))","v":"07:24:00"}]
["","","2018-10-05","","",{"$f":"IF(AND(Q289<>\"\",G289=\"\"),1,\"\")","v":1},"",{"$f":"IF(AND(D289=1,K289<>\"\"),1,\"\")","v":""},null,{"$f":"IF(HelligdagsNavn(C289,0,0)<>\"\",HelligdagsNavn(C289,0,0),C289)","v":"2018-10-05"},null,null,null,null,0,0,{"$f":"IF(OR(C289=\"\",D289=1),\"\",VLOOKUP(WEEKDAY($C289,2),Backend!$F$5:$K$11,4,FALSE))","v":"07:24:00"}]
["","","2018-10-06","","",{"$f":"IF(AND(Q290<>\"\",G290=\"\"),1,\"\")","v":1},"",{"$f":"IF(AND(D290=1,K290<>\"\"),1,\"\")","v":""},null,{"$f":"IF(HelligdagsNavn(C290,0,0)<>\"\",HelligdagsNavn(C290,0,0),C290)","v":"2018-10-06"},null,null,null,null,0,0,{"$f":"IF(OR(C290=\"\",D290=1),\"\",VLOOKUP(WEEKDAY($C290,2),Backend!$F$5:$K$11,4,FALSE))","v":"07:24:00"}]
["","","2018-10-07",1,"",{"$f":"IF(AND(Q291<>\"\",G291=\"\"),1,\"\")","v":""},"",{"$f":"IF(AND(D291=1,K291<>\"\"),1,\"\")","v":""},null,{"$f":"IF(HelligdagsNavn(C291,0,0)<>\"\",HelligdagsNavn(C291,0,0),C291)","v":"2018-10-07"},null,null,null,null,0,0,{"$f":"IF(OR(C291=\"\",D291=1),\"\",VLOOKUP(WEEKDAY($C291,2),Backend!$F$5:$K$11,4,FALSE))","v":""}]
["","","2018-10-08",1,"",{"$f":"IF(AND(Q292<>\"\",G292=\"\"),1,\"\")","v":""},"",{"$f":"IF(AND(D292=1,K292<>\"\"),1,\"\")","v":""},null,{"$f":"IF(HelligdagsNavn(C292,0,0)<>\"\",HelligdagsNavn(C292,0,0),C292)","v":"2018-10-08"},null,null,null,null,0,0,{"$f":"IF(OR(C292=\"\",D292=1),\"\",VLOOKUP(WEEKDAY($C292,2),Backend!$F$5:$K$11,4,FALSE))","v":""}]
["",41,"2018-10-09","","",{"$f":"IF(AND(Q293<>\"\",G293=\"\"),1,\"\")","v":1},"",{"$f":"IF(AND(D293=1,K293<>\"\"),1,\"\")","v":""},null,{"$f":"IF(HelligdagsNavn(C293,0,0)<>\"\",HelligdagsNavn(C293,0,0),C293)","v":"2018-10-09"},null,null,null,null,0,0,{"$f":"IF(OR(C293=\"\",D293=1),\"\",VLOOKUP(WEEKDAY($C293,2),Backend!$F$5:$K$11,4,FALSE))","v":"07:24:00"}]
["","","2018-10-10","","",{"$f":"IF(AND(Q294<>\"\",G294=\"\"),1,\"\")","v":1},"",{"$f":"IF(AND(D294=1,K294<>\"\"),1,\"\")","v":""},null,{"$f":"IF(HelligdagsNavn(C294,0,0)<>\"\",HelligdagsNavn(C294,0,0),C294)","v":"2018-10-10"},null,null,null,null,0,0,{"$f":"IF(OR(C294=\"\",D294=1),\"\",VLOOKUP(WEEKDAY($C294,2),Backend!$F$5:$K$11,4,FALSE))","v":"07:24:00"}]
["","","2018-10-11","","",{"$f":"IF(AND(Q295<>\"\",G295=\"\"),1,\"\")","v":1},"",{"$f":"IF(AND(D295=1,K295<>\"\"),1,\"\")","v":""},null,{"$f":"IF(HelligdagsNavn(C295,0,0)<>\"\",HelligdagsNavn(C295,0,0),C295)","v":"2018-10-11"},null,null,null,null,0,0,{"$f":"IF(OR(C295=\"\",D295=1),\"\",VLOOKUP(WEEKDAY($C295,2),Backend!$F$5:$K$11,4,FALSE))","v":"07:24:00"}]
["","","2018-10-12","","",{"$f":"IF(AND(Q296<>\"\",G296=\"\"),1,\"\")","v":1},"",{"$f":"IF(AND(D296=1,K296<>\"\"),1,\"\")","v":""},null,{"$f":"IF(HelligdagsNavn(C296,0,0)<>\"\",HelligdagsNavn(C296,0,0),C296)","v":"2018-10-12"},null,null,null,null,0,0,{"$f":"IF(OR(C296=\"\",D296=1),\"\",VLOOKUP(WEEKDAY($C296,2),Backend!$F$5:$K$11,4,FALSE))","v":"07:24:00"}]
["","","2018-10-13","","",{"$f":"IF(AND(Q297<>\"\",G297=\"\"),1,\"\")","v":1},"",{"$f":"IF(AND(D297=1,K297<>\"\"),1,\"\")","v":""},null,{"$f":"IF(HelligdagsNavn(C297,0,0)<>\"\",HelligdagsNavn(C297,0,0),C297)","v":"2018-10-13"},null,null,null,null,0,0,{"$f":"IF(OR(C297=\"\",D297=1),\"\",VLOOKUP(WEEKDAY($C297,2),Backend!$F$5:$K$11,4,FALSE))","v":"07:24:00"}]
["","","2018-10-14",1,"",{"$f":"IF(AND(Q298<>\"\",G298=\"\"),1,\"\")","v":""},"",{"$f":"IF(AND(D298=1,K298<>\"\"),1,\"\")","v":""},null,{"$f":"IF(HelligdagsNavn(C298,0,0)<>\"\",HelligdagsNavn(C298,0,0),C298)","v":"2018-10-14"},null,null,null,null,0,0,{"$f":"IF(OR(C298=\"\",D298=1),\"\",VLOOKUP(WEEKDAY($C298,2),Backend!$F$5:$K$11,4,FALSE))","v":""}]
["","","2018-10-15",1,"",{"$f":"IF(AND(Q299<>\"\",G299=\"\"),1,\"\")","v":""},"",{"$f":"IF(AND(D299=1,K299<>\"\"),1,\"\")","v":""},null,{"$f":"IF(HelligdagsNavn(C299,0,0)<>\"\",HelligdagsNavn(C299,0,0),C299)","v":"2018-10-15"},null,null,null,null,0,0,{"$f":"IF(OR(C299=\"\",D299=1),\"\",VLOOKUP(WEEKDAY($C299,2),Backend!$F$5:$K$11,4,FALSE))","v":""}]
["",42,"2018-10-16","","",{"$f":"IF(AND(Q300<>\"\",G300=\"\"),1,\"\")","v":1},"",{"$f":"IF(AND(D300=1,K300<>\"\"),1,\"\")","v":""},null,{"$f":"IF(HelligdagsNavn(C300,0,0)<>\"\",HelligdagsNavn(C300,0,0),C300)","v":"2018-10-16"},null,null,null,null,0,0,{"$f":"IF(OR(C300=\"\",D300=1),\"\",VLOOKUP(WEEKDAY($C300,2),Backend!$F$5:$K$11,4,FALSE))","v":"07:24:00"}]
["","","2018-10-17","","",{"$f":"IF(AND(Q301<>\"\",G301=\"\"),1,\"\")","v":1},"",{"$f":"IF(AND(D301=1,K301<>\"\"),1,\"\")","v":""},null,{"$f":"IF(HelligdagsNavn(C301,0,0)<>\"\",HelligdagsNavn(C301,0,0),C301)","v":"2018-10-17"},null,null,null,null,0,0,{"$f":"IF(OR(C301=\"\",D301=1),\"\",VLOOKUP(WEEKDAY($C301,2),Backend!$F$5:$K$11,4,FALSE))","v":"07:24:00"}]
["","","2018-10-18","","",{"$f":"IF(AND(Q302<>\"\",G302=\"\"),1,\"\")","v":1},"",{"$f":"IF(AND(D302=1,K302<>\"\"),1,\"\")","v":""},null,{"$f":"IF(HelligdagsNavn(C302,0,0)<>\"\",HelligdagsNavn(C302,0,0),C302)","v":"2018-10-18"},null,null,null,null,0,0,{"$f":"IF(OR(C302=\"\",D302=1),\"\",VLOOKUP(WEEKDAY($C302,2),Backend!$F$5:$K$11,4,FALSE))","v":"07:24:00"}]
["","","2018-10-19","","",{"$f":"IF(AND(Q303<>\"\",G303=\"\"),1,\"\")","v":1},"",{"$f":"IF(AND(D303=1,K303<>\"\"),1,\"\")","v":""},null,{"$f":"IF(HelligdagsNavn(C303,0,0)<>\"\",HelligdagsNavn(C303,0,0),C303)","v":"2018-10-19"},null,null,null,null,0,0,{"$f":"IF(OR(C303=\"\",D303=1),\"\",VLOOKUP(WEEKDAY($C303,2),Backend!$F$5:$K$11,4,FALSE))","v":"07:24:00"}]
["","","2018-10-20","","",{"$f":"IF(AND(Q304<>\"\",G304=\"\"),1,\"\")","v":1},"",{"$f":"IF(AND(D304=1,K304<>\"\"),1,\"\")","v":""},null,{"$f":"IF(HelligdagsNavn(C304,0,0)<>\"\",HelligdagsNavn(C304,0,0),C304)","v":"2018-10-20"},null,null,null,null,0,0,{"$f":"IF(OR(C304=\"\",D304=1),\"\",VLOOKUP(WEEKDAY($C304,2),Backend!$F$5:$K$11,4,FALSE))","v":"07:24:00"}]
["","","2018-10-21",1,"",{"$f":"IF(AND(Q305<>\"\",G305=\"\"),1,\"\")","v":""},"",{"$f":"IF(AND(D305=1,K305<>\"\"),1,\"\")","v":""},null,{"$f":"IF(HelligdagsNavn(C305,0,0)<>\"\",HelligdagsNavn(C305,0,0),C305)","v":"2018-10-21"},null,null,null,null,0,0,{"$f":"IF(OR(C305=\"\",D305=1),\"\",VLOOKUP(WEEKDAY($C305,2),Backend!$F$5:$K$11,4,FALSE))","v":""}]
["","","2018-10-22",1,"",{"$f":"IF(AND(Q306<>\"\",G306=\"\"),1,\"\")","v":""},"",{"$f":"IF(AND(D306=1,K306<>\"\"),1,\"\")","v":""},null,{"$f":"IF(HelligdagsNavn(C306,0,0)<>\"\",HelligdagsNavn(C306,0,0),C306)","v":"2018-10-22"},null,null,null,null,0,0,{"$f":"IF(OR(C306=\"\",D306=1),\"\",VLOOKUP(WEEKDAY($C306,2),Backend!$F$5:$K$11,4,FALSE))","v":""}]
["",43,"2018-10-23","","",{"$f":"IF(AND(Q307<>\"\",G307=\"\"),1,\"\")","v":1},"",{"$f":"IF(AND(D307=1,K307<>\"\"),1,\"\")","v":""},null,{"$f":"IF(HelligdagsNavn(C307,0,0)<>\"\",HelligdagsNavn(C307,0,0),C307)","v":"2018-10-23"},null,null,null,null,0,0,{"$f":"IF(OR(C307=\"\",D307=1),\"\",VLOOKUP(WEEKDAY($C307,2),Backend!$F$5:$K$11,4,FALSE))","v":"07:24:00"}]
["","","2018-10-24","","",{"$f":"IF(AND(Q308<>\"\",G308=\"\"),1,\"\")","v":1},"",{"$f":"IF(AND(D308=1,K308<>\"\"),1,\"\")","v":""},null,{"$f":"IF(HelligdagsNavn(C308,0,0)<>\"\",HelligdagsNavn(C308,0,0),C308)","v":"2018-10-24"},null,null,null,null,0,0,{"$f":"IF(OR(C308=\"\",D308=1),\"\",VLOOKUP(WEEKDAY($C308,2),Backend!$F$5:$K$11,4,FALSE))","v":"07:24:00"}]
["","","2018-10-25","","",{"$f":"IF(AND(Q309<>\"\",G309=\"\"),1,\"\")","v":1},"",{"$f":"IF(AND(D309=1,K309<>\"\"),1,\"\")","v":""},null,{"$f":"IF(HelligdagsNavn(C309,0,0)<>\"\",HelligdagsNavn(C309,0,0),C309)","v":"2018-10-25"},null,null,null,null,0,0,{"$f":"IF(OR(C309=\"\",D309=1),\"\",VLOOKUP(WEEKDAY($C309,2),Backend!$F$5:$K$11,4,FALSE))","v":"07:24:00"}]
["","","2018-10-26","","",{"$f":"IF(AND(Q310<>\"\",G310=\"\"),1,\"\")","v":1},"",{"$f":"IF(AND(D310=1,K310<>\"\"),1,\"\")","v":""},null,{"$f":"IF(HelligdagsNavn(C310,0,0)<>\"\",HelligdagsNavn(C310,0,0),C310)","v":"2018-10-26"},null,null,null,null,0,0,{"$f":"IF(OR(C310=\"\",D310=1),\"\",VLOOKUP(WEEKDAY($C310,2),Backend!$F$5:$K$11,4,FALSE))","v":"07:24:00"}]
["","","2018-10-27","","",{"$f":"IF(AND(Q311<>\"\",G311=\"\"),1,\"\")","v":1},"",{"$f":"IF(AND(D311=1,K311<>\"\"),1,\"\")","v":""},null,{"$f":"IF(HelligdagsNavn(C311,0,0)<>\"\",HelligdagsNavn(C311,0,0),C311)","v":"2018-10-27"},null,null,null,null,0,0,{"$f":"IF(OR(C311=\"\",D311=1),\"\",VLOOKUP(WEEKDAY($C311,2),Backend!$F$5:$K$11,4,FALSE))","v":"07:24:00"}]
["","","2018-10-28",1,"",{"$f":"IF(AND(Q312<>\"\",G312=\"\"),1,\"\")","v":""},"",{"$f":"IF(AND(D312=1,K312<>\"\"),1,\"\")","v":""},null,{"$f":"IF(HelligdagsNavn(C312,0,0)<>\"\",HelligdagsNavn(C312,0,0),C312)","v":"2018-10-28"},null,null,null,null,0,0,{"$f":"IF(OR(C312=\"\",D312=1),\"\",VLOOKUP(WEEKDAY($C312,2),Backend!$F$5:$K$11,4,FALSE))","v":""}]
["","","2018-10-29",1,"",{"$f":"IF(AND(Q313<>\"\",G313=\"\"),1,\"\")","v":""},"",{"$f":"IF(AND(D313=1,K313<>\"\"),1,\"\")","v":""},null,{"$f":"IF(HelligdagsNavn(C313,0,0)<>\"\",HelligdagsNavn(C313,0,0),C313)","v":"Normaltid kl. 3 - kl. 2"},null,null,null,null,0,0,{"$f":"IF(OR(C313=\"\",D313=1),\"\",VLOOKUP(WEEKDAY($C313,2),Backend!$F$5:$K$11,4,FALSE))","v":""}]
["",44,"2018-10-30","","",{"$f":"IF(AND(Q314<>\"\",G314=\"\"),1,\"\")","v":1},"",{"$f":"IF(AND(D314=1,K314<>\"\"),1,\"\")","v":""},null,{"$f":"IF(HelligdagsNavn(C314,0,0)<>\"\",HelligdagsNavn(C314,0,0),C314)","v":"Halloween"},null,null,null,null,0,0,{"$f":"IF(OR(C314=\"\",D314=1),\"\",VLOOKUP(WEEKDAY($C314,2),Backend!$F$5:$K$11,4,FALSE))","v":"07:24:00"}]
["2018-10-31","","2018-10-31","","",{"$f":"IF(AND(Q315<>\"\",G315=\"\"),1,\"\")","v":1},"",{"$f":"IF(AND(D315=1,K315<>\"\"),1,\"\")","v":""},null,{"$f":"IF(HelligdagsNavn(C315,0,0)<>\"\",HelligdagsNavn(C315,0,0),C315)","v":"2018-10-31"},null,null,null,null,0,0,{"$f":"IF(OR(C315=\"\",D315=1),\"\",VLOOKUP(WEEKDAY($C315,2),Backend!$F$5:$K$11,4,FALSE))","v":"07:24:00"}]
["","","2018-11-01","","",{"$f":"IF(AND(Q316<>\"\",G316=\"\"),1,\"\")","v":1},"",{"$f":"IF(AND(D316=1,K316<>\"\"),1,\"\")","v":""},null,{"$f":"IF(HelligdagsNavn(C316,0,0)<>\"\",HelligdagsNavn(C316,0,0),C316)","v":"2018-11-01"},null,null,null,null,0,0,{"$f":"IF(OR(C316=\"\",D316=1),\"\",VLOOKUP(WEEKDAY($C316,2),Backend!$F$5:$K$11,4,FALSE))","v":"07:24:00"}]
["","","2018-11-02","","",{"$f":"IF(AND(Q317<>\"\",G317=\"\"),1,\"\")","v":1},"",{"$f":"IF(AND(D317=1,K317<>\"\"),1,\"\")","v":""},null,{"$f":"IF(HelligdagsNavn(C317,0,0)<>\"\",HelligdagsNavn(C317,0,0),C317)","v":"2018-11-02"},null,null,null,null,0,0,{"$f":"IF(OR(C317=\"\",D317=1),\"\",VLOOKUP(WEEKDAY($C317,2),Backend!$F$5:$K$11,4,FALSE))","v":"07:24:00"}]
["","","2018-11-03","","",{"$f":"IF(AND(Q318<>\"\",G318=\"\"),1,\"\")","v":1},"",{"$f":"IF(AND(D318=1,K318<>\"\"),1,\"\")","v":""},null,{"$f":"IF(HelligdagsNavn(C318,0,0)<>\"\",HelligdagsNavn(C318,0,0),C318)","v":"2018-11-03"},null,null,null,null,0,0,{"$f":"IF(OR(C318=\"\",D318=1),\"\",VLOOKUP(WEEKDAY($C318,2),Backend!$F$5:$K$11,4,FALSE))","v":"07:24:00"}]
["","","2018-11-04",1,"",{"$f":"IF(AND(Q319<>\"\",G319=\"\"),1,\"\")","v":""},"",{"$f":"IF(AND(D319=1,K319<>\"\"),1,\"\")","v":""},null,{"$f":"IF(HelligdagsNavn(C319,0,0)<>\"\",HelligdagsNavn(C319,0,0),C319)","v":"2018-11-04"},null,null,null,null,0,0,{"$f":"IF(OR(C319=\"\",D319=1),\"\",VLOOKUP(WEEKDAY($C319,2),Backend!$F$5:$K$11,4,FALSE))","v":""}]
["","","2018-11-05",1,"",{"$f":"IF(AND(Q320<>\"\",G320=\"\"),1,\"\")","v":""},"",{"$f":"IF(AND(D320=1,K320<>\"\"),1,\"\")","v":""},null,{"$f":"IF(HelligdagsNavn(C320,0,0)<>\"\",HelligdagsNavn(C320,0,0),C320)","v":"Allehelgensdag"},null,null,null,null,0,0,{"$f":"IF(OR(C320=\"\",D320=1),\"\",VLOOKUP(WEEKDAY($C320,2),Backend!$F$5:$K$11,4,FALSE))","v":""}]
["",45,"2018-11-06","","",{"$f":"IF(AND(Q321<>\"\",G321=\"\"),1,\"\")","v":1},"",{"$f":"IF(AND(D321=1,K321<>\"\"),1,\"\")","v":""},null,{"$f":"IF(HelligdagsNavn(C321,0,0)<>\"\",HelligdagsNavn(C321,0,0),C321)","v":"2018-11-06"},null,null,null,null,0,0,{"$f":"IF(OR(C321=\"\",D321=1),\"\",VLOOKUP(WEEKDAY($C321,2),Backend!$F$5:$K$11,4,FALSE))","v":"07:24:00"}]
["","","2018-11-07","","",{"$f":"IF(AND(Q322<>\"\",G322=\"\"),1,\"\")","v":1},"",{"$f":"IF(AND(D322=1,K322<>\"\"),1,\"\")","v":""},null,{"$f":"IF(HelligdagsNavn(C322,0,0)<>\"\",HelligdagsNavn(C322,0,0),C322)","v":"2018-11-07"},null,null,null,null,0,0,{"$f":"IF(OR(C322=\"\",D322=1),\"\",VLOOKUP(WEEKDAY($C322,2),Backend!$F$5:$K$11,4,FALSE))","v":"07:24:00"}]
["","","2018-11-08","","",{"$f":"IF(AND(Q323<>\"\",G323=\"\"),1,\"\")","v":1},"",{"$f":"IF(AND(D323=1,K323<>\"\"),1,\"\")","v":""},null,{"$f":"IF(HelligdagsNavn(C323,0,0)<>\"\",HelligdagsNavn(C323,0,0),C323)","v":"2018-11-08"},null,null,null,null,0,0,{"$f":"IF(OR(C323=\"\",D323=1),\"\",VLOOKUP(WEEKDAY($C323,2),Backend!$F$5:$K$11,4,FALSE))","v":"07:24:00"}]
["","","2018-11-09","","",{"$f":"IF(AND(Q324<>\"\",G324=\"\"),1,\"\")","v":1},"",{"$f":"IF(AND(D324=1,K324<>\"\"),1,\"\")","v":""},null,{"$f":"IF(HelligdagsNavn(C324,0,0)<>\"\",HelligdagsNavn(C324,0,0),C324)","v":"Mortensaften"},null,null,null,null,0,0,{"$f":"IF(OR(C324=\"\",D324=1),\"\",VLOOKUP(WEEKDAY($C324,2),Backend!$F$5:$K$11,4,FALSE))","v":"07:24:00"}]
["","","2018-11-10","","",{"$f":"IF(AND(Q325<>\"\",G325=\"\"),1,\"\")","v":1},"",{"$f":"IF(AND(D325=1,K325<>\"\"),1,\"\")","v":""},null,{"$f":"IF(HelligdagsNavn(C325,0,0)<>\"\",HelligdagsNavn(C325,0,0),C325)","v":"Mortensdag"},null,null,null,null,0,0,{"$f":"IF(OR(C325=\"\",D325=1),\"\",VLOOKUP(WEEKDAY($C325,2),Backend!$F$5:$K$11,4,FALSE))","v":"07:24:00"}]
["","","2018-11-11",1,"",{"$f":"IF(AND(Q326<>\"\",G326=\"\"),1,\"\")","v":""},"",{"$f":"IF(AND(D326=1,K326<>\"\"),1,\"\")","v":""},null,{"$f":"IF(HelligdagsNavn(C326,0,0)<>\"\",HelligdagsNavn(C326,0,0),C326)","v":"2018-11-11"},null,null,null,null,0,0,{"$f":"IF(OR(C326=\"\",D326=1),\"\",VLOOKUP(WEEKDAY($C326,2),Backend!$F$5:$K$11,4,FALSE))","v":""}]
["","","2018-11-12",1,"",{"$f":"IF(AND(Q327<>\"\",G327=\"\"),1,\"\")","v":""},"",{"$f":"IF(AND(D327=1,K327<>\"\"),1,\"\")","v":""},null,{"$f":"IF(HelligdagsNavn(C327,0,0)<>\"\",HelligdagsNavn(C327,0,0),C327)","v":"2018-11-12"},null,null,null,null,0,0,{"$f":"IF(OR(C327=\"\",D327=1),\"\",VLOOKUP(WEEKDAY($C327,2),Backend!$F$5:$K$11,4,FALSE))","v":""}]
["",46,"2018-11-13","","",{"$f":"IF(AND(Q328<>\"\",G328=\"\"),1,\"\")","v":1},"",{"$f":"IF(AND(D328=1,K328<>\"\"),1,\"\")","v":""},null,{"$f":"IF(HelligdagsNavn(C328,0,0)<>\"\",HelligdagsNavn(C328,0,0),C328)","v":"2018-11-13"},null,null,null,null,0,0,{"$f":"IF(OR(C328=\"\",D328=1),\"\",VLOOKUP(WEEKDAY($C328,2),Backend!$F$5:$K$11,4,FALSE))","v":"07:24:00"}]
["","","2018-11-14","","",{"$f":"IF(AND(Q329<>\"\",G329=\"\"),1,\"\")","v":1},"",{"$f":"IF(AND(D329=1,K329<>\"\"),1,\"\")","v":""},null,{"$f":"IF(HelligdagsNavn(C329,0,0)<>\"\",HelligdagsNavn(C329,0,0),C329)","v":"2018-11-14"},null,null,null,null,0,0,{"$f":"IF(OR(C329=\"\",D329=1),\"\",VLOOKUP(WEEKDAY($C329,2),Backend!$F$5:$K$11,4,FALSE))","v":"07:24:00"}]
["","","2018-11-15","","",{"$f":"IF(AND(Q330<>\"\",G330=\"\"),1,\"\")","v":1},"",{"$f":"IF(AND(D330=1,K330<>\"\"),1,\"\")","v":""},null,{"$f":"IF(HelligdagsNavn(C330,0,0)<>\"\",HelligdagsNavn(C330,0,0),C330)","v":"2018-11-15"},null,null,null,null,0,0,{"$f":"IF(OR(C330=\"\",D330=1),\"\",VLOOKUP(WEEKDAY($C330,2),Backend!$F$5:$K$11,4,FALSE))","v":"07:24:00"}]
["","","2018-11-16","","",{"$f":"IF(AND(Q331<>\"\",G331=\"\"),1,\"\")","v":1},{"$f":"IF(AND(K331<>\"\",$M331=\"Hjemmearbejdsdag\"),1,\"\")","v":""},{"$f":"IF(AND(D331=1,K331<>\"\"),1,\"\")","v":""},null,{"$f":"IF(HelligdagsNavn(C331,0,0)<>\"\",HelligdagsNavn(C331,0,0),C331)","v":"2018-11-16"},null,null,null,null,0,0,{"$f":"IF(OR(C331=\"\",D331=1),\"\",VLOOKUP(WEEKDAY($C331,2),Backend!$F$5:$K$11,4,FALSE))","v":"07:24:00"}]
[{"$f":"IF(DAY(C332)=1,C332,\"\")","v":""},{"$f":"IF(WEEKDAY(C332,2)=1,1+INT((C332-DATE(YEAR(C332+4-WEEKDAY(C332+6)),1,5)+WEEKDAY(DATE(YEAR(C332+4-WEEKDAY(C332+6)),1,3)))/7),\"\")","v":""},"2018-11-17",{"$f":"IF(OR(WEEKDAY(C332)=1,WEEKDAY(C332)=7),1,\"\")","v":""},{"$f":"IF(OR(M332=\"Feriefridag\",M332=\"Ferie med løn\",M332=\"Flex-fri\"),1,\"\")","v":""},{"$f":"IF(AND(Q332<>\"\",G332=\"\"),1,\"\")","v":1},"",{"$f":"IF(AND(D332=1,K332<>\"\"),1,\"\")","v":""},null,{"$f":"IF(HelligdagsNavn(C332,0,0)<>\"\",HelligdagsNavn(C332,0,0),C332)","v":"2018-11-17"},null,null,null,null,{"$f":"IF(OR(K332=\"\",L332=\"\"),0,IF(VALUE(K332)>=VALUE(L332),(TIME(TRUNC(L332/100),MOD(L332,100),0))+1-(TIME(TRUNC(K332/100),MOD(K332,100),0)),(TIME(TRUNC(L332/100),MOD(L332,100),0))-(TIME(TRUNC(K332/100),MOD(K332,100),0))))","v":0},{"$f":"O332*24","v":0},{"$f":"IF(OR(C332=\"\",D332=1),\"\",VLOOKUP(WEEKDAY($C332,2),Backend!$F$5:$K$11,4,FALSE))","v":"07:24:00"}]
["","",{"$f":"C332+1","v":"2018-11-18"},1,"",{"$f":"IF(AND(Q333<>\"\",G333=\"\"),1,\"\")","v":""},"",{"$f":"IF(AND(D333=1,K333<>\"\"),1,\"\")","v":""},null,{"$f":"IF(HelligdagsNavn(C333,0,0)<>\"\",HelligdagsNavn(C333,0,0),C333)","v":"2018-11-18"},null,null,null,null,0,0,{"$f":"IF(OR(C333=\"\",D333=1),\"\",VLOOKUP(WEEKDAY($C333,2),Backend!$F$5:$K$11,4,FALSE))","v":""}]
["","","2018-11-19",1,"",{"$f":"IF(AND(Q334<>\"\",G334=\"\"),1,\"\")","v":""},"",{"$f":"IF(AND(D334=1,K334<>\"\"),1,\"\")","v":""},null,{"$f":"IF(HelligdagsNavn(C334,0,0)<>\"\",HelligdagsNavn(C334,0,0),C334)","v":"2018-11-19"},null,null,null,null,0,0,{"$f":"IF(OR(C334=\"\",D334=1),\"\",VLOOKUP(WEEKDAY($C334,2),Backend!$F$5:$K$11,4,FALSE))","v":""}]
["",47,"2018-11-20","","",{"$f":"IF(AND(Q335<>\"\",G335=\"\"),1,\"\")","v":1},"",{"$f":"IF(AND(D335=1,K335<>\"\"),1,\"\")","v":""},null,{"$f":"IF(HelligdagsNavn(C335,0,0)<>\"\",HelligdagsNavn(C335,0,0),C335)","v":"2018-11-20"},null,null,null,null,0,0,{"$f":"IF(OR(C335=\"\",D335=1),\"\",VLOOKUP(WEEKDAY($C335,2),Backend!$F$5:$K$11,4,FALSE))","v":"07:24:00"}]
["","","2018-11-21","","",{"$f":"IF(AND(Q336<>\"\",G336=\"\"),1,\"\")","v":1},"",{"$f":"IF(AND(D336=1,K336<>\"\"),1,\"\")","v":""},null,{"$f":"IF(HelligdagsNavn(C336,0,0)<>\"\",HelligdagsNavn(C336,0,0),C336)","v":"2018-11-21"},null,null,null,null,0,0,{"$f":"IF(OR(C336=\"\",D336=1),\"\",VLOOKUP(WEEKDAY($C336,2),Backend!$F$5:$K$11,4,FALSE))","v":"07:24:00"}]
["","","2018-11-22","","",{"$f":"IF(AND(Q337<>\"\",G337=\"\"),1,\"\")","v":1},"",{"$f":"IF(AND(D337=1,K337<>\"\"),1,\"\")","v":""},null,{"$f":"IF(HelligdagsNavn(C337,0,0)<>\"\",HelligdagsNavn(C337,0,0),C337)","v":"2018-11-22"},null,null,null,null,0,0,{"$f":"IF(OR(C337=\"\",D337=1),\"\",VLOOKUP(WEEKDAY($C337,2),Backend!$F$5:$K$11,4,FALSE))","v":"07:24:00"}]
["","","2018-11-23","","",{"$f":"IF(AND(Q338<>\"\",G338=\"\"),1,\"\")","v":1},"",{"$f":"IF(AND(D338=1,K338<>\"\"),1,\"\")","v":""},null,{"$f":"IF(HelligdagsNavn(C338,0,0)<>\"\",HelligdagsNavn(C338,0,0),C338)","v":"2018-11-23"},null,null,null,null,0,0,{"$f":"IF(OR(C338=\"\",D338=1),\"\",VLOOKUP(WEEKDAY($C338,2),Backend!$F$5:$K$11,4,FALSE))","v":"07:24:00"}]
["","","2018-11-24","","",{"$f":"IF(AND(Q339<>\"\",G339=\"\"),1,\"\")","v":1},"",{"$f":"IF(AND(D339=1,K339<>\"\"),1,\"\")","v":""},null,{"$f":"IF(HelligdagsNavn(C339,0,0)<>\"\",HelligdagsNavn(C339,0,0),C339)","v":"2018-11-24"},null,null,null,null,0,0,{"$f":"IF(OR(C339=\"\",D339=1),\"\",VLOOKUP(WEEKDAY($C339,2),Backend!$F$5:$K$11,4,FALSE))","v":"07:24:00"}]
["","","2018-11-25",1,"",{"$f":"IF(AND(Q340<>\"\",G340=\"\"),1,\"\")","v":""},"",{"$f":"IF(AND(D340=1,K340<>\"\"),1,\"\")","v":""},null,{"$f":"IF(HelligdagsNavn(C340,0,0)<>\"\",HelligdagsNavn(C340,0,0),C340)","v":"2018-11-25"},null,null,null,null,0,0,{"$f":"IF(OR(C340=\"\",D340=1),\"\",VLOOKUP(WEEKDAY($C340,2),Backend!$F$5:$K$11,4,FALSE))","v":""}]
["","","2018-11-26",1,"",{"$f":"IF(AND(Q341<>\"\",G341=\"\"),1,\"\")","v":""},"",{"$f":"IF(AND(D341=1,K341<>\"\"),1,\"\")","v":""},null,{"$f":"IF(HelligdagsNavn(C341,0,0)<>\"\",HelligdagsNavn(C341,0,0),C341)","v":"1. Søndag i Advent"},null,null,null,null,0,0,{"$f":"IF(OR(C341=\"\",D341=1),\"\",VLOOKUP(WEEKDAY($C341,2),Backend!$F$5:$K$11,4,FALSE))","v":""}]
["",48,"2018-11-27","","",{"$f":"IF(AND(Q342<>\"\",G342=\"\"),1,\"\")","v":1},"",{"$f":"IF(AND(D342=1,K342<>\"\"),1,\"\")","v":""},null,{"$f":"IF(HelligdagsNavn(C342,0,0)<>\"\",HelligdagsNavn(C342,0,0),C342)","v":"2018-11-27"},null,null,null,null,0,0,{"$f":"IF(OR(C342=\"\",D342=1),\"\",VLOOKUP(WEEKDAY($C342,2),Backend!$F$5:$K$11,4,FALSE))","v":"07:24:00"}]
["","","2018-11-28","","",{"$f":"IF(AND(Q343<>\"\",G343=\"\"),1,\"\")","v":1},"",{"$f":"IF(AND(D343=1,K343<>\"\"),1,\"\")","v":""},null,{"$f":"IF(HelligdagsNavn(C343,0,0)<>\"\",HelligdagsNavn(C343,0,0),C343)","v":"2018-11-28"},null,null,null,null,0,0,{"$f":"IF(OR(C343=\"\",D343=1),\"\",VLOOKUP(WEEKDAY($C343,2),Backend!$F$5:$K$11,4,FALSE))","v":"07:24:00"}]
["","","2018-11-29","","",{"$f":"IF(AND(Q344<>\"\",G344=\"\"),1,\"\")","v":1},"",{"$f":"IF(AND(D344=1,K344<>\"\"),1,\"\")","v":""},null,{"$f":"IF(HelligdagsNavn(C344,0,0)<>\"\",HelligdagsNavn(C344,0,0),C344)","v":"2018-11-29"},null,null,null,null,0,0,{"$f":"IF(OR(C344=\"\",D344=1),\"\",VLOOKUP(WEEKDAY($C344,2),Backend!$F$5:$K$11,4,FALSE))","v":"07:24:00"}]
["2018-11-30","","2018-11-30","","",{"$f":"IF(AND(Q345<>\"\",G345=\"\"),1,\"\")","v":1},"",{"$f":"IF(AND(D345=1,K345<>\"\"),1,\"\")","v":""},null,{"$f":"IF(HelligdagsNavn(C345,0,0)<>\"\",HelligdagsNavn(C345,0,0),C345)","v":"Taksigelsesdag"},null,null,null,null,0,0,{"$f":"IF(OR(C345=\"\",D345=1),\"\",VLOOKUP(WEEKDAY($C345,2),Backend!$F$5:$K$11,4,FALSE))","v":"07:24:00"}]
["","","2018-12-01","","",{"$f":"IF(AND(Q346<>\"\",G346=\"\"),1,\"\")","v":1},"",{"$f":"IF(AND(D346=1,K346<>\"\"),1,\"\")","v":""},null,{"$f":"IF(HelligdagsNavn(C346,0,0)<>\"\",HelligdagsNavn(C346,0,0),C346)","v":"2018-12-01"},null,null,null,null,0,0,{"$f":"IF(OR(C346=\"\",D346=1),\"\",VLOOKUP(WEEKDAY($C346,2),Backend!$F$5:$K$11,4,FALSE))","v":"07:24:00"}]
["","","2018-12-02",1,"",{"$f":"IF(AND(Q347<>\"\",G347=\"\"),1,\"\")","v":""},"",{"$f":"IF(AND(D347=1,K347<>\"\"),1,\"\")","v":""},null,{"$f":"IF(HelligdagsNavn(C347,0,0)<>\"\",HelligdagsNavn(C347,0,0),C347)","v":"2018-12-02"},null,null,null,null,0,0,{"$f":"IF(OR(C347=\"\",D347=1),\"\",VLOOKUP(WEEKDAY($C347,2),Backend!$F$5:$K$11,4,FALSE))","v":""}]
["","","2018-12-03",1,"",{"$f":"IF(AND(Q348<>\"\",G348=\"\"),1,\"\")","v":""},"",{"$f":"IF(AND(D348=1,K348<>\"\"),1,\"\")","v":""},null,{"$f":"IF(HelligdagsNavn(C348,0,0)<>\"\",HelligdagsNavn(C348,0,0),C348)","v":"2. Søndag i Advent"},null,null,null,null,0,0,{"$f":"IF(OR(C348=\"\",D348=1),\"\",VLOOKUP(WEEKDAY($C348,2),Backend!$F$5:$K$11,4,FALSE))","v":""}]
["",49,"2018-12-04","","",{"$f":"IF(AND(Q349<>\"\",G349=\"\"),1,\"\")","v":1},"",{"$f":"IF(AND(D349=1,K349<>\"\"),1,\"\")","v":""},null,{"$f":"IF(HelligdagsNavn(C349,0,0)<>\"\",HelligdagsNavn(C349,0,0),C349)","v":"2018-12-04"},null,null,null,null,0,0,{"$f":"IF(OR(C349=\"\",D349=1),\"\",VLOOKUP(WEEKDAY($C349,2),Backend!$F$5:$K$11,4,FALSE))","v":"07:24:00"}]
["","","2018-12-05","","",{"$f":"IF(AND(Q350<>\"\",G350=\"\"),1,\"\")","v":1},"",{"$f":"IF(AND(D350=1,K350<>\"\"),1,\"\")","v":""},null,{"$f":"IF(HelligdagsNavn(C350,0,0)<>\"\",HelligdagsNavn(C350,0,0),C350)","v":"2018-12-05"},null,null,null,null,0,0,{"$f":"IF(OR(C350=\"\",D350=1),\"\",VLOOKUP(WEEKDAY($C350,2),Backend!$F$5:$K$11,4,FALSE))","v":"07:24:00"}]
["","","2018-12-06","","",{"$f":"IF(AND(Q351<>\"\",G351=\"\"),1,\"\")","v":1},"",{"$f":"IF(AND(D351=1,K351<>\"\"),1,\"\")","v":""},null,{"$f":"IF(HelligdagsNavn(C351,0,0)<>\"\",HelligdagsNavn(C351,0,0),C351)","v":"2018-12-06"},null,null,null,null,0,0,{"$f":"IF(OR(C351=\"\",D351=1),\"\",VLOOKUP(WEEKDAY($C351,2),Backend!$F$5:$K$11,4,FALSE))","v":"07:24:00"}]
["","","2018-12-07","","",{"$f":"IF(AND(Q352<>\"\",G352=\"\"),1,\"\")","v":1},"",{"$f":"IF(AND(D352=1,K352<>\"\"),1,\"\")","v":""},null,{"$f":"IF(HelligdagsNavn(C352,0,0)<>\"\",HelligdagsNavn(C352,0,0),C352)","v":"2018-12-07"},null,null,null,null,0,0,{"$f":"IF(OR(C352=\"\",D352=1),\"\",VLOOKUP(WEEKDAY($C352,2),Backend!$F$5:$K$11,4,FALSE))","v":"07:24:00"}]
["","","2018-12-08","","",{"$f":"IF(AND(Q353<>\"\",G353=\"\"),1,\"\")","v":1},"",{"$f":"IF(AND(D353=1,K353<>\"\"),1,\"\")","v":""},null,{"$f":"IF(HelligdagsNavn(C353,0,0)<>\"\",HelligdagsNavn(C353,0,0),C353)","v":"2018-12-08"},null,null,null,null,0,0,{"$f":"IF(OR(C353=\"\",D353=1),\"\",VLOOKUP(WEEKDAY($C353,2),Backend!$F$5:$K$11,4,FALSE))","v":"07:24:00"}]
["","","2018-12-09",1,"",{"$f":"IF(AND(Q354<>\"\",G354=\"\"),1,\"\")","v":""},"",{"$f":"IF(AND(D354=1,K354<>\"\"),1,\"\")","v":""},null,{"$f":"IF(HelligdagsNavn(C354,0,0)<>\"\",HelligdagsNavn(C354,0,0),C354)","v":"2018-12-09"},null,null,null,null,0,0,{"$f":"IF(OR(C354=\"\",D354=1),\"\",VLOOKUP(WEEKDAY($C354,2),Backend!$F$5:$K$11,4,FALSE))","v":""}]
["","","2018-12-10",1,"",{"$f":"IF(AND(Q355<>\"\",G355=\"\"),1,\"\")","v":""},"",{"$f":"IF(AND(D355=1,K355<>\"\"),1,\"\")","v":""},null,{"$f":"IF(HelligdagsNavn(C355,0,0)<>\"\",HelligdagsNavn(C355,0,0),C355)","v":"3. Søndag i Advent"},null,null,null,null,0,0,{"$f":"IF(OR(C355=\"\",D355=1),\"\",VLOOKUP(WEEKDAY($C355,2),Backend!$F$5:$K$11,4,FALSE))","v":""}]
["",50,"2018-12-11","","",{"$f":"IF(AND(Q356<>\"\",G356=\"\"),1,\"\")","v":1},"",{"$f":"IF(AND(D356=1,K356<>\"\"),1,\"\")","v":""},null,{"$f":"IF(HelligdagsNavn(C356,0,0)<>\"\",HelligdagsNavn(C356,0,0),C356)","v":"2018-12-11"},null,null,null,null,0,0,{"$f":"IF(OR(C356=\"\",D356=1),\"\",VLOOKUP(WEEKDAY($C356,2),Backend!$F$5:$K$11,4,FALSE))","v":"07:24:00"}]
["","","2018-12-12","","",{"$f":"IF(AND(Q357<>\"\",G357=\"\"),1,\"\")","v":1},"",{"$f":"IF(AND(D357=1,K357<>\"\"),1,\"\")","v":""},null,{"$f":"IF(HelligdagsNavn(C357,0,0)<>\"\",HelligdagsNavn(C357,0,0),C357)","v":"2018-12-12"},null,null,null,null,0,0,{"$f":"IF(OR(C357=\"\",D357=1),\"\",VLOOKUP(WEEKDAY($C357,2),Backend!$F$5:$K$11,4,FALSE))","v":"07:24:00"}]
["","","2018-12-13","","",{"$f":"IF(AND(Q358<>\"\",G358=\"\"),1,\"\")","v":1},"",{"$f":"IF(AND(D358=1,K358<>\"\"),1,\"\")","v":""},null,{"$f":"IF(HelligdagsNavn(C358,0,0)<>\"\",HelligdagsNavn(C358,0,0),C358)","v":"2018-12-13"},null,null,null,null,0,0,{"$f":"IF(OR(C358=\"\",D358=1),\"\",VLOOKUP(WEEKDAY($C358,2),Backend!$F$5:$K$11,4,FALSE))","v":"07:24:00"}]
["","","2018-12-14","","",{"$f":"IF(AND(Q359<>\"\",G359=\"\"),1,\"\")","v":1},"",{"$f":"IF(AND(D359=1,K359<>\"\"),1,\"\")","v":""},null,{"$f":"IF(HelligdagsNavn(C359,0,0)<>\"\",HelligdagsNavn(C359,0,0),C359)","v":"2018-12-14"},null,null,null,null,0,0,{"$f":"IF(OR(C359=\"\",D359=1),\"\",VLOOKUP(WEEKDAY($C359,2),Backend!$F$5:$K$11,4,FALSE))","v":"07:24:00"}]
["","","2018-12-15","","",{"$f":"IF(AND(Q360<>\"\",G360=\"\"),1,\"\")","v":1},"",{"$f":"IF(AND(D360=1,K360<>\"\"),1,\"\")","v":""},null,{"$f":"IF(HelligdagsNavn(C360,0,0)<>\"\",HelligdagsNavn(C360,0,0),C360)","v":"2018-12-15"},null,null,null,null,0,0,{"$f":"IF(OR(C360=\"\",D360=1),\"\",VLOOKUP(WEEKDAY($C360,2),Backend!$F$5:$K$11,4,FALSE))","v":"07:24:00"}]
["","","2018-12-16",1,"",{"$f":"IF(AND(Q361<>\"\",G361=\"\"),1,\"\")","v":""},"",{"$f":"IF(AND(D361=1,K361<>\"\"),1,\"\")","v":""},null,{"$f":"IF(HelligdagsNavn(C361,0,0)<>\"\",HelligdagsNavn(C361,0,0),C361)","v":"2018-12-16"},null,null,null,null,0,0,{"$f":"IF(OR(C361=\"\",D361=1),\"\",VLOOKUP(WEEKDAY($C361,2),Backend!$F$5:$K$11,4,FALSE))","v":""}]
["","","2018-12-17",1,"",{"$f":"IF(AND(Q362<>\"\",G362=\"\"),1,\"\")","v":""},"",{"$f":"IF(AND(D362=1,K362<>\"\"),1,\"\")","v":""},null,{"$f":"IF(HelligdagsNavn(C362,0,0)<>\"\",HelligdagsNavn(C362,0,0),C362)","v":"4. Søndag i Advent"},null,null,null,null,0,0,{"$f":"IF(OR(C362=\"\",D362=1),\"\",VLOOKUP(WEEKDAY($C362,2),Backend!$F$5:$K$11,4,FALSE))","v":""}]
["",51,"2018-12-18","","",{"$f":"IF(AND(Q363<>\"\",G363=\"\"),1,\"\")","v":1},"",{"$f":"IF(AND(D363=1,K363<>\"\"),1,\"\")","v":""},null,{"$f":"IF(HelligdagsNavn(C363,0,0)<>\"\",HelligdagsNavn(C363,0,0),C363)","v":"2018-12-18"},null,null,null,null,0,0,{"$f":"IF(OR(C363=\"\",D363=1),\"\",VLOOKUP(WEEKDAY($C363,2),Backend!$F$5:$K$11,4,FALSE))","v":"07:24:00"}]
["","","2018-12-19","","",{"$f":"IF(AND(Q364<>\"\",G364=\"\"),1,\"\")","v":1},"",{"$f":"IF(AND(D364=1,K364<>\"\"),1,\"\")","v":""},null,{"$f":"IF(HelligdagsNavn(C364,0,0)<>\"\",HelligdagsNavn(C364,0,0),C364)","v":"2018-12-19"},null,null,null,null,0,0,{"$f":"IF(OR(C364=\"\",D364=1),\"\",VLOOKUP(WEEKDAY($C364,2),Backend!$F$5:$K$11,4,FALSE))","v":"07:24:00"}]
["","","2018-12-20","","",{"$f":"IF(AND(Q365<>\"\",G365=\"\"),1,\"\")","v":1},"",{"$f":"IF(AND(D365=1,K365<>\"\"),1,\"\")","v":""},null,{"$f":"IF(HelligdagsNavn(C365,0,0)<>\"\",HelligdagsNavn(C365,0,0),C365)","v":"Vintersolhverv"},null,null,null,null,0,0,{"$f":"IF(OR(C365=\"\",D365=1),\"\",VLOOKUP(WEEKDAY($C365,2),Backend!$F$5:$K$11,4,FALSE))","v":"07:24:00"}]
["","","2018-12-21","","",{"$f":"IF(AND(Q366<>\"\",G366=\"\"),1,\"\")","v":1},"",{"$f":"IF(AND(D366=1,K366<>\"\"),1,\"\")","v":""},null,{"$f":"IF(HelligdagsNavn(C366,0,0)<>\"\",HelligdagsNavn(C366,0,0),C366)","v":"2018-12-21"},null,null,null,null,0,0,{"$f":"IF(OR(C366=\"\",D366=1),\"\",VLOOKUP(WEEKDAY($C366,2),Backend!$F$5:$K$11,4,FALSE))","v":"07:24:00"}]
["","","2018-12-22","","",{"$f":"IF(AND(Q367<>\"\",G367=\"\"),1,\"\")","v":1},"",{"$f":"IF(AND(D367=1,K367<>\"\"),1,\"\")","v":""},null,{"$f":"IF(HelligdagsNavn(C367,0,0)<>\"\",HelligdagsNavn(C367,0,0),C367)","v":"2018-12-22"},null,null,null,null,0,0,{"$f":"IF(OR(C367=\"\",D367=1),\"\",VLOOKUP(WEEKDAY($C367,2),Backend!$F$5:$K$11,4,FALSE))","v":"07:24:00"}]
["","","2018-12-23",1,"",{"$f":"IF(AND(Q368<>\"\",G368=\"\"),1,\"\")","v":""},"",{"$f":"IF(AND(D368=1,K368<>\"\"),1,\"\")","v":""},null,{"$f":"IF(HelligdagsNavn(C368,0,0)<>\"\",HelligdagsNavn(C368,0,0),C368)","v":"Julaftensdag"},null,null,null,null,0,0,{"$f":"IF(OR(C368=\"\",D368=1),\"\",VLOOKUP(WEEKDAY($C368,2),Backend!$F$5:$K$11,4,FALSE))","v":""}]
["","","2018-12-24",1,"",{"$f":"IF(AND(Q369<>\"\",G369=\"\"),1,\"\")","v":""},"",{"$f":"IF(AND(D369=1,K369<>\"\"),1,\"\")","v":""},null,{"$f":"IF(HelligdagsNavn(C369,0,0)<>\"\",HelligdagsNavn(C369,0,0),C369)","v":"Juledag"},null,null,null,null,0,0,{"$f":"IF(OR(C369=\"\",D369=1),\"\",VLOOKUP(WEEKDAY($C369,2),Backend!$F$5:$K$11,4,FALSE))","v":""}]
["",52,"2018-12-25","","",{"$f":"IF(AND(Q370<>\"\",G370=\"\"),1,\"\")","v":1},"",{"$f":"IF(AND(D370=1,K370<>\"\"),1,\"\")","v":""},null,{"$f":"IF(HelligdagsNavn(C370,0,0)<>\"\",HelligdagsNavn(C370,0,0),C370)","v":"2. Juledag"},null,null,null,null,0,0,{"$f":"IF(OR(C370=\"\",D370=1),\"\",VLOOKUP(WEEKDAY($C370,2),Backend!$F$5:$K$11,4,FALSE))","v":"07:24:00"}]
["","","2018-12-26","","",{"$f":"IF(AND(Q371<>\"\",G371=\"\"),1,\"\")","v":1},"",{"$f":"IF(AND(D371=1,K371<>\"\"),1,\"\")","v":""},null,{"$f":"IF(HelligdagsNavn(C371,0,0)<>\"\",HelligdagsNavn(C371,0,0),C371)","v":"3. Juledag"},null,null,null,null,0,0,{"$f":"IF(OR(C371=\"\",D371=1),\"\",VLOOKUP(WEEKDAY($C371,2),Backend!$F$5:$K$11,4,FALSE))","v":"07:24:00"}]
["","","2018-12-27","","",{"$f":"IF(AND(Q372<>\"\",G372=\"\"),1,\"\")","v":1},"",{"$f":"IF(AND(D372=1,K372<>\"\"),1,\"\")","v":""},null,{"$f":"IF(HelligdagsNavn(C372,0,0)<>\"\",HelligdagsNavn(C372,0,0),C372)","v":"2018-12-27"},null,null,null,null,0,0,{"$f":"IF(OR(C372=\"\",D372=1),\"\",VLOOKUP(WEEKDAY($C372,2),Backend!$F$5:$K$11,4,FALSE))","v":"07:24:00"}]
["","","2018-12-28","","",{"$f":"IF(AND(Q373<>\"\",G373=\"\"),1,\"\")","v":1},"",{"$f":"IF(AND(D373=1,K373<>\"\"),1,\"\")","v":""},null,{"$f":"IF(HelligdagsNavn(C373,0,0)<>\"\",HelligdagsNavn(C373,0,0),C373)","v":"2018-12-28"},null,null,null,null,0,0,{"$f":"IF(OR(C373=\"\",D373=1),\"\",VLOOKUP(WEEKDAY($C373,2),Backend!$F$5:$K$11,4,FALSE))","v":"07:24:00"}]
["","","2018-12-29","","",{"$f":"IF(AND(Q374<>\"\",G374=\"\"),1,\"\")","v":1},"",{"$f":"IF(AND(D374=1,K374<>\"\"),1,\"\")","v":""},null,{"$f":"IF(HelligdagsNavn(C374,0,0)<>\"\",HelligdagsNavn(C374,0,0),C374)","v":"2018-12-29"},null,null,null,null,0,0,{"$f":"IF(OR(C374=\"\",D374=1),\"\",VLOOKUP(WEEKDAY($C374,2),Backend!$F$5:$K$11,4,FALSE))","v":"07:24:00"}]
["","","2018-12-30",1,"",{"$f":"IF(AND(Q375<>\"\",G375=\"\"),1,\"\")","v":""},"",{"$f":"IF(AND(D375=1,K375<>\"\"),1,\"\")","v":""},null,{"$f":"IF(HelligdagsNavn(C375,0,0)<>\"\",HelligdagsNavn(C375,0,0),C375)","v":"Nytårsaftensdag"},null,null,null,null,0,0,{"$f":"IF(OR(C375=\"\",D375=1),\"\",VLOOKUP(WEEKDAY($C375,2),Backend!$F$5:$K$11,4,FALSE))","v":""}]
[null,null,null,"","",{"$f":"IF(AND(Q376<>\"\",G376=\"\"),1,\"\")","v":""},"",{"$f":"IF(AND(D376=1,K376<>\"\"),1,\"\")","v":""},null,{"$f":"IF(HelligdagsNavn(C376,0,0)<>\"\",HelligdagsNavn(C376,0,0),C376)","v":"00:00:00"},null,null,null,null,0,0,{"$f":"IF(OR(C376=\"\",D376=1),\"\",VLOOKUP(WEEKDAY($C376,2),Backend!$F$5:$K$11,4,FALSE))","v":""}]