{"text_format":"1","workbook":"xlsx","n_sheets":8,"sheets":["T.","Købskalender","Påfyldningskalender","Piller På Lager","PilleStatistik","Års Totaler","System","Vejledning"],"not_rendered":{"charts":0,"images":11,"macros":1,"external_links":2,"defined_names":16,"comments":4,"pivot_tables":0},"unopened":[],"bounds":{"document_bytes":16777216,"sheet_cells":100000,"rows_first":2000,"rows_last":500,"rows_between":2000,"halvings":0,"cell_chars":16384,"cell_head_chars":4096},"cells_cut":0,"cells_raw":0,"read":"whole","date_system":"1900"}

{"sheet":"T.","index":0,"n_rows":54,"n_cols":10,"rows_kept":54,"cut":false,"hidden":false,"merged":[[0,9,0,15],[38,0,38,2],[39,3,39,4],[3,0,3,6],[5,0,5,6],[23,1,23,4]]}
["Info om hus",null,null,null,null,null,null,null,null,{"$f":"System!A9","v":"Version: 1.01.05 TræPiller / Bjarne Hansen"}]
["Opvarmet areal",200,"m2"]
[]
["Graddage i området (brug lokale data for dit område)"]
[]
["OBS! Brug de graddage der er kompenseret for vind. Det er nok at udfylde for de måneder, hvor der fyres."]
[]
["Januar",519,"stk"]
["Februar",486,"stk"]
["Marts",444,"stk"]
["April",311,"stk"]
["Maj",154,"stk"]
["Juni",58,"stk"]
["Juli",22,"stk"]
["August",18,"stk"]
["September",91,"stk"]
["Oktober",207,"stk"]
["November",341,"stk"]
["December",461,"stk"]
[null,{"$f":"SUM(B8:B19)","v":3112}]
[]
["Forbrugs Adresse"]
[]
["Adresse : ","Din Adresse indtastes på fanen T."]
[]
["Fyringssæson"]
[]
["Året Regnskabet er taget ibrug : ",2025]
[]
["Valgt år hvor fyringssæsonen starter :",2025]
[null,2022]
[null,"Måned","Dato"]
["Fyringssæson start måned og dato : ",1,1]
[null,"Måned","Dato"]
["Fyringssæson slut måned og dato : ",12,{"$f":"DAY(EOMONTH(D35,0))","v":"1900-01-31"},{"$f":"DATE(B30,B35,1)","v":"2025-12-01"}]
["Startdato for fyringssæson",{"$f":"DATE(T.!B30,B33,C33)","v":"2025-01-01"},"dd-mm-åååå"]
["Forventet slutdato for fyringssæson",{"$f":"IF(B35<B33,DATE(T.!B30+1,B35,C35),DATE(T.!B30,B35,C35))","v":"2025-12-31"},"dd-mm-åååå"]
[]
["Energiindhold"]
["Dine træpiller",4.8,"kWh/kg","(4,8 kWh/kg er std.)"]
[]
["Fabrikat Piller","Sække pr pl","kg pr sæk","kg pr pl"]
["Fågelfors Pellets",52,16,{"$f":"B43*C43","v":832}]
["Södra 8mm 16 kg",56,16,{"$f":"B44*C44","v":896}]
["Södra 6mm 10 kg",90,10,900]
["Södra 6mm 16 kg",56,16,896]
[null,null,null,0]
[null,null,null,0]
[null,null,null,{"$f":"B49*C49","v":0}]
[null,null,null,0]
[null,null,null,0]
[null,null,null,0]
[null,null,null,0]
[null,null,null,0]

{"sheet":"Købskalender","index":1,"n_rows":34,"n_cols":13,"rows_kept":34,"cut":false,"hidden":false,"merged":[[1,7,1,8],[0,6,0,9],[14,26,14,27],[15,21,15,25],[4,21,4,25],[4,26,4,27],[10,21,10,24],[11,21,11,24]]}
["Indkøbs kalender",null,null,null,null,null,{"$f":"System!A9","v":"Version: 1.01.05 TræPiller / Bjarne Hansen"}]
[null,null,null,null,null,null,null,"Gns. kilopris",null,{"$f":"IFERROR(SUM(F:F)/SUM(E:E),\"\")","v":""}]
["Dato","Fabrikat","Paller","Sække","Kilo","Pris","Levering.","Pris I alt","kilopris","kilopris"]
[null,null,null,null,{"$f":"IF(A4<>\"\",D4*T.!#REF!,\"\")","v":""},null,null,{"$f":"F4+G4","v":0},{"$f":"IF(A4<>\"\",F4/E4,\"\")","v":""},{"$f":"IFERROR(H4/E4,\"\")","v":""},null,null,"<---- BRUGES KUN VED OPSTART AF NYT REGNSKAB HVOR MAN HAR PILLER PÅ LAGER"]
[null,null,null,{"$f":"IF(A5<>\"\",C5*T.!#REF!,\"\")","v":""},{"$f":"IF(A5<>\"\",D5*T.!#REF!,\"\")","v":""},null,null,{"$f":"F5+G5","v":0},{"$f":"IF(A5<>\"\",F5/E5,\"\")","v":""},{"$f":"IFERROR(H5/E5,\"\")","v":""},null,null,"Ellers bruges denne linje hvor man taster fabrikat og antal paller ind man har købt"]
[null,null,null,{"$f":"IF(A6<>\"\",C6*T.!#REF!,\"\")","v":""},{"$f":"IF(A6<>\"\",D6*T.!#REF!,\"\")","v":""},null,null,{"$f":"F6+G6","v":0},"",""]
[null,null,null,{"$f":"IF(A7<>\"\",C7*T.!#REF!,\"\")","v":""},{"$f":"IF(A7<>\"\",D7*T.!#REF!,\"\")","v":""},null,null,{"$f":"F7+G7","v":0},{"$f":"IF(A7<>\"\",F7/E7,\"\")","v":""},{"$f":"IFERROR(H7/E7,\"\")","v":""}]
[null,null,null,{"$f":"IF(A8<>\"\",C8*T.!#REF!,\"\")","v":""},{"$f":"IF(A8<>\"\",D8*T.!#REF!,\"\")","v":""},null,null,{"$f":"F8+G8","v":0},{"$f":"IF(A8<>\"\",F8/E8,\"\")","v":""},{"$f":"IFERROR(H8/E8,\"\")","v":""}]
[null,null,null,{"$f":"IF(A9<>\"\",C9*T.!#REF!,\"\")","v":""},{"$f":"IF(A9<>\"\",D9*T.!#REF!,\"\")","v":""},null,null,0,"",""]
[null,null,null,{"$f":"IF(A10<>\"\",C10*T.!#REF!,\"\")","v":""},{"$f":"IF(A10<>\"\",D10*T.!#REF!,\"\")","v":""},null,null,{"$f":"F10+G10","v":0},{"$f":"IF(A10<>\"\",F10/E10,\"\")","v":""},{"$f":"IFERROR(H10/E10,\"\")","v":""}]
[null,null,null,{"$f":"IF(A11<>\"\",C11*T.!#REF!,\"\")","v":""},{"$f":"IF(A11<>\"\",D11*T.!#REF!,\"\")","v":""},null,null,0,"",""]
[null,null,null,{"$f":"IF(A12<>\"\",C12*T.!#REF!,\"\")","v":""},{"$f":"IF(A12<>\"\",D12*T.!#REF!,\"\")","v":""},null,null,0,"",""]
[null,null,null,{"$f":"IF(A13<>\"\",C13*_xlfn.XLOOKUP(B13,T.!$A$43:$A$47,T.!$B$43:$B$47,\"\",0,1),\"\")","v":""},{"$f":"IF(D13<>\"\",D13*_xlfn.XLOOKUP(B13,T.!$A$43:$A$47,T.!$C$43:$C$47,\"\",0,1),\"\")","v":""},null,null,0,"",""]
[null,null,null,{"$f":"IF(A14<>\"\",C14*T.!#REF!,\"\")","v":""},{"$f":"IF(A14<>\"\",D14*T.!#REF!,\"\")","v":""},null,null,0,"",""]
[null,null,null,{"$f":"IF(A15<>\"\",C15*T.!#REF!,\"\")","v":""},{"$f":"IF(A15<>\"\",D15*T.!#REF!,\"\")","v":""},null,null,0,"",""]
[null,null,null,{"$f":"IF(A16<>\"\",C16*T.!#REF!,\"\")","v":""},{"$f":"IF(A16<>\"\",D16*T.!#REF!,\"\")","v":""},null,null,0,"",""]
[null,null,null,{"$f":"IF(A17<>\"\",C17*T.!#REF!,\"\")","v":""},{"$f":"IF(A17<>\"\",D17*T.!#REF!,\"\")","v":""},null,null,0,"",""]
[null,null,null,{"$f":"IF(A18<>\"\",C18*T.!#REF!,\"\")","v":""},{"$f":"IF(A18<>\"\",D18*T.!#REF!,\"\")","v":""},null,null,0,"",""]
[null,null,null,{"$f":"IF(A19<>\"\",C19*T.!#REF!,\"\")","v":""},{"$f":"IF(A19<>\"\",D19*T.!#REF!,\"\")","v":""},null,null,0,"",""]
[null,null,null,{"$f":"IF(A20<>\"\",C20*T.!#REF!,\"\")","v":""},{"$f":"IF(A20<>\"\",D20*T.!#REF!,\"\")","v":""},null,null,{"$f":"F20+G20","v":0},{"$f":"IF(A20<>\"\",F20/E20,\"\")","v":""},{"$f":"IFERROR(H20/E20,\"\")","v":""}]
[null,null,null,{"$f":"IF(A21<>\"\",C21*T.!#REF!,\"\")","v":""},{"$f":"IF(A21<>\"\",D21*T.!#REF!,\"\")","v":""},null,null,0,"",""]
[null,null,null,{"$f":"IF(A22<>\"\",C22*T.!#REF!,\"\")","v":""},{"$f":"IF(A22<>\"\",D22*T.!#REF!,\"\")","v":""},null,null,0,"",""]
[null,null,null,{"$f":"IF(A23<>\"\",C23*T.!#REF!,\"\")","v":""},{"$f":"IF(A23<>\"\",D23*T.!#REF!,\"\")","v":""},null,null,0,"",""]
[null,null,null,{"$f":"IF(A24<>\"\",C24*T.!#REF!,\"\")","v":""},{"$f":"IF(A24<>\"\",D24*T.!#REF!,\"\")","v":""},null,null,0,"",""]
[null,null,null,{"$f":"IF(A25<>\"\",C25*T.!#REF!,\"\")","v":""},{"$f":"IF(A25<>\"\",D25*T.!#REF!,\"\")","v":""},null,null,0,"",""]
[null,null,null,{"$f":"IF(A26<>\"\",C26*T.!#REF!,\"\")","v":""},{"$f":"IF(A26<>\"\",D26*T.!#REF!,\"\")","v":""},null,null,0,"",""]
[null,null,null,{"$f":"IF(A27<>\"\",C27*T.!#REF!,\"\")","v":""},{"$f":"IF(A27<>\"\",D27*T.!#REF!,\"\")","v":""},null,null,0,"",""]
[null,null,null,{"$f":"IF(A28<>\"\",C28*T.!#REF!,\"\")","v":""},{"$f":"IF(A28<>\"\",D28*T.!#REF!,\"\")","v":""},null,null,0,"",""]
[null,null,null,{"$f":"IF(A29<>\"\",C29*T.!#REF!,\"\")","v":""},{"$f":"IF(A29<>\"\",D29*T.!#REF!,\"\")","v":""},null,null,0,"",""]
[null,null,null,{"$f":"IF(A30<>\"\",C30*T.!#REF!,\"\")","v":""},{"$f":"IF(A30<>\"\",D30*T.!#REF!,\"\")","v":""},null,null,0,"",""]
[null,null,null,{"$f":"IF(A31<>\"\",C31*T.!#REF!,\"\")","v":""},{"$f":"IF(A31<>\"\",D31*T.!#REF!,\"\")","v":""},null,null,0,"",""]
[null,null,null,{"$f":"IF(A32<>\"\",C32*T.!#REF!,\"\")","v":""},{"$f":"IF(A32<>\"\",D32*T.!#REF!,\"\")","v":""},null,null,0,"",""]
[null,null,null,{"$f":"IF(A33<>\"\",C33*T.!#REF!,\"\")","v":""},{"$f":"IF(A33<>\"\",D33*T.!#REF!,\"\")","v":""},null,null,0,"",""]
[null,null,null,{"$f":"IF(A34<>\"\",C34*T.!#REF!,\"\")","v":""},{"$f":"IF(A34<>\"\",D34*T.!#REF!,\"\")","v":""},null,null,0,"",""]

{"sheet":"Påfyldningskalender","index":2,"n_rows":140,"n_cols":23,"rows_kept":140,"cut":false,"hidden":false,"merged":[[139,8,139,9],[130,8,130,9],[131,8,131,9],[132,8,132,9],[133,8,133,9],[134,8,134,9],[135,8,135,9],[136,8,136,9],[137,8,137,9],[138,8,138,9],[121,8,121,9],[122,8,122,9],[123,8,123,9],[124,8,124,9],[125,8,125,9],[126,8,126,9],[127,8,127,9],[128,8,128,9],[129,8,129,9],[112,8,112,9],[113,8,113,9],[114,8,114,9],[115,8,115,9],[116,8,116,9],[117,8,117,9],[118,8,118,9],[119,8,119,9],[120,8,120,9],[103,8,103,9],[104,8,104,9],[105,8,105,9],[106,8,106,9],[107,8,107,9],[108,8,108,9],[109,8,109,9],[110,8,110,9],[111,8,111,9],[31,8,31,9],[32,8,32,9],[33,8,33,9],[34,8,34,9],[35,8,35,9],[36,8,36,9],[37,8,37,9],[60,8,60,9],[47,8,47,9],[42,8,42,9],[43,8,43,9],[44,8,44,9],[45,8,45,9],[46,8,46,9],[58,8,58,9],[59,8,59,9],[54,8,54,9],[55,8,55,9],[56,8,56,9],[48,8,48,9],[49,8,49,9],[50,8,50,9],[51,8,51,9],[57,8,57,9],[38,8,38,9],[53,8,53,9],[39,8,39,9],[40,8,40,9],[52,8,52,9],[41,8,41,9],[23,8,23,9],[1,8,1,9],[3,8,3,9],[2,8,2,9],[28,8,28,9],[26,8,26,9],[27,8,27,9],[17,8,17,9],[19,8,19,9],[20,8,20,9],[21,8,21,9],[22,8,22,9],[18,8,18,9],[24,8,24,9],[25,8,25,9],[4,8,4,9],[29,8,29,9],[30,8,30,9],[4,13,4,14],[0,1,0,9],[15,8,15,9],[16,8,16,9],[10,8,10,9],[11,8,11,9],[12,8,12,9],[13,8,13,9],[14,8,14,9],[5,8,5,9],[6,8,6,9],[7,8,7,9],[8,8,8,9],[9,8,9,9],[16,11,16,12],[16,13,16,14],[66,8,66,9],[67,8,67,9],[68,8,68,9],[69,8,69,9],[70,8,70,9],[61,8,61,9],[62,8,62,9],[63,8,63,9],[64,8,64,9],[65,8,65,9],[76,8,76,9],[77,8,77,9],[78,8,78,9],[79,8,79,9],[80,8,80,9],[71,8,71,9],[72,8,72,9],[73,8,73,9],[74,8,74,9],[75,8,75,9],[2,17,2,18],[2,19,2,20],[101,8,101,9],[102,8,102,9],[96,8,96,9],[97,8,97,9],[98,8,98,9],[99,8,99,9],[100,8,100,9],[91,8,91,9],[92,8,92,9],[93,8,93,9],[94,8,94,9],[95,8,95,9],[86,8,86,9],[87,8,87,9],[88,8,88,9],[89,8,89,9],[90,8,90,9],[81,8,81,9],[82,8,82,9],[83,8,83,9],[84,8,84,9],[85,8,85,9],[13,15,13,16],[4,15,4,16],[5,15,5,16],[6,15,6,16],[7,15,7,16],[8,15,8,16],[9,15,9,16],[10,15,10,16],[11,15,11,16],[12,15,12,16]]}
[null,"Påfyldnings kalender"]
[null,"Dato","dage","sække","Kg \npr sæk","kg","kg \npr dag","sække pr dag","Bemærkning",null,null,null,"dage","sække","kg","kg pr dag","sække pr dag"]
[null,null,null,null,null,null,null,null,null,null,null,"genn. Snit",{"$f":"MAX(Påfyldningskalender!B:B)-Påfyldningskalender!B4","v":0},{"$f":"SUM(Påfyldningskalender!D:D)","v":0},{"$f":"SUM(Påfyldningskalender!F:F)","v":0},{"$f":"IFERROR(O3/M3,\"\")","v":""},{"$f":"IFERROR(N3/M3,0)","v":0},{"$f":"IFERROR(L17-7,\"\")","v":-7},null,null,null,{"$f":"SUMIF(B:B,\">\"&MAX(B:B)-7,G:G)/W3","v":{"$error":"#DIV/0!"}},{"$f":"COUNTIF(B:B,\">\"&MAX(B:B)-7)","v":0}]
[]
[null,null,{"$f":"IF(B5<>\"\",B5-B4,\"\")","v":""},null,null,{"$f":"IF(B5<>\"\",D5*E5,\"\")","v":""},{"$f":"IFERROR(F5/C5,\"\")","v":""},{"$f":"IFERROR(D5/C5,\"\")","v":""},null,null,null,null,null,"Kg. pr. år",null,"Sække á 16 Kg."]
[null,null,"",null,null,"","","",null,null,null,null,null,2022,{"$f":"SUMIFS(Påfyldningskalender!F:F,Påfyldningskalender!B:B,\">=\"&'Års Totaler'!G4,Påfyldningskalender!B:B,\"<\"&'Års Totaler'!H4)","v":0},{"$f":"O6/16","v":0}]
[null,null,"",null,null,"","","",null,null,null,null,null,2023,{"$f":"SUMIFS(Påfyldningskalender!F:F,Påfyldningskalender!B:B,\">=\"&'Års Totaler'!G5,Påfyldningskalender!B:B,\"<\"&'Års Totaler'!H5)","v":0},{"$f":"O7/16","v":0}]
[null,null,"",null,null,"","","",null,null,null,null,null,2024,{"$f":"SUMIFS(Påfyldningskalender!F:F,Påfyldningskalender!B:B,\">=\"&'Års Totaler'!G6,Påfyldningskalender!B:B,\"<\"&'Års Totaler'!H6)","v":0},0]
[null,null,"",null,null,"","","",null,null,null,null,null,2025,{"$f":"SUMIFS(Påfyldningskalender!F:F,Påfyldningskalender!B:B,\">=\"&'Års Totaler'!G7,Påfyldningskalender!B:B,\"<\"&'Års Totaler'!H7)","v":0},0]
[null,null,{"$f":"IF(B10<>\"\",B10-B9,\"\")","v":""},null,null,"","","",null,null,null,null,null,2026,{"$f":"SUMIFS(Påfyldningskalender!F:F,Påfyldningskalender!B:B,\">=\"&'Års Totaler'!G8,Påfyldningskalender!B:B,\"<\"&'Års Totaler'!H8)","v":0},0]
[null,null,"",null,null,"","","",null,null,null,null,null,2027,{"$f":"SUMIFS(Påfyldningskalender!F:F,Påfyldningskalender!B:B,\">=\"&'Års Totaler'!G9,Påfyldningskalender!B:B,\"<\"&'Års Totaler'!H9)","v":0},0]
[null,null,"",null,null,"","","",null,null,null,null,null,2028,{"$f":"SUMIFS(Påfyldningskalender!F:F,Påfyldningskalender!B:B,\">=\"&'Års Totaler'!G10,Påfyldningskalender!B:B,\"<\"&'Års Totaler'!H10)","v":0},0]
[null,null,"",null,null,"","","",null,null,null,null,null,2029,{"$f":"SUMIFS(Påfyldningskalender!F:F,Påfyldningskalender!B:B,\">=\"&'Års Totaler'!G11,Påfyldningskalender!B:B,\"<\"&'Års Totaler'!H11)","v":0},0]
[null,null,"",null,null,"","","",null,null,null,null,null,2030,{"$f":"SUMIFS(Påfyldningskalender!F:F,Påfyldningskalender!B:B,\">=\"&'Års Totaler'!G12,Påfyldningskalender!B:B,\"<\"&'Års Totaler'!H12)","v":0},0]
[null,null,"",null,null,"","",""]
[null,null,"",null,null,"","",""]
[null,null,"",null,null,"","","",null,null,null,{"$f":"MAX(B:B)","v":"00:00:00"},null,null,null,{"$f":"IFERROR(VLOOKUP(L17,B:G,6),0)","v":0}]
[null,null,"",null,null,"","",""]
[null,null,"",null,null,"","",""]
[null,null,"",null,null,"","",""]
[null,null,"",null,null,"","",""]
[null,null,"",null,null,"","",""]
[null,null,"",null,null,"","",""]
[null,null,"",null,null,"","",""]
[null,null,"",null,null,"","",""]
[null,null,"",null,null,"","",""]
[null,null,"",null,null,"","",""]
[null,null,"",null,null,"","",""]
[null,null,"",null,null,"","",""]
[null,null,"",null,null,"","",""]
[null,null,"",null,null,"","",""]
[null,null,"",null,null,"","",""]
[null,null,"",null,null,"","",""]
[null,null,"",null,null,"","",""]
[null,null,"",null,null,"","",""]
[null,null,"",null,null,"","",""]
[null,null,{"$f":"IF(B37<>\"\",B37-B36,\"\")","v":""},null,null,"",{"$f":"IFERROR(F37/C37,\"\")","v":""},{"$f":"IFERROR(D37/C37,\"\")","v":""}]
[null,null,"",null,null,"","",""]
[null,null,"",null,null,"","",""]
[null,null,"",null,null,"","",""]
[null,null,"",null,null,"","",""]
[null,null,"",null,null,"","",""]
[null,null,"",null,null,"","",""]
[null,null,"",null,null,"","",""]
[null,null,"",null,null,"","",""]
[null,null,"",null,null,"","",""]
[null,null,"",null,null,"","",""]
[null,null,"",null,null,"","",""]
[null,null,"",null,null,"","",""]
[null,null,"",null,null,"","",""]
[null,null,"",null,null,"","",""]
[null,null,"",null,null,"","",""]
[null,null,"",null,null,"","",""]
[null,null,"",null,null,"","",""]
[null,null,"",null,null,"","",""]
[null,null,"",null,null,"","",""]
[null,null,"",null,null,"","",""]
[null,null,"",null,null,"","",""]
[null,null,{"$f":"IF(B59<>\"\",B59-B58,\"\")","v":""},null,null,"","",""]
[null,null,{"$f":"IF(B60<>\"\",B60-B59,\"\")","v":""},null,null,"","",""]
[null,null,{"$f":"IF(B61<>\"\",B61-B60,\"\")","v":""},null,null,"","",""]
[null,null,{"$f":"IF(B62<>\"\",B62-B61,\"\")","v":""},null,null,"",{"$f":"IFERROR(F62/C62,\"\")","v":""},{"$f":"IFERROR(D62/C62,\"\")","v":""}]
[null,null,"",null,null,"","",""]
[null,null,"",null,null,"","",""]
[null,null,"",null,null,"","",""]
[null,null,"",null,null,"","",""]
[null,null,"",null,null,"","",""]
[null,null,"",null,null,"","",""]
[null,null,"",null,null,{"$f":"IF(B69<>\"\",D69*E69,\"\")","v":""},"",""]
[null,null,"",null,null,"","",""]
[null,null,"",null,null,"","",""]
[null,null,"",null,null,"","",""]
[null,null,"",null,null,"","",""]
[null,null,"",null,null,"","",""]
[null,null,"",null,null,"","",""]
[null,null,"",null,null,"","",""]
[null,null,"",null,null,"","",""]
[null,null,"",null,null,"","",""]
[null,null,"",null,null,"","",""]
[null,null,"",null,null,"","",""]
[null,null,"",null,null,"","",""]
[null,null,"",null,null,"","",""]
[null,null,{"$f":"IF(B83<>\"\",B83-B82,\"\")","v":""},null,null,"","",""]
[null,null,{"$f":"IF(B84<>\"\",B84-B83,\"\")","v":""},null,null,"",{"$f":"IFERROR(F84/C84,\"\")","v":""},{"$f":"IFERROR(D84/C84,\"\")","v":""}]
[null,null,"",null,null,"","",""]
[null,null,"",null,null,"","",""]
[null,null,"",null,null,"","",""]
[null,null,"",null,null,"","",""]
[null,null,"",null,null,"","",""]
[null,null,"",null,null,"","",""]
[null,null,"",null,null,"","",""]
[null,null,"",null,null,"","",""]
[null,null,"",null,null,"","",""]
[null,null,"",null,null,"","",""]
[null,null,"",null,null,"","",""]
[null,null,"",null,null,"","",""]
[null,null,"",null,null,"","",""]
[null,null,"",null,null,"","",""]
[null,null,"",null,null,"","",""]
[null,null,"",null,null,"","",""]
[null,null,"",null,null,"","",""]
[null,null,{"$f":"IF(B102<>\"\",B102-B101,\"\")","v":""},null,null,"",{"$f":"IFERROR(F102/C102,\"\")","v":""},{"$f":"IFERROR(D102/C102,\"\")","v":""}]
[null,null,"",null,null,"","",""]
[null,null,{"$f":"IF(B104<>\"\",B104-B103,\"\")","v":""},null,null,"",{"$f":"IFERROR(F104/C104,\"\")","v":""},{"$f":"IFERROR(D104/C104,\"\")","v":""}]
[null,null,"",null,null,"","",""]
[null,null,"",null,null,"","",""]
[null,null,"",null,null,"","",""]
[null,null,"",null,null,"","",""]
[null,null,"",null,null,"","",""]
[null,null,"",null,null,"","",""]
[null,null,"",null,null,"","",""]
[null,null,"",null,null,"","",""]
[null,null,"",null,null,"","",""]
[null,null,"",null,null,"","",""]
[null,null,"",null,null,"","",""]
[null,null,"",null,null,"","",""]
[null,null,"",null,null,"","",""]
[null,null,"",null,null,{"$f":"IF(B118<>\"\",D118*E118,\"\")","v":""},"",""]
[null,null,"",null,null,"","",""]
[null,null,"",null,null,"","",""]
[null,null,"",null,null,"","",""]
[null,null,"",null,null,"","",""]
[null,null,"",null,null,"","",""]
[null,null,"",null,null,"","",""]
[null,null,"",null,null,"","",""]
[null,null,"",null,null,"","",""]
[null,null,"",null,null,"","",""]
[null,null,"",null,null,"","",""]
[null,null,"",null,null,"","",""]
[null,null,"",null,null,"","",""]
[null,null,"",null,null,"","",""]
[null,null,"",null,null,"","",""]
[null,null,"",null,null,"","",""]
[null,null,"",null,null,"","",""]
[null,null,"",null,null,"","",""]
[null,null,"",null,null,"","",""]
[null,null,"",null,null,"","",""]
[null,null,"",null,null,"","",""]
[null,null,"",null,null,"","",""]
[null,null,"",null,null,"","",""]

{"sheet":"Piller På Lager","index":3,"n_rows":35,"n_cols":16,"rows_kept":35,"cut":false,"hidden":false,"merged":[[24,3,24,4],[24,1,24,2],[7,5,8,5],[7,6,8,6],[1,1,1,12],[2,6,2,12],[4,5,4,6],[4,7,4,12],[6,3,6,5],[6,6,6,7],[6,8,6,9],[6,10,6,12],[7,1,8,1],[24,6,27,6],[7,14,8,14],[7,15,8,15],[21,2,21,12],[22,8,22,12],[7,7,8,7],[7,8,8,8],[7,9,8,9],[7,10,8,10],[7,11,8,11],[7,12,8,12],[7,2,8,2],[7,3,8,3],[7,4,8,4],[29,2,29,3],[29,4,29,5],[30,5,32,5],[25,1,25,2],[25,3,25,4],[26,1,26,2],[26,3,26,4],[27,1,27,2],[27,3,27,4]]}
[]
[null,"PilleRegnSkab - Piller på lager"]
[null,{"$f":"\"Fyringssæson - \"&T.!B30","v":"Fyringssæson - 2025"},null,null,null,null,{"$f":"System!A9","v":"Version: 1.01.05 TræPiller / Bjarne Hansen"}]
[]
[null,"Dags dato : ",{"$f":"TODAY()","v":"2025-01-26"},"Uge : ",{"$f":"WEEKNUM(C5,2)","v":4},"Forbrugs adresse: ",null,{"$f":"T.!B24","v":"Din Adresse indtastes på fanen T."}]
[]
[null,null,null,"Indkøb pr. måned",null,null,"Fyldt på magasin",null,"Forbrug pr. måned"]
[null,"Måned","Dage","Kg. Leveret","Købs pris kr","Pris pr. kg.","Sække","kg.","Forbrug pr.\ndøgn kg.","Pris pr. kg\ntræpiller","Pris pr.\ndøgn","Pris pr. l. Olie","Besparelses"]
[]
[null,{"$f":"DATE(T.!$B$30,T.!B33,1)","v":"2025-01-01"},{"$f":"TEXT(EOMONTH(B10,0),\"dd\")","v":"31"},{"$f":"SUMIFS(Købskalender!E:E,Købskalender!A:A,\">=\"&B10,Købskalender!A:A,\"<\"&B11)","v":0},{"$f":"SUMIFS(Købskalender!F:F,Købskalender!A:A,\">=0\"&B10,Købskalender!A:A,\"<\"&B11)","v":0},{"$f":"IFERROR(E10/D10,\"\")","v":""},{"$f":"SUMIFS(Påfyldningskalender!D:D,Påfyldningskalender!B:B,\">=\"&B10,Påfyldningskalender!B:B,\"<\"&B11)","v":0},{"$f":"SUMIFS(Påfyldningskalender!F:F,Påfyldningskalender!B:B,\">=\"&B10,Påfyldningskalender!B:B,\"<\"&B11)","v":0},{"$f":"H10/C10","v":0},null,{"$f":"I10*J10","v":0},null,{"$f":"P10-O10","v":0},null,{"$f":"H10*J10","v":0},{"$f":"H10*4.9/10*L10","v":0}]
[null,{"$f":"DATE(T.!$B$30,T.!$B$33+1,1)","v":"2025-02-01"},"28",{"$f":"SUMIFS(Købskalender!F:F,Købskalender!A:A,\">=\"&B11,Købskalender!A:A,\"<\"&B12)","v":0},{"$f":"SUMIFS(Købskalender!F:F,Købskalender!A:A,\">=0\"&B11,Købskalender!A:A,\"<\"&B12)","v":0},{"$f":"IFERROR(E11/D11,\"\")","v":""},{"$f":"SUMIFS(Påfyldningskalender!D:D,Påfyldningskalender!B:B,\">=\"&B11,Påfyldningskalender!B:B,\"<\"&B12)","v":0},{"$f":"SUMIFS(Påfyldningskalender!F:F,Påfyldningskalender!B:B,\">=\"&B11,Påfyldningskalender!B:B,\"<\"&B12)","v":0},{"$f":"H11/C11","v":0},null,0,null,{"$f":"P11-O11","v":0},null,{"$f":"H11*J11","v":0},{"$f":"H11*4.9/10*L11","v":0}]
[null,{"$f":"DATE(T.!$B$30,T.!$B$33+2,1)","v":"2025-03-01"},"31",{"$f":"SUMIFS(Købskalender!E:E,Købskalender!A:A,\">=\"&B12,Købskalender!A:A,\"<\"&B13)","v":0},{"$f":"SUMIFS(Købskalender!F:F,Købskalender!A:A,\">=0\"&B12,Købskalender!A:A,\"<\"&B13)","v":0},{"$f":"IFERROR(E12/D12,\"\")","v":""},{"$f":"SUMIFS(Påfyldningskalender!D:D,Påfyldningskalender!B:B,\">=\"&B12,Påfyldningskalender!B:B,\"<\"&B13)","v":0},{"$f":"SUMIFS(Påfyldningskalender!F:F,Påfyldningskalender!B:B,\">=\"&B12,Påfyldningskalender!B:B,\"<\"&B13)","v":0},{"$f":"H12/C12","v":0},null,0,null,0,null,0,0]
[null,{"$f":"DATE(T.!$B$30,T.!$B$33+3,1)","v":"2025-04-01"},"30",{"$f":"SUMIFS(Købskalender!E:E,Købskalender!A:A,\">=\"&B13,Købskalender!A:A,\"<\"&B14)","v":0},{"$f":"SUMIFS(Købskalender!F:F,Købskalender!A:A,\">=0\"&B13,Købskalender!A:A,\"<\"&B14)","v":0},{"$f":"IFERROR(E13/D13,\"\")","v":""},{"$f":"SUMIFS(Påfyldningskalender!D:D,Påfyldningskalender!B:B,\">=\"&B13,Påfyldningskalender!B:B,\"<\"&B14)","v":0},{"$f":"SUMIFS(Påfyldningskalender!F:F,Påfyldningskalender!B:B,\">=\"&B13,Påfyldningskalender!B:B,\"<\"&B14)","v":0},{"$f":"H13/C13","v":0},null,0,null,0,null,0,0]
[null,{"$f":"DATE(T.!$B$30,T.!$B$33+4,1)","v":"2025-05-01"},"31",{"$f":"SUMIFS(Købskalender!E:E,Købskalender!A:A,\">=\"&B14,Købskalender!A:A,\"<\"&B15)","v":0},{"$f":"SUMIFS(Købskalender!F:F,Købskalender!A:A,\">=0\"&B14,Købskalender!A:A,\"<\"&B15)","v":0},"",{"$f":"SUMIFS(Påfyldningskalender!D:D,Påfyldningskalender!B:B,\">=\"&B14,Påfyldningskalender!B:B,\"<\"&B15)","v":0},{"$f":"SUMIFS(Påfyldningskalender!F:F,Påfyldningskalender!B:B,\">=\"&B14,Påfyldningskalender!B:B,\"<\"&B15)","v":0},{"$f":"H14/C14","v":0},null,0,null,0,null,0,0]
[null,{"$f":"DATE(T.!$B$30,T.!$B$33+5,1)","v":"2025-06-01"},"30",{"$f":"SUMIFS(Købskalender!E:E,Købskalender!A:A,\">=\"&B15,Købskalender!A:A,\"<\"&B16)","v":0},{"$f":"SUMIFS(Købskalender!F:F,Købskalender!A:A,\">=0\"&B15,Købskalender!A:A,\"<\"&B16)","v":0},"",{"$f":"SUMIFS(Påfyldningskalender!D:D,Påfyldningskalender!B:B,\">=\"&B15,Påfyldningskalender!B:B,\"<\"&B16)","v":0},{"$f":"SUMIFS(Påfyldningskalender!F:F,Påfyldningskalender!B:B,\">=\"&B15,Påfyldningskalender!B:B,\"<\"&B16)","v":0},{"$f":"H15/C15","v":0},null,0,null,0,null,0,0]
[null,{"$f":"DATE(T.!$B$30,T.!$B$33+6,1)","v":"2025-07-01"},"31",{"$f":"SUMIFS(Købskalender!E:E,Købskalender!A:A,\">=\"&B16,Købskalender!A:A,\"<\"&B17)","v":0},{"$f":"SUMIFS(Købskalender!F:F,Købskalender!A:A,\">=0\"&B16,Købskalender!A:A,\"<\"&B17)","v":0},"",{"$f":"SUMIFS(Påfyldningskalender!D:D,Påfyldningskalender!B:B,\">=\"&B16,Påfyldningskalender!B:B,\"<\"&B17)","v":0},{"$f":"SUMIFS(Påfyldningskalender!F:F,Påfyldningskalender!B:B,\">=\"&B16,Påfyldningskalender!B:B,\"<\"&B17)","v":0},0,null,0,null,0,null,0,0]
[null,{"$f":"DATE(T.!$B$30,T.!$B$33+7,1)","v":"2025-08-01"},"31",{"$f":"SUMIFS(Købskalender!E:E,Købskalender!A:A,\">=\"&B17,Købskalender!A:A,\"<\"&B18)","v":0},{"$f":"SUMIFS(Købskalender!F:F,Købskalender!A:A,\">=0\"&B17,Købskalender!A:A,\"<\"&B18)","v":0},"",{"$f":"SUMIFS(Påfyldningskalender!D:D,Påfyldningskalender!B:B,\">=\"&B17,Påfyldningskalender!B:B,\"<\"&B18)","v":0},{"$f":"SUMIFS(Påfyldningskalender!F:F,Påfyldningskalender!B:B,\">=\"&B17,Påfyldningskalender!B:B,\"<\"&B18)","v":0},0,null,0,null,0,null,0,0]
[null,{"$f":"DATE(T.!$B$30,T.!$B$33+8,1)","v":"2025-09-01"},{"$f":"TEXT(EOMONTH(B18,0),\"dd\")","v":"30"},{"$f":"SUMIFS(Købskalender!E:E,Købskalender!A:A,\">=\"&B18,Købskalender!A:A,\"<\"&B19)","v":0},{"$f":"SUMIFS(Købskalender!F:F,Købskalender!A:A,\">=0\"&B18,Købskalender!A:A,\"<\"&B19)","v":0},"",{"$f":"SUMIFS(Påfyldningskalender!D:D,Påfyldningskalender!B:B,\">=\"&B18,Påfyldningskalender!B:B,\"<\"&B19)","v":0},{"$f":"SUMIFS(Påfyldningskalender!F:F,Påfyldningskalender!B:B,\">=\"&B18,Påfyldningskalender!B:B,\"<\"&B19)","v":0},0,null,0,null,0,null,0,0]
[null,{"$f":"DATE(T.!$B$30,T.!$B$33+9,1)","v":"2025-10-01"},{"$f":"TEXT(EOMONTH(B19,0),\"dd\")","v":"31"},{"$f":"SUMIFS(Købskalender!E:E,Købskalender!A:A,\">=\"&B19,Købskalender!A:A,\"<\"&B20)","v":0},{"$f":"SUMIFS(Købskalender!F:F,Købskalender!A:A,\">=0\"&B19,Købskalender!A:A,\"<\"&B20)","v":0},"",{"$f":"SUMIFS(Påfyldningskalender!D:D,Påfyldningskalender!B:B,\">=\"&B19,Påfyldningskalender!B:B,\"<\"&B20)","v":0},{"$f":"SUMIFS(Påfyldningskalender!F:F,Påfyldningskalender!B:B,\">=\"&B19,Påfyldningskalender!B:B,\"<\"&B20)","v":0},0,null,0,null,0,null,0,0]
[null,{"$f":"DATE(T.!$B$30,T.!$B$33+10,1)","v":"2025-11-01"},"30",{"$f":"SUMIFS(Købskalender!E:E,Købskalender!A:A,\">=\"&B20,Købskalender!A:A,\"<\"&B21)","v":0},{"$f":"SUMIFS(Købskalender!F:F,Købskalender!A:A,\">=0\"&B20,Købskalender!A:A,\"<\"&B21)","v":0},"",{"$f":"SUMIFS(Påfyldningskalender!D:D,Påfyldningskalender!B:B,\">=\"&B20,Påfyldningskalender!B:B,\"<\"&B21)","v":0},{"$f":"SUMIFS(Påfyldningskalender!F:F,Påfyldningskalender!B:B,\">=\"&B20,Påfyldningskalender!B:B,\"<\"&B21)","v":0},0,null,0,null,0,null,0,0]
[null,{"$f":"DATE(T.!$B$30,T.!$B$33+11,1)","v":"2025-12-01"},"31",{"$f":"SUMIFS(Købskalender!E:E,Købskalender!A:A,\">=\"&B21,Købskalender!A:A,\"<\"&B22)","v":0},{"$f":"SUMIFS(Købskalender!F:F,Købskalender!A:A,\">=0\"&B21,Købskalender!A:A,\"<\"&B22)","v":0},"",{"$f":"SUMIFS(Påfyldningskalender!D:D,Påfyldningskalender!B:B,\">=\"&B21,Påfyldningskalender!B:B,\"<\"&B22)","v":0},{"$f":"SUMIFS(Påfyldningskalender!F:F,Påfyldningskalender!B:B,\">=\"&B21,Påfyldningskalender!B:B,\"<\"&B22)","v":0},0,null,0,null,0,null,0,0]
[null,{"$f":"DATE(T.!$B$25+1,1,1)","v":367}]
[null,"Indkøb/Forbrug i alt : ",null,{"$f":"SUM(D10:D21)","v":0},{"$f":"SUM(E10:E21)","v":0},"",{"$f":"SUM(G10:G21)","v":0},{"$f":"SUM(H10:H21)","v":0}]
[]
[null,{"$f":"\"Piller på Lager den 31 december \"&T.!B30-1","v":"Piller på Lager den 31 december 2024"},null,{"$f":"IFERROR(IF(T.!B30-1<T.!B28,-'Års Totaler'!G4,VLOOKUP(T.!B30-1,'Års Totaler'!B5:G20,5,0)),0)","v":0},null,{"$f":"D25/16","v":0},"á 16 kg"]
[null,"Indkøbt piller",null,{"$f":"D23","v":0},null,{"$f":"D26/16","v":0}]
[null,"Fyldt på Magasin",null,{"$f":"-H23","v":0},null,{"$f":"D27/16","v":0}]
[null,"Piller på lager i alt nu, incl magasin",null,{"$f":"SUM(D25:E27)","v":0},null,{"$f":"D28/16","v":0}]
[]
[null,"Piller til den","ved 14 sække pr uge",null,{"$f":"\"Ved \"&TEXT(E31,\"0,0\")&\" Kg. pr uge\"","v":"Ved 0,0 Kg. pr uge"}]
[null,"Forbrug pr. uge",224,null,{"$f":"IFERROR(7*Påfyldningskalender!V3,0)","v":0}]
[null,"Piller til antal uger",{"$f":"ROUNDDOWN(D28/C31,3)","v":0},null,{"$f":"IFERROR(ROUNDDOWN(D28/E31,3),0)","v":0}]
[null,"Piller til antal dage",{"$f":"C32*7","v":0},null,{"$f":"E32*7","v":0}]
[null,null,"Dato","Uge","Dato","Uge"]
[null,"Piller til den : ",{"$f":"C5+C33","v":"2025-01-26"},{"$f":"WEEKNUM(C35,2)","v":4},{"$f":"C5+E33","v":"2025-01-26"},{"$f":"WEEKNUM(E35,2)","v":4}]

{"sheet":"PilleStatistik","index":4,"n_rows":153,"n_cols":23,"rows_kept":153,"cut":false,"hidden":false,"merged":[[21,20,21,21],[22,20,22,21],[24,20,24,21],[25,20,25,21],[15,13,15,14],[15,16,15,17],[23,20,23,21],[7,13,7,14],[19,20,19,21],[20,20,20,21],[7,16,7,17],[7,19,7,20],[11,13,11,14],[11,16,11,17],[11,19,11,20],[75,1,75,2],[75,5,75,6],[75,9,75,10],[78,1,78,3],[26,20,26,21],[27,20,27,21],[28,20,28,21],[29,20,29,21],[30,20,30,21],[31,20,31,21],[32,20,32,21],[113,1,113,2],[113,5,113,6],[113,9,113,10],[112,1,112,2],[112,5,112,6],[112,9,112,10],[151,1,151,2],[151,5,151,6],[151,9,151,10],[116,1,116,3],[116,5,116,7],[116,9,116,11],[150,1,150,2],[150,5,150,6],[150,9,150,10],[3,19,3,20],[78,5,78,7],[78,9,78,11],[74,1,74,2],[74,5,74,6],[36,1,36,2],[36,5,36,6],[36,9,36,10],[37,1,37,2],[37,5,37,6],[37,9,37,10],[34,13,34,20],[40,1,40,3],[40,5,40,7],[40,9,40,11],[74,9,74,10],[2,1,2,3],[2,5,2,7],[2,9,2,11],[3,13,3,14],[3,16,3,17]]}
[]
[null,"Dato","Ugedag","Påfyldt antal Kg.",null,"Dato","Ugedag","Påfyldt antal Kg.",null,"Dato","Ugedag","Påfyldt antal Kg.",null,{"$f":"T.!B30","v":2025}]
[null,{"$f":"CHOOSE(MONTH(B4),\"Januar\",\"Februar\",\"Marts\",\"April\",\"Maj\",\"Juni\",\"juli\",\"August\",\"September\",\"oktober\",\"November\",\"December\")","v":"Januar"},null,null,null,{"$f":"CHOOSE(MONTH(F4),\"Januar\",\"Februar\",\"Marts\",\"April\",\"Maj\",\"Juni\",\"juli\",\"August\",\"September\",\"Oktober\",\"November\",\"December\")","v":"Februar"},null,null,null,{"$f":"CHOOSE(MONTH(J4),\"Januar\",\"Februar\",\"Marts\",\"April\",\"Maj\",\"Juni\",\"juli\",\"August\",\"September\",\"oktober\",\"November\",\"December\")","v":"Marts"}]
[null,{"$f":"T.!B36","v":"2025-01-01"},{"$f":"IF(B4=\"\",\"\",IFERROR(CHOOSE(WEEKDAY(B4,11),\"Mandag\",\"Tirsdag\",\"Onsdag\",\"Torsdag\",\"Fredag\",\"Lørdag\",\"Søndag\"),\"\"))","v":"Onsdag"},{"$f":"IFERROR(VLOOKUP(B4,Påfyldningskalender!B:D,3,0),\"\")","v":""},null,{"$f":"MAX(B4:B34)+1","v":"2025-02-01"},{"$f":"IF(F4=\"\",\"\",IFERROR(CHOOSE(WEEKDAY(F4,11),\"Mandag\",\"Tirsdag\",\"Onsdag\",\"Torsdag\",\"Fredag\",\"Lørdag\",\"Søndag\"),\"\"))","v":"Lørdag"},{"$f":"IFERROR(VLOOKUP(F4,Påfyldningskalender!B:F,5,0),\"\")","v":""},null,{"$f":"MAX(F4:F34)+1","v":"2025-03-01"},{"$f":"IF(J4=\"\",\"\",IFERROR(CHOOSE(WEEKDAY(J4,11),\"Mandag\",\"Tirsdag\",\"Onsdag\",\"Torsdag\",\"Fredag\",\"Lørdag\",\"Søndag\"),\"\"))","v":"Lørdag"},{"$f":"IFERROR(VLOOKUP(J4,Påfyldningskalender!B:F,5,0),\"\")","v":""},null,{"$f":"B3","v":"Januar"},null,null,{"$f":"F3","v":"Februar"},null,null,{"$f":"J3","v":"Marts"}]
[null,{"$f":"B4+1","v":"2025-01-02"},"Torsdag",{"$f":"IFERROR(VLOOKUP(B5,Påfyldningskalender!B:D,3,0),\"\")","v":""},null,{"$f":"F4+1","v":"2025-02-02"},"Søndag",{"$f":"IFERROR(VLOOKUP(F5,Påfyldningskalender!B:F,5,0),\"\")","v":""},null,{"$f":"J4+1","v":"2025-03-02"},"Søndag",{"$f":"IFERROR(VLOOKUP(J5,Påfyldningskalender!B:F,5,0),\"\")","v":""},null,{"$f":"SUM(D4:D33)/(MAX(B4:B34)-MIN(B4:B34))","v":0},"Sække pr. dag",null,{"$f":"H38/Q7","v":0},"Sække pr. dag",null,{"$f":"SUM(L4:L33)/(MAX(J4:J34)-MIN(J4:J34))","v":0},"Sække pr. dag"]
[null,{"$f":"B5+1","v":"2025-01-03"},"Fredag",{"$f":"IFERROR(VLOOKUP(B6,Påfyldningskalender!B:D,3,0),\"\")","v":""},null,{"$f":"F5+1","v":"2025-02-03"},"Mandag",{"$f":"IFERROR(VLOOKUP(F6,Påfyldningskalender!B:F,5,0),\"\")","v":""},null,{"$f":"J5+1","v":"2025-03-03"},"Mandag",{"$f":"IFERROR(VLOOKUP(J6,Påfyldningskalender!B:F,5,0),\"\")","v":""},null,{"$f":"N5*16","v":0},"Kg. Pr. dag",null,{"$f":"Q5*16","v":0},"Kg. Pr. dag",null,{"$f":"T5*16","v":0},"Kg. Pr. dag"]
[null,"2025-01-04","Lørdag",{"$f":"IFERROR(VLOOKUP(B7,Påfyldningskalender!B:D,3,0),\"\")","v":""},null,"2025-02-04","Tirsdag",{"$f":"IFERROR(VLOOKUP(F7,Påfyldningskalender!B:F,5,0),\"\")","v":""},null,"2025-03-04","Tirsdag",{"$f":"IFERROR(VLOOKUP(J7,Påfyldningskalender!B:F,5,0),\"\")","v":""},null,{"$f":"DAY(EOMONTH(B4,0))","v":31},{"$f":"DATE(N2,T.!B33,1)","v":"2025-01-01"},null,{"$f":"DAY(EOMONTH(F4,0))","v":28},{"$f":"DATE(N2,T.!B33+1,1)","v":"2025-02-01"},null,{"$f":"DAY(EOMONTH(J4,0))","v":31}]
[null,"2025-01-05","Søndag",{"$f":"IFERROR(VLOOKUP(B8,Påfyldningskalender!B:D,3,0),\"\")","v":""},null,"2025-02-05","Onsdag",{"$f":"IFERROR(VLOOKUP(F8,Påfyldningskalender!B:F,5,0),\"\")","v":""},null,"2025-03-05","Onsdag",{"$f":"IFERROR(VLOOKUP(J8,Påfyldningskalender!B:F,5,0),\"\")","v":""},null,{"$f":"B41","v":"April"},null,null,{"$f":"F41","v":"Maj"},null,null,{"$f":"J41","v":"Juni"}]
[null,"2025-01-06","Mandag",{"$f":"IFERROR(VLOOKUP(B9,Påfyldningskalender!B:D,3,0),\"\")","v":""},null,"2025-02-06","Torsdag",{"$f":"IFERROR(VLOOKUP(F9,Påfyldningskalender!B:F,5,0),\"\")","v":""},null,"2025-03-06","Torsdag",{"$f":"IFERROR(VLOOKUP(J9,Påfyldningskalender!B:F,5,0),\"\")","v":""},null,{"$f":"D76/N11","v":0},"Sække pr. dag",null,{"$f":"H76/Q11","v":0},"Sække pr. dag",null,{"$f":"SUM(L42:L71)/(MAX(J42:J72)-MIN(J42:J72))","v":0},"Sække pr. dag"]
[null,"2025-01-07","Tirsdag",{"$f":"IFERROR(VLOOKUP(B10,Påfyldningskalender!B:D,3,0),\"\")","v":""},null,"2025-02-07","Fredag",{"$f":"IFERROR(VLOOKUP(F10,Påfyldningskalender!B:F,5,0),\"\")","v":""},null,"2025-03-07","Fredag",{"$f":"IFERROR(VLOOKUP(J10,Påfyldningskalender!B:F,5,0),\"\")","v":""},null,{"$f":"N9*16","v":0},"Kg. Pr. dag",null,{"$f":"Q9*16","v":0},"Kg. Pr. dag",null,{"$f":"T9*16","v":0},"Kg. Pr. dag"]
[null,"2025-01-08","Onsdag",{"$f":"IFERROR(VLOOKUP(B11,Påfyldningskalender!B:D,3,0),\"\")","v":""},null,"2025-02-08","Lørdag",{"$f":"IFERROR(VLOOKUP(F11,Påfyldningskalender!B:F,5,0),\"\")","v":""},null,"2025-03-08","Lørdag",{"$f":"IFERROR(VLOOKUP(J11,Påfyldningskalender!B:F,5,0),\"\")","v":""},null,{"$f":"DAY(EOMONTH(B42,0))","v":30},null,null,{"$f":"DAY(EOMONTH(F42,0))","v":31},null,null,{"$f":"DAY(EOMONTH(J42,0))","v":30}]
[null,"2025-01-09","Torsdag",{"$f":"IFERROR(VLOOKUP(B12,Påfyldningskalender!B:D,3,0),\"\")","v":""},null,"2025-02-09","Søndag",{"$f":"IFERROR(VLOOKUP(F12,Påfyldningskalender!B:F,5,0),\"\")","v":""},null,"2025-03-09","Søndag",{"$f":"IFERROR(VLOOKUP(J12,Påfyldningskalender!B:F,5,0),\"\")","v":""},null,{"$f":"B79","v":"juli"},null,null,{"$f":"F79","v":"August"},null,null,{"$f":"J79","v":"September"}]
[null,"2025-01-10","Fredag",{"$f":"IFERROR(VLOOKUP(B13,Påfyldningskalender!B:D,3,0),\"\")","v":""},null,"2025-02-10","Mandag",{"$f":"IFERROR(VLOOKUP(F13,Påfyldningskalender!B:F,5,0),\"\")","v":""},null,"2025-03-10","Mandag",{"$f":"IFERROR(VLOOKUP(J13,Påfyldningskalender!B:F,5,0),\"\")","v":""},null,{"$f":"SUM(D80:D109)/(MAX(B80:B110)-MIN(B80:B110))","v":0},"Sække pr. dag",null,{"$f":"SUM(H80:H109)/(MAX(F80:F110)-MIN(F80:F110))","v":0},"Sække pr. dag",null,{"$f":"SUM(L80:L110)/(MAX(J80:J110)-MIN(J80:J110))","v":0},"Sække pr. dag",null,"=SUM(L80:L110)/(MAKS(J80:J110)-MIN(J80:J110))"]
[null,"2025-01-11","Lørdag",{"$f":"IFERROR(VLOOKUP(B14,Påfyldningskalender!B:D,3,0),\"\")","v":""},null,"2025-02-11","Tirsdag",{"$f":"IFERROR(VLOOKUP(F14,Påfyldningskalender!B:F,5,0),\"\")","v":""},null,"2025-03-11","Tirsdag",{"$f":"IFERROR(VLOOKUP(J14,Påfyldningskalender!B:F,5,0),\"\")","v":""},null,{"$f":"N13*16","v":0},"Kg. Pr. dag",null,{"$f":"Q13*16","v":0},"Kg. Pr. dag",null,{"$f":"T13*16","v":0},"Kg. Pr. dag"]
[null,"2025-01-12","Søndag",{"$f":"IFERROR(VLOOKUP(B15,Påfyldningskalender!B:D,3,0),\"\")","v":""},null,"2025-02-12","Onsdag",{"$f":"IFERROR(VLOOKUP(F15,Påfyldningskalender!B:F,5,0),\"\")","v":""},null,"2025-03-12","Onsdag",{"$f":"IFERROR(VLOOKUP(J15,Påfyldningskalender!B:F,5,0),\"\")","v":""},null,{"$f":"DAY(EOMONTH(B80,0))","v":31},null,null,{"$f":"DAY(EOMONTH(F80,0))","v":31},null,null,{"$f":"DAY(EOMONTH(J80,0))","v":30}]
[null,"2025-01-13","Mandag",{"$f":"IFERROR(VLOOKUP(B16,Påfyldningskalender!B:D,3,0),\"\")","v":""},null,"2025-02-13","Torsdag",{"$f":"IFERROR(VLOOKUP(F16,Påfyldningskalender!B:F,5,0),\"\")","v":""},null,"2025-03-13","Torsdag",{"$f":"IFERROR(VLOOKUP(J16,Påfyldningskalender!B:F,5,0),\"\")","v":""},null,{"$f":"B117","v":"oktober"},null,null,{"$f":"F117","v":"November"},null,null,{"$f":"J117","v":"December"}]
[null,"2025-01-14","Tirsdag",{"$f":"IFERROR(VLOOKUP(B17,Påfyldningskalender!B:D,3,0),\"\")","v":""},null,"2025-02-14","Fredag",{"$f":"IFERROR(VLOOKUP(F17,Påfyldningskalender!B:F,5,0),\"\")","v":""},null,"2025-03-14","Fredag",{"$f":"IFERROR(VLOOKUP(J17,Påfyldningskalender!B:F,5,0),\"\")","v":""},null,{"$f":"SUM(D118:D147)/(MAX(B118:B148)-MIN(B118:B148))","v":0},"Sække pr. dag",null,{"$f":"SUM(H118:H147)/(MAX(F118:F148)-MIN(F118:F148))","v":0},"Sække pr. dag",null,{"$f":"SUM(L118:L147)/(MAX(J118:J148)-MIN(J118:J148))","v":0},"Sække pr. dag"]
[null,"2025-01-15","Onsdag",{"$f":"IFERROR(VLOOKUP(B18,Påfyldningskalender!B:D,3,0),\"\")","v":""},null,"2025-02-15","Lørdag",{"$f":"IFERROR(VLOOKUP(F18,Påfyldningskalender!B:F,5,0),\"\")","v":""},null,"2025-03-15","Lørdag",{"$f":"IFERROR(VLOOKUP(J18,Påfyldningskalender!B:F,5,0),\"\")","v":""},null,{"$f":"N17*16","v":0},"Kg. Pr. dag",null,{"$f":"Q17*16","v":0},"Kg. Pr. dag",null,{"$f":"T17*16","v":0},"Kg. Pr. dag"]
[null,"2025-01-16","Torsdag",{"$f":"IFERROR(VLOOKUP(B19,Påfyldningskalender!B:D,3,0),\"\")","v":""},null,"2025-02-16","Søndag",{"$f":"IFERROR(VLOOKUP(F19,Påfyldningskalender!B:F,5,0),\"\")","v":""},null,"2025-03-16","Søndag",{"$f":"IFERROR(VLOOKUP(J19,Påfyldningskalender!B:F,5,0),\"\")","v":""},null,{"$f":"DAY(EOMONTH(B118,0))","v":31},null,null,{"$f":"DAY(EOMONTH(F118,0))","v":30},null,null,{"$f":"DAY(EOMONTH(J118,0))","v":31}]
[null,"2025-01-17","Fredag",{"$f":"IFERROR(VLOOKUP(B20,Påfyldningskalender!B:D,3,0),\"\")","v":""},null,"2025-02-17","Mandag",{"$f":"IFERROR(VLOOKUP(F20,Påfyldningskalender!B:F,5,0),\"\")","v":""},null,"2025-03-17","Mandag",{"$f":"IFERROR(VLOOKUP(J20,Påfyldningskalender!B:F,5,0),\"\")","v":""},null,null,"sække pr måned","Dage","Kg pr måned","Kg pr dag","sække pr. dag","kg pr dag / året","Bemærkning"]
[null,"2025-01-18","Lørdag",{"$f":"IFERROR(VLOOKUP(B21,Påfyldningskalender!B:D,3,0),\"\")","v":""},null,"2025-02-18","Tirsdag",{"$f":"IFERROR(VLOOKUP(F21,Påfyldningskalender!B:F,5,0),\"\")","v":""},null,"2025-03-18","Tirsdag",{"$f":"IFERROR(VLOOKUP(J21,Påfyldningskalender!B:F,5,0),\"\")","v":""},null,{"$f":"CHOOSE(MONTH(B4),\"Jan\",\"Feb\",\"Mar\",\"Apr\",\"Maj\",\"Jun\",\"jul\",\"Aug\",\"Sep\",\"Okt\",\"Nov\",\"Dec\")","v":"Jan"},{"$f":"SUMIFS(Påfyldningskalender!D:D,Påfyldningskalender!B:B,\">=\"&'Piller På Lager'!B10,Påfyldningskalender!B:B,\"<\"&'Piller På Lager'!B11)","v":0},{"$f":"DAY(EOMONTH(B4,0))","v":31},{"$f":"D38","v":0},{"$f":"Q21/P21","v":0},{"$f":"O21/P21","v":0},{"$f":"SUM($O$21:O21)/SUM($P$21:P21)","v":0}]
[null,"2025-01-19","Søndag",{"$f":"IFERROR(VLOOKUP(B22,Påfyldningskalender!B:D,3,0),\"\")","v":""},null,"2025-02-19","Onsdag",{"$f":"IFERROR(VLOOKUP(F22,Påfyldningskalender!B:F,5,0),\"\")","v":""},null,"2025-03-19","Onsdag",{"$f":"IFERROR(VLOOKUP(J22,Påfyldningskalender!B:F,5,0),\"\")","v":""},null,{"$f":"CHOOSE(MONTH(F4),\"Jan\",\"Feb\",\"Mar\",\"Apr\",\"Maj\",\"Jun\",\"jul\",\"Aug\",\"Sep\",\"Okt\",\"Nov\",\"Dec\")","v":"Feb"},{"$f":"SUMIFS(Påfyldningskalender!D:D,Påfyldningskalender!B:B,\">=\"&'Piller På Lager'!B11,Påfyldningskalender!B:B,\"<\"&'Piller På Lager'!B12)","v":0},{"$f":"DAY(EOMONTH(F4,0))","v":28},{"$f":"H38","v":0},{"$f":"Q22/P22","v":0},{"$f":"O22/P22","v":0},{"$f":"SUM($O$21:O22)/SUM($P$21:P22)","v":0}]
[null,"2025-01-20","Mandag",{"$f":"IFERROR(VLOOKUP(B23,Påfyldningskalender!B:D,3,0),\"\")","v":""},null,"2025-02-20","Torsdag",{"$f":"IFERROR(VLOOKUP(F23,Påfyldningskalender!B:F,5,0),\"\")","v":""},null,"2025-03-20","Torsdag",{"$f":"IFERROR(VLOOKUP(J23,Påfyldningskalender!B:F,5,0),\"\")","v":""},null,{"$f":"CHOOSE(MONTH(J4),\"Jan\",\"Feb\",\"Mar\",\"Apr\",\"Maj\",\"Jun\",\"jul\",\"Aug\",\"Sep\",\"okt\",\"Nov\",\"Dec\")","v":"Mar"},{"$f":"SUMIFS(Påfyldningskalender!D:D,Påfyldningskalender!B:B,\">=\"&'Piller På Lager'!B12,Påfyldningskalender!B:B,\"<\"&'Piller På Lager'!B13)","v":0},{"$f":"DAY(EOMONTH(J4,0))","v":31},{"$f":"L38","v":0},{"$f":"Q23/P23","v":0},0,{"$f":"SUM($O$21:O23)/SUM($P$21:P23)","v":0}]
[null,"2025-01-21","Tirsdag",{"$f":"IFERROR(VLOOKUP(B24,Påfyldningskalender!B:D,3,0),\"\")","v":""},null,"2025-02-21","Fredag",{"$f":"IFERROR(VLOOKUP(F24,Påfyldningskalender!B:F,5,0),\"\")","v":""},null,"2025-03-21","Fredag",{"$f":"IFERROR(VLOOKUP(J24,Påfyldningskalender!B:F,5,0),\"\")","v":""},null,{"$f":"CHOOSE(MONTH(B42),\"Jan\",\"Feb\",\"Mar\",\"Apr\",\"Maj\",\"Jun\",\"jul\",\"Aug\",\"Sep\",\"okt\",\"Nov\",\"Dec\")","v":"Apr"},{"$f":"SUMIFS(Påfyldningskalender!D:D,Påfyldningskalender!B:B,\">=\"&'Piller På Lager'!B13,Påfyldningskalender!B:B,\"<\"&'Piller På Lager'!B14)","v":0},{"$f":"DAY(EOMONTH(B42,0))","v":30},{"$f":"D76","v":0},{"$f":"Q24/P24","v":0},0,{"$f":"SUM($O$21:O24)/SUM($P$21:P24)","v":0}]
[null,"2025-01-22","Onsdag",{"$f":"IFERROR(VLOOKUP(B25,Påfyldningskalender!B:D,3,0),\"\")","v":""},null,"2025-02-22","Lørdag",{"$f":"IFERROR(VLOOKUP(F25,Påfyldningskalender!B:F,5,0),\"\")","v":""},null,"2025-03-22","Lørdag",{"$f":"IFERROR(VLOOKUP(J25,Påfyldningskalender!B:F,5,0),\"\")","v":""},null,{"$f":"CHOOSE(MONTH(F42),\"Jan\",\"Feb\",\"Mar\",\"Apr\",\"Maj\",\"Jun\",\"jul\",\"Aug\",\"Sep\",\"okt\",\"Nov\",\"Dec\")","v":"Maj"},{"$f":"SUMIFS(Påfyldningskalender!D:D,Påfyldningskalender!B:B,\">=\"&'Piller På Lager'!B14,Påfyldningskalender!B:B,\"<\"&'Piller På Lager'!B15)","v":0},{"$f":"DAY(EOMONTH(F42,0))","v":31},{"$f":"H76","v":0},{"$f":"Q25/P25","v":0},0,{"$f":"SUM($O$21:O25)/SUM($P$21:P25)","v":0}]
[null,"2025-01-23","Torsdag",{"$f":"IFERROR(VLOOKUP(B26,Påfyldningskalender!B:D,3,0),\"\")","v":""},null,"2025-02-23","Søndag",{"$f":"IFERROR(VLOOKUP(F26,Påfyldningskalender!B:F,5,0),\"\")","v":""},null,"2025-03-23","Søndag",{"$f":"IFERROR(VLOOKUP(J26,Påfyldningskalender!B:F,5,0),\"\")","v":""},null,{"$f":"CHOOSE(MONTH(J42),\"Jan\",\"Feb\",\"Mar\",\"Apr\",\"Maj\",\"Jun\",\"jul\",\"Aug\",\"Sep\",\"okt\",\"Nov\",\"Dec\")","v":"Jun"},{"$f":"SUMIFS(Påfyldningskalender!D:D,Påfyldningskalender!B:B,\">=\"&'Piller På Lager'!B15,Påfyldningskalender!B:B,\"<\"&'Piller På Lager'!B16)","v":0},{"$f":"DAY(EOMONTH(J42,0))","v":30},{"$f":"L76","v":0},{"$f":"Q26/P26","v":0},0,{"$f":"SUM($O$21:O26)/SUM($P$21:P26)","v":0}]
[null,"2025-01-24","Fredag",{"$f":"IFERROR(VLOOKUP(B27,Påfyldningskalender!B:D,3,0),\"\")","v":""},null,"2025-02-24","Mandag",{"$f":"IFERROR(VLOOKUP(F27,Påfyldningskalender!B:F,5,0),\"\")","v":""},null,"2025-03-24","Mandag",{"$f":"IFERROR(VLOOKUP(J27,Påfyldningskalender!B:F,5,0),\"\")","v":""},null,{"$f":"CHOOSE(MONTH(B80),\"Jan\",\"Feb\",\"Mar\",\"Apr\",\"Maj\",\"Jun\",\"jul\",\"Aug\",\"Sep\",\"okt\",\"Nov\",\"Dec\")","v":"jul"},{"$f":"SUMIFS(Påfyldningskalender!D:D,Påfyldningskalender!B:B,\">=\"&'Piller På Lager'!B16,Påfyldningskalender!B:B,\"<\"&'Piller På Lager'!B17)","v":0},{"$f":"DAY(EOMONTH(B80,0))","v":31},{"$f":"D114","v":0},0,0,{"$f":"SUM($O$21:O27)/SUM($P$21:P27)","v":0}]
[null,"2025-01-25","Lørdag",{"$f":"IFERROR(VLOOKUP(B28,Påfyldningskalender!B:D,3,0),\"\")","v":""},null,"2025-02-25","Tirsdag",{"$f":"IFERROR(VLOOKUP(F28,Påfyldningskalender!B:F,5,0),\"\")","v":""},null,"2025-03-25","Tirsdag",{"$f":"IFERROR(VLOOKUP(J28,Påfyldningskalender!B:F,5,0),\"\")","v":""},null,{"$f":"CHOOSE(MONTH(F80),\"Jan\",\"Feb\",\"Mar\",\"Apr\",\"Maj\",\"Jun\",\"jul\",\"Aug\",\"Sep\",\"okt\",\"Nov\",\"Dec\")","v":"Aug"},{"$f":"SUMIFS(Påfyldningskalender!D:D,Påfyldningskalender!B:B,\">=\"&'Piller På Lager'!B17,Påfyldningskalender!B:B,\"<\"&'Piller På Lager'!B18)","v":0},{"$f":"DAY(EOMONTH(F80,0))","v":31},{"$f":"H114","v":0},0,0,{"$f":"SUM($O$21:O28)/SUM($P$21:P28)","v":0}]
[null,"2025-01-26","Søndag",{"$f":"IFERROR(VLOOKUP(B29,Påfyldningskalender!B:D,3,0),\"\")","v":""},null,"2025-02-26","Onsdag",{"$f":"IFERROR(VLOOKUP(F29,Påfyldningskalender!B:F,5,0),\"\")","v":""},null,"2025-03-26","Onsdag",{"$f":"IFERROR(VLOOKUP(J29,Påfyldningskalender!B:F,5,0),\"\")","v":""},null,{"$f":"CHOOSE(MONTH(J80),\"Jan\",\"Feb\",\"Mar\",\"Apr\",\"Maj\",\"Jun\",\"jul\",\"Aug\",\"Sep\",\"okt\",\"Nov\",\"Dec\")","v":"Sep"},{"$f":"SUMIFS(Påfyldningskalender!D:D,Påfyldningskalender!B:B,\">=\"&'Piller På Lager'!B18,Påfyldningskalender!B:B,\"<\"&'Piller På Lager'!B19)","v":0},{"$f":"DAY(EOMONTH(J80,0))","v":30},{"$f":"L114","v":0},0,0,{"$f":"SUM($O$21:O29)/SUM($P$21:P29)","v":0},null,null,"=DAG(SLUT.PÅ.MÅNED(J80;0))"]
[null,"2025-01-27","Mandag",{"$f":"IFERROR(VLOOKUP(B30,Påfyldningskalender!B:D,3,0),\"\")","v":""},null,"2025-02-27","Torsdag",{"$f":"IFERROR(VLOOKUP(F30,Påfyldningskalender!B:F,5,0),\"\")","v":""},null,"2025-03-27","Torsdag",{"$f":"IFERROR(VLOOKUP(J30,Påfyldningskalender!B:F,5,0),\"\")","v":""},null,{"$f":"CHOOSE(MONTH(B118),\"Jan\",\"Feb\",\"Mar\",\"Apr\",\"Maj\",\"Jun\",\"jul\",\"Aug\",\"Sep\",\"okt\",\"Nov\",\"Dec\")","v":"okt"},{"$f":"SUMIFS(Påfyldningskalender!D:D,Påfyldningskalender!B:B,\">=\"&'Piller På Lager'!B19,Påfyldningskalender!B:B,\"<\"&'Piller På Lager'!B20)","v":0},{"$f":"DAY(EOMONTH(B118,0))","v":31},{"$f":"D152","v":0},0,0,{"$f":"SUM($O$21:O30)/SUM($P$21:P30)","v":0}]
[null,"2025-01-28","Tirsdag",{"$f":"IFERROR(VLOOKUP(B31,Påfyldningskalender!B:D,3,0),\"\")","v":""},null,"2025-02-28","Fredag",{"$f":"IFERROR(VLOOKUP(F31,Påfyldningskalender!B:F,5,0),\"\")","v":""},null,"2025-03-28","Fredag",{"$f":"IFERROR(VLOOKUP(J31,Påfyldningskalender!B:F,5,0),\"\")","v":""},null,{"$f":"CHOOSE(MONTH(F118),\"Jan\",\"Feb\",\"Mar\",\"Apr\",\"Maj\",\"Jun\",\"jul\",\"Aug\",\"Sep\",\"okt\",\"Nov\",\"Dec\")","v":"Nov"},{"$f":"SUMIFS(Påfyldningskalender!D:D,Påfyldningskalender!B:B,\">=\"&'Piller På Lager'!B20,Påfyldningskalender!B:B,\"<\"&'Piller På Lager'!B21)","v":0},{"$f":"DAY(EOMONTH(F118,0))","v":30},{"$f":"H152","v":0},0,0,{"$f":"SUM($O$21:O31)/SUM($P$21:P31)","v":0}]
[null,{"$f":"IF(B31=\"\",\"\",IF(MONTH(B31+1)>MONTH(B31),\"\",B31+1))","v":"2025-01-29"},"Onsdag",{"$f":"IFERROR(VLOOKUP(B32,Påfyldningskalender!B:D,3,0),\"\")","v":""},null,{"$f":"IF(F31=\"\",\"\",IF(MONTH(F31+1)>MONTH(F31),\"\",F31+1))","v":""},"",{"$f":"IFERROR(VLOOKUP(F32,Påfyldningskalender!B:F,5,0),\"\")","v":""},null,{"$f":"IF(J31=\"\",\"\",IF(MONTH(J31+1)>MONTH(J31),\"\",J31+1))","v":"2025-03-29"},"Lørdag",{"$f":"IFERROR(VLOOKUP(J32,Påfyldningskalender!B:F,5,0),\"\")","v":""},null,{"$f":"CHOOSE(MONTH(J118),\"Jan\",\"Feb\",\"Mar\",\"Apr\",\"Maj\",\"Jun\",\"jul\",\"Aug\",\"Sep\",\"okt\",\"Nov\",\"Dec\")","v":"Dec"},{"$f":"SUMIFS(Påfyldningskalender!D:D,Påfyldningskalender!B:B,\">=\"&'Piller På Lager'!B21,Påfyldningskalender!B:B,\"<\"&'Piller På Lager'!B22)","v":0},{"$f":"DAY(EOMONTH(J118,0))","v":31},{"$f":"L152","v":0},0,0,{"$f":"SUM($O$21:O32)/SUM($P$21:P32)","v":0}]
[null,{"$f":"IF(B32=\"\",\"\",IF(MONTH(B32+1)>MONTH(B32),\"\",B32+1))","v":"2025-01-30"},"Torsdag",{"$f":"IFERROR(VLOOKUP(B33,Påfyldningskalender!B:D,3,0),\"\")","v":""},null,{"$f":"IF(F32=\"\",\"\",IF(MONTH(F32+1)>MONTH(F32),\"\",F32+1))","v":""},"",{"$f":"IFERROR(VLOOKUP(F33,Påfyldningskalender!B:F,5,0),\"\")","v":""},null,{"$f":"IF(J32=\"\",\"\",IF(MONTH(J32+1)>MONTH(J32),\"\",J32+1))","v":"2025-03-30"},"Søndag",{"$f":"IFERROR(VLOOKUP(J33,Påfyldningskalender!B:F,5,0),\"\")","v":""},null,null,{"$f":"SUM(O21:O32)","v":0},{"$f":"SUM(P21:P32)","v":365},{"$f":"SUM(Q21:Q32)","v":0},{"$f":"O33/P33*16","v":0},0,{"$f":"Q33/P33","v":0}]
[null,{"$f":"IF(B33=\"\",\"\",IF(B33+1>EOMONTH(B33,0),\"\",B33+1))","v":"2025-01-31"},"Fredag",{"$f":"IFERROR(VLOOKUP(B34,Påfyldningskalender!B:D,3,0),\"\")","v":""},null,{"$f":"IF(F33=\"\",\"\",IF(MONTH(F33+1)>MONTH(F33),\"\",F33+1))","v":""},"",{"$f":"IFERROR(VLOOKUP(F34,Påfyldningskalender!B:F,5,0),\"\")","v":""},null,"2025-03-31","Mandag",{"$f":"IFERROR(VLOOKUP(J34,Påfyldningskalender!B:F,5,0),\"\")","v":""}]
[]
[null,"Piller på lager : ",{"$f":"B4-1","v":"2024-12-31"},0,null,"Piller på lager : ",{"$f":"C39","v":"2025-01-31"},{"$f":"D39","v":0},null,"Piller på lager : ",{"$f":"G39","v":"2025-02-28"},{"$f":"H39","v":0}]
[null,"Fyldt Kg. på lager : ",null,{"$f":"SUMIFS(Købskalender!$D:$D,Købskalender!$A:$A,\">=\"&PilleStatistik!B4,Købskalender!$A:$A,\"<=\"&PilleStatistik!B34)","v":0},null,"Fyldt Kg. på lager : ",null,{"$f":"SUMIFS(Købskalender!$D:$D,Købskalender!$A:$A,\">=\"&PilleStatistik!F4,Købskalender!$A:$A,\"<=\"&PilleStatistik!F31)","v":0},null,"Fyldt Kg. på lager : ",null,{"$f":"SUMIFS(Købskalender!$E:$E,Købskalender!$A:$A,\">=\"&PilleStatistik!J4,Købskalender!$A:$A,\"<=\"&PilleStatistik!J33)","v":0}]
[null,"Antal Kg. Fyldt på magasin : ",null,{"$f":"SUM(D4:D34)","v":0},null,"Antal Kg. Fyldt på magasin : ",null,{"$f":"SUM(H4:H34)","v":0},null,"Antal Kg. Fyldt på magasin : ",null,{"$f":"SUM(L4:L34)","v":0}]
[null,"Kg. på lager : ",{"$f":"MAX(B4:B34)","v":"2025-01-31"},{"$f":"D36+D37-D38","v":0},null,"Kg. på lager : ",{"$f":"MAX(F4:F34)","v":"2025-02-28"},{"$f":"H36+H37-H38","v":0},null,"Kg. på lager : ",{"$f":"MAX(J4:J34)","v":"2025-03-31"},{"$f":"L36+L37-L38","v":0}]
[]
[null,{"$f":"CHOOSE(MONTH(B42),\"Januar\",\"Februar\",\"Marts\",\"April\",\"Maj\",\"Juni\",\"juli\",\"August\",\"September\",\"oktober\",\"November\",\"December\")","v":"April"},null,null,null,{"$f":"CHOOSE(MONTH(F42),\"Januar\",\"Februar\",\"Marts\",\"April\",\"Maj\",\"Juni\",\"juli\",\"August\",\"September\",\"oktober\",\"November\",\"December\")","v":"Maj"},null,null,null,{"$f":"CHOOSE(MONTH(J42),\"Januar\",\"Februar\",\"Marts\",\"April\",\"Maj\",\"Juni\",\"juli\",\"August\",\"September\",\"oktober\",\"November\",\"December\")","v":"Juni"}]
[null,{"$f":"MAX(J4:J34)+1","v":"2025-04-01"},{"$f":"IF(B42=\"\",\"\",IFERROR(CHOOSE(WEEKDAY(B42,11),\"Mandag\",\"Tirsdag\",\"Onsdag\",\"Torsdag\",\"Fredag\",\"Lørdag\",\"Søndag\"),\"\"))","v":"Tirsdag"},{"$f":"IFERROR(VLOOKUP(B42,Påfyldningskalender!B:F,5,0),\"\")","v":""},null,{"$f":"MAX(B42:B72)+1","v":"2025-05-01"},{"$f":"IF(F42=\"\",\"\",IFERROR(CHOOSE(WEEKDAY(F42,11),\"Mandag\",\"Tirsdag\",\"Onsdag\",\"Torsdag\",\"Fredag\",\"Lørdag\",\"Søndag\"),\"\"))","v":"Torsdag"},{"$f":"IFERROR(VLOOKUP(F42,Påfyldningskalender!B:F,5,0),\"\")","v":""},null,{"$f":"MAX(F42:F72)+1","v":"2025-06-01"},{"$f":"IF(J42=\"\",\"\",IFERROR(CHOOSE(WEEKDAY(J42,11),\"Mandag\",\"Tirsdag\",\"Onsdag\",\"Torsdag\",\"Fredag\",\"Lørdag\",\"Søndag\"),\"\"))","v":"Søndag"},{"$f":"IFERROR(VLOOKUP(J42,Påfyldningskalender!B:F,5,0),\"\")","v":""}]
[null,{"$f":"B42+1","v":"2025-04-02"},"Onsdag",{"$f":"IFERROR(VLOOKUP(B43,Påfyldningskalender!B:F,5,0),\"\")","v":""},null,{"$f":"F42+1","v":"2025-05-02"},"Fredag",{"$f":"IFERROR(VLOOKUP(F43,Påfyldningskalender!B:F,5,0),\"\")","v":""},null,{"$f":"J42+1","v":"2025-06-02"},"Mandag",{"$f":"IFERROR(VLOOKUP(J43,Påfyldningskalender!B:F,5,0),\"\")","v":""}]
[null,{"$f":"B43+1","v":"2025-04-03"},"Torsdag",{"$f":"IFERROR(VLOOKUP(B44,Påfyldningskalender!B:F,5,0),\"\")","v":""},null,{"$f":"F43+1","v":"2025-05-03"},"Lørdag",{"$f":"IFERROR(VLOOKUP(F44,Påfyldningskalender!B:F,5,0),\"\")","v":""},null,{"$f":"J43+1","v":"2025-06-03"},"Tirsdag",{"$f":"IFERROR(VLOOKUP(J44,Påfyldningskalender!B:F,5,0),\"\")","v":""}]
[null,"2025-04-04","Fredag",{"$f":"IFERROR(VLOOKUP(B45,Påfyldningskalender!B:F,5,0),\"\")","v":""},null,"2025-05-04","Søndag",{"$f":"IFERROR(VLOOKUP(F45,Påfyldningskalender!B:F,5,0),\"\")","v":""},null,"2025-06-04","Onsdag",{"$f":"IFERROR(VLOOKUP(J45,Påfyldningskalender!B:F,5,0),\"\")","v":""}]
[null,"2025-04-05","Lørdag",{"$f":"IFERROR(VLOOKUP(B46,Påfyldningskalender!B:F,5,0),\"\")","v":""},null,"2025-05-05","Mandag",{"$f":"IFERROR(VLOOKUP(F46,Påfyldningskalender!B:F,5,0),\"\")","v":""},null,"2025-06-05","Torsdag",{"$f":"IFERROR(VLOOKUP(J46,Påfyldningskalender!B:F,5,0),\"\")","v":""}]
[null,"2025-04-06","Søndag",{"$f":"IFERROR(VLOOKUP(B47,Påfyldningskalender!B:F,5,0),\"\")","v":""},null,"2025-05-06","Tirsdag",{"$f":"IFERROR(VLOOKUP(F47,Påfyldningskalender!B:F,5,0),\"\")","v":""},null,"2025-06-06","Fredag",{"$f":"IFERROR(VLOOKUP(J47,Påfyldningskalender!B:F,5,0),\"\")","v":""}]
[null,"2025-04-07","Mandag",{"$f":"IFERROR(VLOOKUP(B48,Påfyldningskalender!B:F,5,0),\"\")","v":""},null,"2025-05-07","Onsdag",{"$f":"IFERROR(VLOOKUP(F48,Påfyldningskalender!B:F,5,0),\"\")","v":""},null,"2025-06-07","Lørdag",{"$f":"IFERROR(VLOOKUP(J48,Påfyldningskalender!B:F,5,0),\"\")","v":""}]
[null,"2025-04-08","Tirsdag",{"$f":"IFERROR(VLOOKUP(B49,Påfyldningskalender!B:F,5,0),\"\")","v":""},null,"2025-05-08","Torsdag",{"$f":"IFERROR(VLOOKUP(F49,Påfyldningskalender!B:F,5,0),\"\")","v":""},null,"2025-06-08","Søndag",{"$f":"IFERROR(VLOOKUP(J49,Påfyldningskalender!B:F,5,0),\"\")","v":""}]
[null,"2025-04-09","Onsdag",{"$f":"IFERROR(VLOOKUP(B50,Påfyldningskalender!B:F,5,0),\"\")","v":""},null,"2025-05-09","Fredag",{"$f":"IFERROR(VLOOKUP(F50,Påfyldningskalender!B:F,5,0),\"\")","v":""},null,"2025-06-09","Mandag",{"$f":"IFERROR(VLOOKUP(J50,Påfyldningskalender!B:F,5,0),\"\")","v":""}]
[null,"2025-04-10","Torsdag",{"$f":"IFERROR(VLOOKUP(B51,Påfyldningskalender!B:F,5,0),\"\")","v":""},null,"2025-05-10","Lørdag",{"$f":"IFERROR(VLOOKUP(F51,Påfyldningskalender!B:F,5,0),\"\")","v":""},null,"2025-06-10","Tirsdag",{"$f":"IFERROR(VLOOKUP(J51,Påfyldningskalender!B:F,5,0),\"\")","v":""}]
[null,"2025-04-11","Fredag",{"$f":"IFERROR(VLOOKUP(B52,Påfyldningskalender!B:F,5,0),\"\")","v":""},null,"2025-05-11","Søndag",{"$f":"IFERROR(VLOOKUP(F52,Påfyldningskalender!B:F,5,0),\"\")","v":""},null,"2025-06-11","Onsdag",{"$f":"IFERROR(VLOOKUP(J52,Påfyldningskalender!B:F,5,0),\"\")","v":""}]
[null,"2025-04-12","Lørdag",{"$f":"IFERROR(VLOOKUP(B53,Påfyldningskalender!B:F,5,0),\"\")","v":""},null,"2025-05-12","Mandag",{"$f":"IFERROR(VLOOKUP(F53,Påfyldningskalender!B:F,5,0),\"\")","v":""},null,"2025-06-12","Torsdag",{"$f":"IFERROR(VLOOKUP(J53,Påfyldningskalender!B:F,5,0),\"\")","v":""}]
[null,"2025-04-13","Søndag",{"$f":"IFERROR(VLOOKUP(B54,Påfyldningskalender!B:F,5,0),\"\")","v":""},null,"2025-05-13","Tirsdag",{"$f":"IFERROR(VLOOKUP(F54,Påfyldningskalender!B:F,5,0),\"\")","v":""},null,"2025-06-13","Fredag",{"$f":"IFERROR(VLOOKUP(J54,Påfyldningskalender!B:F,5,0),\"\")","v":""}]
[null,"2025-04-14","Mandag",{"$f":"IFERROR(VLOOKUP(B55,Påfyldningskalender!B:F,5,0),\"\")","v":""},null,"2025-05-14","Onsdag",{"$f":"IFERROR(VLOOKUP(F55,Påfyldningskalender!B:F,5,0),\"\")","v":""},null,"2025-06-14","Lørdag",{"$f":"IFERROR(VLOOKUP(J55,Påfyldningskalender!B:F,5,0),\"\")","v":""}]
[null,"2025-04-15","Tirsdag",{"$f":"IFERROR(VLOOKUP(B56,Påfyldningskalender!B:F,5,0),\"\")","v":""},null,"2025-05-15","Torsdag",{"$f":"IFERROR(VLOOKUP(F56,Påfyldningskalender!B:F,5,0),\"\")","v":""},null,"2025-06-15","Søndag",{"$f":"IFERROR(VLOOKUP(J56,Påfyldningskalender!B:F,5,0),\"\")","v":""}]
[null,"2025-04-16","Onsdag",{"$f":"IFERROR(VLOOKUP(B57,Påfyldningskalender!B:F,5,0),\"\")","v":""},null,"2025-05-16","Fredag",{"$f":"IFERROR(VLOOKUP(F57,Påfyldningskalender!B:F,5,0),\"\")","v":""},null,"2025-06-16","Mandag",{"$f":"IFERROR(VLOOKUP(J57,Påfyldningskalender!B:F,5,0),\"\")","v":""}]
[null,"2025-04-17","Torsdag",{"$f":"IFERROR(VLOOKUP(B58,Påfyldningskalender!B:F,5,0),\"\")","v":""},null,"2025-05-17","Lørdag",{"$f":"IFERROR(VLOOKUP(F58,Påfyldningskalender!B:F,5,0),\"\")","v":""},null,"2025-06-17","Tirsdag",{"$f":"IFERROR(VLOOKUP(J58,Påfyldningskalender!B:F,5,0),\"\")","v":""}]
[null,"2025-04-18","Fredag",{"$f":"IFERROR(VLOOKUP(B59,Påfyldningskalender!B:F,5,0),\"\")","v":""},null,"2025-05-18","Søndag",{"$f":"IFERROR(VLOOKUP(F59,Påfyldningskalender!B:F,5,0),\"\")","v":""},null,"2025-06-18","Onsdag",{"$f":"IFERROR(VLOOKUP(J59,Påfyldningskalender!B:F,5,0),\"\")","v":""}]
[null,"2025-04-19","Lørdag",{"$f":"IFERROR(VLOOKUP(B60,Påfyldningskalender!B:F,5,0),\"\")","v":""},null,"2025-05-19","Mandag",{"$f":"IFERROR(VLOOKUP(F60,Påfyldningskalender!B:F,5,0),\"\")","v":""},null,"2025-06-19","Torsdag",{"$f":"IFERROR(VLOOKUP(J60,Påfyldningskalender!B:F,5,0),\"\")","v":""}]
[null,"2025-04-20","Søndag",{"$f":"IFERROR(VLOOKUP(B61,Påfyldningskalender!B:F,5,0),\"\")","v":""},null,"2025-05-20","Tirsdag",{"$f":"IFERROR(VLOOKUP(F61,Påfyldningskalender!B:F,5,0),\"\")","v":""},null,"2025-06-20","Fredag",{"$f":"IFERROR(VLOOKUP(J61,Påfyldningskalender!B:F,5,0),\"\")","v":""}]
[null,"2025-04-21","Mandag",{"$f":"IFERROR(VLOOKUP(B62,Påfyldningskalender!B:F,5,0),\"\")","v":""},null,"2025-05-21","Onsdag",{"$f":"IFERROR(VLOOKUP(F62,Påfyldningskalender!B:F,5,0),\"\")","v":""},null,"2025-06-21","Lørdag",{"$f":"IFERROR(VLOOKUP(J62,Påfyldningskalender!B:F,5,0),\"\")","v":""}]
[null,"2025-04-22","Tirsdag",{"$f":"IFERROR(VLOOKUP(B63,Påfyldningskalender!B:F,5,0),\"\")","v":""},null,"2025-05-22","Torsdag",{"$f":"IFERROR(VLOOKUP(F63,Påfyldningskalender!B:F,5,0),\"\")","v":""},null,"2025-06-22","Søndag",{"$f":"IFERROR(VLOOKUP(J63,Påfyldningskalender!B:F,5,0),\"\")","v":""}]
[null,"2025-04-23","Onsdag",{"$f":"IFERROR(VLOOKUP(B64,Påfyldningskalender!B:F,5,0),\"\")","v":""},null,"2025-05-23","Fredag",{"$f":"IFERROR(VLOOKUP(F64,Påfyldningskalender!B:F,5,0),\"\")","v":""},null,"2025-06-23","Mandag",{"$f":"IFERROR(VLOOKUP(J64,Påfyldningskalender!B:F,5,0),\"\")","v":""}]
[null,"2025-04-24","Torsdag",{"$f":"IFERROR(VLOOKUP(B65,Påfyldningskalender!B:F,5,0),\"\")","v":""},null,"2025-05-24","Lørdag",{"$f":"IFERROR(VLOOKUP(F65,Påfyldningskalender!B:F,5,0),\"\")","v":""},null,"2025-06-24","Tirsdag",{"$f":"IFERROR(VLOOKUP(J65,Påfyldningskalender!B:F,5,0),\"\")","v":""}]
[null,"2025-04-25","Fredag",{"$f":"IFERROR(VLOOKUP(B66,Påfyldningskalender!B:F,5,0),\"\")","v":""},null,"2025-05-25","Søndag",{"$f":"IFERROR(VLOOKUP(F66,Påfyldningskalender!B:F,5,0),\"\")","v":""},null,"2025-06-25","Onsdag",{"$f":"IFERROR(VLOOKUP(J66,Påfyldningskalender!B:F,5,0),\"\")","v":""}]
[null,"2025-04-26","Lørdag",{"$f":"IFERROR(VLOOKUP(B67,Påfyldningskalender!B:F,5,0),\"\")","v":""},null,"2025-05-26","Mandag",{"$f":"IFERROR(VLOOKUP(F67,Påfyldningskalender!B:F,5,0),\"\")","v":""},null,"2025-06-26","Torsdag",{"$f":"IFERROR(VLOOKUP(J67,Påfyldningskalender!B:F,5,0),\"\")","v":""}]
[null,"2025-04-27","Søndag",{"$f":"IFERROR(VLOOKUP(B68,Påfyldningskalender!B:F,5,0),\"\")","v":""},null,"2025-05-27","Tirsdag",{"$f":"IFERROR(VLOOKUP(F68,Påfyldningskalender!B:F,5,0),\"\")","v":""},null,"2025-06-27","Fredag",{"$f":"IFERROR(VLOOKUP(J68,Påfyldningskalender!B:F,5,0),\"\")","v":""}]
[null,"2025-04-28","Mandag",{"$f":"IFERROR(VLOOKUP(B69,Påfyldningskalender!B:F,5,0),\"\")","v":""},null,"2025-05-28","Onsdag",{"$f":"IFERROR(VLOOKUP(F69,Påfyldningskalender!B:F,5,0),\"\")","v":""},null,"2025-06-28","Lørdag",{"$f":"IFERROR(VLOOKUP(J69,Påfyldningskalender!B:F,5,0),\"\")","v":""}]
[null,{"$f":"IF(B69=\"\",\"\",IF(MONTH(B69+1)>MONTH(B69),\"\",B69+1))","v":"2025-04-29"},"Tirsdag",{"$f":"IFERROR(VLOOKUP(B70,Påfyldningskalender!B:F,5,0),\"\")","v":""},null,{"$f":"IF(F69=\"\",\"\",IF(MONTH(F69+1)>MONTH(F69),\"\",F69+1))","v":"2025-05-29"},"Torsdag",{"$f":"IFERROR(VLOOKUP(F70,Påfyldningskalender!B:F,5,0),\"\")","v":""},null,{"$f":"IF(J69=\"\",\"\",IF(MONTH(J69+1)>MONTH(J69),\"\",J69+1))","v":"2025-06-29"},"Søndag",{"$f":"IFERROR(VLOOKUP(J70,Påfyldningskalender!B:F,5,0),\"\")","v":""}]
[null,{"$f":"IF(B70=\"\",\"\",IF(MONTH(B70+1)>MONTH(B70),\"\",B70+1))","v":"2025-04-30"},"Onsdag",{"$f":"IFERROR(VLOOKUP(B71,Påfyldningskalender!B:F,5,0),\"\")","v":""},null,{"$f":"IF(F70=\"\",\"\",IF(MONTH(F70+1)>MONTH(F70),\"\",F70+1))","v":"2025-05-30"},"Fredag",{"$f":"IFERROR(VLOOKUP(F71,Påfyldningskalender!B:F,5,0),\"\")","v":""},null,{"$f":"IF(J70=\"\",\"\",IF(MONTH(J70+1)>MONTH(J70),\"\",J70+1))","v":"2025-06-30"},"Mandag",{"$f":"IFERROR(VLOOKUP(J71,Påfyldningskalender!B:F,5,0),\"\")","v":""}]
[null,"","",{"$f":"IFERROR(VLOOKUP(B72,Påfyldningskalender!B:F,5,0),\"\")","v":""},null,"2025-05-31","Lørdag",{"$f":"IFERROR(VLOOKUP(F72,Påfyldningskalender!B:F,5,0),\"\")","v":""},null,"","",{"$f":"IFERROR(VLOOKUP(J72,Påfyldningskalender!B:F,5,0),\"\")","v":""}]
[]
[null,"Piller på lager : ",{"$f":"J34","v":"2025-03-31"},{"$f":"L39","v":0},null,"Piller på lager : ",{"$f":"C77","v":"2025-04-30"},{"$f":"D77","v":0},null,"Piller på lager : ",{"$f":"G77","v":"2025-05-31"},{"$f":"H77","v":0}]
[null,"Fyldt Kg. på lager : ",null,{"$f":"SUMIFS(Købskalender!$E:$E,Købskalender!$A:$A,\">=\"&PilleStatistik!B42,Købskalender!$A:$A,\"<=\"&MAX(PilleStatistik!B42:B72))","v":0},null,"Fyldt Kg. på lager : ",null,{"$f":"SUMIFS(Købskalender!$E:$E,Købskalender!$A:$A,\">=\"&PilleStatistik!F42,Købskalender!$A:$A,\"<=\"&PilleStatistik!F72)","v":0},null,"Fyldt Kg. på lager : ",null,{"$f":"SUMIFS(Købskalender!$D:$D,Købskalender!$A:$A,\">=\"&PilleStatistik!J42,Købskalender!$A:$A,\"<=\"&PilleStatistik!J71)","v":0}]
[null,"Antal Kg. Fyldt på magasin : ",null,{"$f":"SUM(D42:D72)","v":0},null,"Antal Kg. Fyldt på magasin : ",null,{"$f":"SUM(H42:H72)","v":0},null,"Antal Kg. Fyldt på magasin : ",null,{"$f":"SUM(L42:L72)","v":0}]
[null,"Kg. på lager : ",{"$f":"MAX(B42:B72)","v":"2025-04-30"},{"$f":"D74+D75-D76","v":0},null,"Kg. på lager : ",{"$f":"MAX(F42:F72)","v":"2025-05-31"},{"$f":"H74+H75-H76","v":0},null,"Kg. på lager : ",{"$f":"MAX(J42:J72)","v":"2025-06-30"},{"$f":"L74+L75-L76","v":0}]
[]
[null,{"$f":"CHOOSE(MONTH(B80),\"Januar\",\"Februar\",\"Marts\",\"April\",\"Maj\",\"Juni\",\"juli\",\"August\",\"September\",\"oktober\",\"November\",\"December\")","v":"juli"},null,null,null,{"$f":"CHOOSE(MONTH(F80),\"Januar\",\"Februar\",\"Marts\",\"April\",\"Maj\",\"Juni\",\"juli\",\"August\",\"September\",\"oktober\",\"November\",\"December\")","v":"August"},null,null,null,{"$f":"CHOOSE(MONTH(J80),\"Januar\",\"Februar\",\"Marts\",\"April\",\"Maj\",\"Juni\",\"juli\",\"August\",\"September\",\"oktober\",\"November\",\"December\")","v":"September"}]
[null,{"$f":"MAX(J42:J72)+1","v":"2025-07-01"},{"$f":"IF(B80=\"\",\"\",IFERROR(CHOOSE(WEEKDAY(B80,11),\"Mandag\",\"Tirsdag\",\"Onsdag\",\"Torsdag\",\"Fredag\",\"Lørdag\",\"Søndag\"),\"\"))","v":"Tirsdag"},{"$f":"IFERROR(VLOOKUP(B80,Påfyldningskalender!B:F,5,0),\"\")","v":""},null,{"$f":"MAX(B80:B110)+1","v":"2025-08-01"},{"$f":"IF(F80=\"\",\"\",IFERROR(CHOOSE(WEEKDAY(F80,11),\"Mandag\",\"Tirsdag\",\"Onsdag\",\"Torsdag\",\"Fredag\",\"Lørdag\",\"Søndag\"),\"\"))","v":"Fredag"},{"$f":"IFERROR(VLOOKUP(F80,Påfyldningskalender!B:F,5,0),\"\")","v":""},null,{"$f":"MAX(F80:F110)+1","v":"2025-09-01"},{"$f":"IF(J80=\"\",\"\",IFERROR(CHOOSE(WEEKDAY(J80,11),\"Mandag\",\"Tirsdag\",\"Onsdag\",\"Torsdag\",\"Fredag\",\"Lørdag\",\"Søndag\"),\"\"))","v":"Mandag"},{"$f":"IFERROR(VLOOKUP(J80,Påfyldningskalender!B:F,5,0),\"\")","v":""}]
[null,{"$f":"B80+1","v":"2025-07-02"},"Onsdag",{"$f":"IFERROR(VLOOKUP(B81,Påfyldningskalender!B:F,5,0),\"\")","v":""},null,{"$f":"F80+1","v":"2025-08-02"},"Lørdag",{"$f":"IFERROR(VLOOKUP(F81,Påfyldningskalender!B:F,5,0),\"\")","v":""},null,{"$f":"J80+1","v":"2025-09-02"},"Tirsdag",{"$f":"IFERROR(VLOOKUP(J81,Påfyldningskalender!B:F,5,0),\"\")","v":""}]
[null,{"$f":"B81+1","v":"2025-07-03"},"Torsdag",{"$f":"IFERROR(VLOOKUP(B82,Påfyldningskalender!B:F,5,0),\"\")","v":""},null,{"$f":"F81+1","v":"2025-08-03"},"Søndag",{"$f":"IFERROR(VLOOKUP(F82,Påfyldningskalender!B:F,5,0),\"\")","v":""},null,{"$f":"J81+1","v":"2025-09-03"},"Onsdag",{"$f":"IFERROR(VLOOKUP(J82,Påfyldningskalender!B:F,5,0),\"\")","v":""}]
[null,"2025-07-04","Fredag",{"$f":"IFERROR(VLOOKUP(B83,Påfyldningskalender!B:F,5,0),\"\")","v":""},null,"2025-08-04","Mandag",{"$f":"IFERROR(VLOOKUP(F83,Påfyldningskalender!B:F,5,0),\"\")","v":""},null,"2025-09-04","Torsdag",{"$f":"IFERROR(VLOOKUP(J83,Påfyldningskalender!B:F,5,0),\"\")","v":""}]
[null,"2025-07-05","Lørdag",{"$f":"IFERROR(VLOOKUP(B84,Påfyldningskalender!B:F,5,0),\"\")","v":""},null,"2025-08-05","Tirsdag",{"$f":"IFERROR(VLOOKUP(F84,Påfyldningskalender!B:F,5,0),\"\")","v":""},null,"2025-09-05","Fredag",{"$f":"IFERROR(VLOOKUP(J84,Påfyldningskalender!B:F,5,0),\"\")","v":""}]
[null,"2025-07-06","Søndag",{"$f":"IFERROR(VLOOKUP(B85,Påfyldningskalender!B:F,5,0),\"\")","v":""},null,"2025-08-06","Onsdag",{"$f":"IFERROR(VLOOKUP(F85,Påfyldningskalender!B:F,5,0),\"\")","v":""},null,"2025-09-06","Lørdag",{"$f":"IFERROR(VLOOKUP(J85,Påfyldningskalender!B:F,5,0),\"\")","v":""}]
[null,"2025-07-07","Mandag",{"$f":"IFERROR(VLOOKUP(B86,Påfyldningskalender!B:F,5,0),\"\")","v":""},null,"2025-08-07","Torsdag",{"$f":"IFERROR(VLOOKUP(F86,Påfyldningskalender!B:F,5,0),\"\")","v":""},null,"2025-09-07","Søndag",{"$f":"IFERROR(VLOOKUP(J86,Påfyldningskalender!B:F,5,0),\"\")","v":""}]
[null,"2025-07-08","Tirsdag",{"$f":"IFERROR(VLOOKUP(B87,Påfyldningskalender!B:F,5,0),\"\")","v":""},null,"2025-08-08","Fredag",{"$f":"IFERROR(VLOOKUP(F87,Påfyldningskalender!B:F,5,0),\"\")","v":""},null,"2025-09-08","Mandag",{"$f":"IFERROR(VLOOKUP(J87,Påfyldningskalender!B:F,5,0),\"\")","v":""}]
[null,"2025-07-09","Onsdag",{"$f":"IFERROR(VLOOKUP(B88,Påfyldningskalender!B:F,5,0),\"\")","v":""},null,"2025-08-09","Lørdag",{"$f":"IFERROR(VLOOKUP(F88,Påfyldningskalender!B:F,5,0),\"\")","v":""},null,"2025-09-09","Tirsdag",{"$f":"IFERROR(VLOOKUP(J88,Påfyldningskalender!B:F,5,0),\"\")","v":""}]
[null,"2025-07-10","Torsdag",{"$f":"IFERROR(VLOOKUP(B89,Påfyldningskalender!B:F,5,0),\"\")","v":""},null,"2025-08-10","Søndag",{"$f":"IFERROR(VLOOKUP(F89,Påfyldningskalender!B:F,5,0),\"\")","v":""},null,"2025-09-10","Onsdag",{"$f":"IFERROR(VLOOKUP(J89,Påfyldningskalender!B:F,5,0),\"\")","v":""}]
[null,"2025-07-11","Fredag",{"$f":"IFERROR(VLOOKUP(B90,Påfyldningskalender!B:F,5,0),\"\")","v":""},null,"2025-08-11","Mandag",{"$f":"IFERROR(VLOOKUP(F90,Påfyldningskalender!B:F,5,0),\"\")","v":""},null,"2025-09-11","Torsdag",{"$f":"IFERROR(VLOOKUP(J90,Påfyldningskalender!B:F,5,0),\"\")","v":""}]
[null,"2025-07-12","Lørdag",{"$f":"IFERROR(VLOOKUP(B91,Påfyldningskalender!B:F,5,0),\"\")","v":""},null,"2025-08-12","Tirsdag",{"$f":"IFERROR(VLOOKUP(F91,Påfyldningskalender!B:F,5,0),\"\")","v":""},null,"2025-09-12","Fredag",{"$f":"IFERROR(VLOOKUP(J91,Påfyldningskalender!B:F,5,0),\"\")","v":""}]
[null,"2025-07-13","Søndag",{"$f":"IFERROR(VLOOKUP(B92,Påfyldningskalender!B:F,5,0),\"\")","v":""},null,"2025-08-13","Onsdag",{"$f":"IFERROR(VLOOKUP(F92,Påfyldningskalender!B:F,5,0),\"\")","v":""},null,"2025-09-13","Lørdag",{"$f":"IFERROR(VLOOKUP(J92,Påfyldningskalender!B:F,5,0),\"\")","v":""}]
[null,"2025-07-14","Mandag",{"$f":"IFERROR(VLOOKUP(B93,Påfyldningskalender!B:F,5,0),\"\")","v":""},null,"2025-08-14","Torsdag",{"$f":"IFERROR(VLOOKUP(F93,Påfyldningskalender!B:F,5,0),\"\")","v":""},null,"2025-09-14","Søndag",{"$f":"IFERROR(VLOOKUP(J93,Påfyldningskalender!B:F,5,0),\"\")","v":""}]
[null,"2025-07-15","Tirsdag",{"$f":"IFERROR(VLOOKUP(B94,Påfyldningskalender!B:F,5,0),\"\")","v":""},null,"2025-08-15","Fredag",{"$f":"IFERROR(VLOOKUP(F94,Påfyldningskalender!B:F,5,0),\"\")","v":""},null,"2025-09-15","Mandag",{"$f":"IFERROR(VLOOKUP(J94,Påfyldningskalender!B:F,5,0),\"\")","v":""}]
[null,"2025-07-16","Onsdag",{"$f":"IFERROR(VLOOKUP(B95,Påfyldningskalender!B:F,5,0),\"\")","v":""},null,"2025-08-16","Lørdag",{"$f":"IFERROR(VLOOKUP(F95,Påfyldningskalender!B:F,5,0),\"\")","v":""},null,"2025-09-16","Tirsdag",{"$f":"IFERROR(VLOOKUP(J95,Påfyldningskalender!B:F,5,0),\"\")","v":""}]
[null,"2025-07-17","Torsdag",{"$f":"IFERROR(VLOOKUP(B96,Påfyldningskalender!B:F,5,0),\"\")","v":""},null,"2025-08-17","Søndag",{"$f":"IFERROR(VLOOKUP(F96,Påfyldningskalender!B:F,5,0),\"\")","v":""},null,"2025-09-17","Onsdag",{"$f":"IFERROR(VLOOKUP(J96,Påfyldningskalender!B:F,5,0),\"\")","v":""}]
[null,"2025-07-18","Fredag",{"$f":"IFERROR(VLOOKUP(B97,Påfyldningskalender!B:F,5,0),\"\")","v":""},null,"2025-08-18","Mandag",{"$f":"IFERROR(VLOOKUP(F97,Påfyldningskalender!B:F,5,0),\"\")","v":""},null,"2025-09-18","Torsdag",{"$f":"IFERROR(VLOOKUP(J97,Påfyldningskalender!B:F,5,0),\"\")","v":""}]
[null,"2025-07-19","Lørdag",{"$f":"IFERROR(VLOOKUP(B98,Påfyldningskalender!B:F,5,0),\"\")","v":""},null,"2025-08-19","Tirsdag",{"$f":"IFERROR(VLOOKUP(F98,Påfyldningskalender!B:F,5,0),\"\")","v":""},null,"2025-09-19","Fredag",{"$f":"IFERROR(VLOOKUP(J98,Påfyldningskalender!B:F,5,0),\"\")","v":""}]
[null,"2025-07-20","Søndag",{"$f":"IFERROR(VLOOKUP(B99,Påfyldningskalender!B:F,5,0),\"\")","v":""},null,"2025-08-20","Onsdag",{"$f":"IFERROR(VLOOKUP(F99,Påfyldningskalender!B:F,5,0),\"\")","v":""},null,"2025-09-20","Lørdag",{"$f":"IFERROR(VLOOKUP(J99,Påfyldningskalender!B:F,5,0),\"\")","v":""}]
[null,"2025-07-21","Mandag",{"$f":"IFERROR(VLOOKUP(B100,Påfyldningskalender!B:F,5,0),\"\")","v":""},null,"2025-08-21","Torsdag",{"$f":"IFERROR(VLOOKUP(F100,Påfyldningskalender!B:F,5,0),\"\")","v":""},null,"2025-09-21","Søndag",{"$f":"IFERROR(VLOOKUP(J100,Påfyldningskalender!B:F,5,0),\"\")","v":""}]
[null,"2025-07-22","Tirsdag",{"$f":"IFERROR(VLOOKUP(B101,Påfyldningskalender!B:F,5,0),\"\")","v":""},null,"2025-08-22","Fredag",{"$f":"IFERROR(VLOOKUP(F101,Påfyldningskalender!B:F,5,0),\"\")","v":""},null,"2025-09-22","Mandag",{"$f":"IFERROR(VLOOKUP(J101,Påfyldningskalender!B:F,5,0),\"\")","v":""}]
[null,"2025-07-23","Onsdag",{"$f":"IFERROR(VLOOKUP(B102,Påfyldningskalender!B:F,5,0),\"\")","v":""},null,"2025-08-23","Lørdag",{"$f":"IFERROR(VLOOKUP(F102,Påfyldningskalender!B:F,5,0),\"\")","v":""},null,"2025-09-23","Tirsdag",{"$f":"IFERROR(VLOOKUP(J102,Påfyldningskalender!B:F,5,0),\"\")","v":""}]
[null,"2025-07-24","Torsdag",{"$f":"IFERROR(VLOOKUP(B103,Påfyldningskalender!B:F,5,0),\"\")","v":""},null,"2025-08-24","Søndag",{"$f":"IFERROR(VLOOKUP(F103,Påfyldningskalender!B:F,5,0),\"\")","v":""},null,"2025-09-24","Onsdag",{"$f":"IFERROR(VLOOKUP(J103,Påfyldningskalender!B:F,5,0),\"\")","v":""}]
[null,"2025-07-25","Fredag",{"$f":"IFERROR(VLOOKUP(B104,Påfyldningskalender!B:F,5,0),\"\")","v":""},null,"2025-08-25","Mandag",{"$f":"IFERROR(VLOOKUP(F104,Påfyldningskalender!B:F,5,0),\"\")","v":""},null,"2025-09-25","Torsdag",{"$f":"IFERROR(VLOOKUP(J104,Påfyldningskalender!B:F,5,0),\"\")","v":""}]
[null,"2025-07-26","Lørdag",{"$f":"IFERROR(VLOOKUP(B105,Påfyldningskalender!B:F,5,0),\"\")","v":""},null,"2025-08-26","Tirsdag",{"$f":"IFERROR(VLOOKUP(F105,Påfyldningskalender!B:F,5,0),\"\")","v":""},null,"2025-09-26","Fredag",{"$f":"IFERROR(VLOOKUP(J105,Påfyldningskalender!B:F,5,0),\"\")","v":""}]
[null,"2025-07-27","Søndag",{"$f":"IFERROR(VLOOKUP(B106,Påfyldningskalender!B:F,5,0),\"\")","v":""},null,"2025-08-27","Onsdag",{"$f":"IFERROR(VLOOKUP(F106,Påfyldningskalender!B:F,5,0),\"\")","v":""},null,"2025-09-27","Lørdag",{"$f":"IFERROR(VLOOKUP(J106,Påfyldningskalender!B:F,5,0),\"\")","v":""}]
[null,"2025-07-28","Mandag",{"$f":"IFERROR(VLOOKUP(B107,Påfyldningskalender!B:F,5,0),\"\")","v":""},null,"2025-08-28","Torsdag",{"$f":"IFERROR(VLOOKUP(F107,Påfyldningskalender!B:F,5,0),\"\")","v":""},null,"2025-09-28","Søndag",{"$f":"IFERROR(VLOOKUP(J107,Påfyldningskalender!B:F,5,0),\"\")","v":""}]
[null,{"$f":"IF(B107=\"\",\"\",IF(MONTH(B107+1)>MONTH(B107),\"\",B107+1))","v":"2025-07-29"},"Tirsdag",{"$f":"IFERROR(VLOOKUP(B108,Påfyldningskalender!B:F,5,0),\"\")","v":""},null,{"$f":"IF(F107=\"\",\"\",IF(MONTH(F107+1)>MONTH(F107),\"\",F107+1))","v":"2025-08-29"},"Fredag",{"$f":"IFERROR(VLOOKUP(F108,Påfyldningskalender!B:F,5,0),\"\")","v":""},null,{"$f":"IF(J107=\"\",\"\",IF(MONTH(J107+1)>MONTH(J107),\"\",J107+1))","v":"2025-09-29"},"Mandag",{"$f":"IFERROR(VLOOKUP(J108,Påfyldningskalender!B:F,5,0),\"\")","v":""}]
[null,{"$f":"IF(B108=\"\",\"\",IF(MONTH(B108+1)>MONTH(B108),\"\",B108+1))","v":"2025-07-30"},"Onsdag",{"$f":"IFERROR(VLOOKUP(B109,Påfyldningskalender!B:F,5,0),\"\")","v":""},null,{"$f":"IF(F108=\"\",\"\",IF(MONTH(F108+1)>MONTH(F108),\"\",F108+1))","v":"2025-08-30"},"Lørdag",{"$f":"IFERROR(VLOOKUP(F109,Påfyldningskalender!B:F,5,0),\"\")","v":""},null,{"$f":"IF(J108=\"\",\"\",IF(MONTH(J108+1)>MONTH(J108),\"\",J108+1))","v":"2025-09-30"},"Tirsdag",{"$f":"IFERROR(VLOOKUP(J109,Påfyldningskalender!B:F,5,0),\"\")","v":""}]
[null,"2025-07-31","Torsdag",{"$f":"IFERROR(VLOOKUP(B110,Påfyldningskalender!B:F,5,0),\"\")","v":""},null,"2025-08-31","Søndag",{"$f":"IFERROR(VLOOKUP(F110,Påfyldningskalender!B:F,5,0),\"\")","v":""},null,"","",{"$f":"IFERROR(VLOOKUP(J110,Påfyldningskalender!B:F,5,0),\"\")","v":""}]
[]
[null,"Piller på lager : ",{"$f":"K77","v":"2025-06-30"},{"$f":"L77","v":0},null,"Piller på lager : ",{"$f":"C115","v":"2025-07-31"},{"$f":"D115","v":0},null,"Piller på lager : ",{"$f":"G115","v":"2025-08-31"},{"$f":"H115","v":0}]
[null,"Fyldt Kg. på lager : ",null,{"$f":"SUMIFS(Købskalender!$D:$D,Købskalender!$A:$A,\">=\"&PilleStatistik!B80,Købskalender!$A:$A,\"<=\"&PilleStatistik!B110)","v":0},null,"Fyldt Kg. på lager : ",null,{"$f":"SUMIFS(Købskalender!$D:$D,Købskalender!$A:$A,\">=\"&PilleStatistik!F80,Købskalender!$A:$A,\"<=\"&PilleStatistik!F110)","v":0},null,"Fyldt Kg. på lager : ",null,{"$f":"SUMIFS(Købskalender!$D:$D,Købskalender!$A:$A,\">=\"&PilleStatistik!J80,Købskalender!$A:$A,\"<=\"&PilleStatistik!J109)","v":0}]
[null,"Antal Kg. Fyldt på magasin : ",null,{"$f":"SUM(D80:D110)","v":0},null,"Antal Kg. Fyldt på magasin : ",null,{"$f":"SUM(H80:H110)","v":0},null,"Antal Kg. Fyldt på magasin : ",null,{"$f":"SUM(L80:L109)","v":0}]
[null,"Kg. på lager : ",{"$f":"MAX(B80:B110)","v":"2025-07-31"},{"$f":"D112+D113-D114","v":0},null,"Kg. på lager : ",{"$f":"MAX(F80:F110)","v":"2025-08-31"},{"$f":"H112+H113-H114","v":0},null,"Kg. på lager : ",{"$f":"MAX(J80:J110)","v":"2025-09-30"},{"$f":"L112+L113-L114","v":0}]
[]
[null,{"$f":"CHOOSE(MONTH(B118),\"Januar\",\"Februar\",\"Marts\",\"April\",\"Maj\",\"Juni\",\"juli\",\"August\",\"September\",\"oktober\",\"November\",\"December\")","v":"oktober"},null,null,null,{"$f":"CHOOSE(MONTH(F118),\"Januar\",\"Februar\",\"Marts\",\"April\",\"Maj\",\"Juni\",\"juli\",\"August\",\"September\",\"oktober\",\"November\",\"December\")","v":"November"},null,null,null,{"$f":"CHOOSE(MONTH(J118),\"Januar\",\"Februar\",\"Marts\",\"April\",\"Maj\",\"Juni\",\"juli\",\"August\",\"September\",\"oktober\",\"November\",\"December\")","v":"December"}]
[null,{"$f":"MAX(J80:J110)+1","v":"2025-10-01"},{"$f":"IF(B118=\"\",\"\",IFERROR(CHOOSE(WEEKDAY(B118,11),\"Mandag\",\"Tirsdag\",\"Onsdag\",\"Torsdag\",\"Fredag\",\"Lørdag\",\"Søndag\"),\"\"))","v":"Onsdag"},{"$f":"IFERROR(VLOOKUP(B118,Påfyldningskalender!B:F,5,0),\"\")","v":""},null,{"$f":"MAX(B118:B148)+1","v":"2025-11-01"},{"$f":"IF(F118=\"\",\"\",IFERROR(CHOOSE(WEEKDAY(F118,11),\"Mandag\",\"Tirsdag\",\"Onsdag\",\"Torsdag\",\"Fredag\",\"Lørdag\",\"Søndag\"),\"\"))","v":"Lørdag"},{"$f":"IFERROR(VLOOKUP(F118,Påfyldningskalender!B:F,5,0),\"\")","v":""},null,{"$f":"MAX(F118:F148)+1","v":"2025-12-01"},{"$f":"IF(J118=\"\",\"\",IFERROR(CHOOSE(WEEKDAY(J118,11),\"Mandag\",\"Tirsdag\",\"Onsdag\",\"Torsdag\",\"Fredag\",\"Lørdag\",\"Søndag\"),\"\"))","v":"Mandag"},{"$f":"IFERROR(VLOOKUP(J118,Påfyldningskalender!B:F,5,0),\"\")","v":""}]
[null,{"$f":"B118+1","v":"2025-10-02"},"Torsdag",{"$f":"IFERROR(VLOOKUP(B119,Påfyldningskalender!B:F,5,0),\"\")","v":""},null,{"$f":"F118+1","v":"2025-11-02"},"Søndag",{"$f":"IFERROR(VLOOKUP(F119,Påfyldningskalender!B:F,5,0),\"\")","v":""},null,{"$f":"J118+1","v":"2025-12-02"},"Tirsdag",{"$f":"IFERROR(VLOOKUP(J119,Påfyldningskalender!B:F,5,0),\"\")","v":""}]
[null,{"$f":"B119+1","v":"2025-10-03"},"Fredag",{"$f":"IFERROR(VLOOKUP(B120,Påfyldningskalender!B:F,5,0),\"\")","v":""},null,{"$f":"F119+1","v":"2025-11-03"},"Mandag",{"$f":"IFERROR(VLOOKUP(F120,Påfyldningskalender!B:F,5,0),\"\")","v":""},null,{"$f":"J119+1","v":"2025-12-03"},"Onsdag",{"$f":"IFERROR(VLOOKUP(J120,Påfyldningskalender!B:F,5,0),\"\")","v":""}]
[null,"2025-10-04","Lørdag",{"$f":"IFERROR(VLOOKUP(B121,Påfyldningskalender!B:F,5,0),\"\")","v":""},null,"2025-11-04","Tirsdag",{"$f":"IFERROR(VLOOKUP(F121,Påfyldningskalender!B:F,5,0),\"\")","v":""},null,"2025-12-04","Torsdag",{"$f":"IFERROR(VLOOKUP(J121,Påfyldningskalender!B:F,5,0),\"\")","v":""}]
[null,"2025-10-05","Søndag",{"$f":"IFERROR(VLOOKUP(B122,Påfyldningskalender!B:F,5,0),\"\")","v":""},null,"2025-11-05","Onsdag",{"$f":"IFERROR(VLOOKUP(F122,Påfyldningskalender!B:F,5,0),\"\")","v":""},null,"2025-12-05","Fredag",{"$f":"IFERROR(VLOOKUP(J122,Påfyldningskalender!B:F,5,0),\"\")","v":""}]
[null,"2025-10-06","Mandag",{"$f":"IFERROR(VLOOKUP(B123,Påfyldningskalender!B:F,5,0),\"\")","v":""},null,"2025-11-06","Torsdag",{"$f":"IFERROR(VLOOKUP(F123,Påfyldningskalender!B:F,5,0),\"\")","v":""},null,"2025-12-06","Lørdag",{"$f":"IFERROR(VLOOKUP(J123,Påfyldningskalender!B:F,5,0),\"\")","v":""}]
[null,"2025-10-07","Tirsdag",{"$f":"IFERROR(VLOOKUP(B124,Påfyldningskalender!B:F,5,0),\"\")","v":""},null,"2025-11-07","Fredag",{"$f":"IFERROR(VLOOKUP(F124,Påfyldningskalender!B:F,5,0),\"\")","v":""},null,"2025-12-07","Søndag",{"$f":"IFERROR(VLOOKUP(J124,Påfyldningskalender!B:F,5,0),\"\")","v":""}]
[null,"2025-10-08","Onsdag",{"$f":"IFERROR(VLOOKUP(B125,Påfyldningskalender!B:F,5,0),\"\")","v":""},null,"2025-11-08","Lørdag",{"$f":"IFERROR(VLOOKUP(F125,Påfyldningskalender!B:F,5,0),\"\")","v":""},null,"2025-12-08","Mandag",{"$f":"IFERROR(VLOOKUP(J125,Påfyldningskalender!B:F,5,0),\"\")","v":""}]
[null,"2025-10-09","Torsdag",{"$f":"IFERROR(VLOOKUP(B126,Påfyldningskalender!B:F,5,0),\"\")","v":""},null,"2025-11-09","Søndag",{"$f":"IFERROR(VLOOKUP(F126,Påfyldningskalender!B:F,5,0),\"\")","v":""},null,"2025-12-09","Tirsdag",{"$f":"IFERROR(VLOOKUP(J126,Påfyldningskalender!B:F,5,0),\"\")","v":""}]
[null,"2025-10-10","Fredag",{"$f":"IFERROR(VLOOKUP(B127,Påfyldningskalender!B:F,5,0),\"\")","v":""},null,"2025-11-10","Mandag",{"$f":"IFERROR(VLOOKUP(F127,Påfyldningskalender!B:F,5,0),\"\")","v":""},null,"2025-12-10","Onsdag",{"$f":"IFERROR(VLOOKUP(J127,Påfyldningskalender!B:F,5,0),\"\")","v":""}]
[null,"2025-10-11","Lørdag",{"$f":"IFERROR(VLOOKUP(B128,Påfyldningskalender!B:F,5,0),\"\")","v":""},null,"2025-11-11","Tirsdag",{"$f":"IFERROR(VLOOKUP(F128,Påfyldningskalender!B:F,5,0),\"\")","v":""},null,"2025-12-11","Torsdag",{"$f":"IFERROR(VLOOKUP(J128,Påfyldningskalender!B:F,5,0),\"\")","v":""}]
[null,"2025-10-12","Søndag",{"$f":"IFERROR(VLOOKUP(B129,Påfyldningskalender!B:F,5,0),\"\")","v":""},null,"2025-11-12","Onsdag",{"$f":"IFERROR(VLOOKUP(F129,Påfyldningskalender!B:F,5,0),\"\")","v":""},null,"2025-12-12","Fredag",{"$f":"IFERROR(VLOOKUP(J129,Påfyldningskalender!B:F,5,0),\"\")","v":""}]
[null,"2025-10-13","Mandag",{"$f":"IFERROR(VLOOKUP(B130,Påfyldningskalender!B:F,5,0),\"\")","v":""},null,"2025-11-13","Torsdag",{"$f":"IFERROR(VLOOKUP(F130,Påfyldningskalender!B:F,5,0),\"\")","v":""},null,"2025-12-13","Lørdag",{"$f":"IFERROR(VLOOKUP(J130,Påfyldningskalender!B:F,5,0),\"\")","v":""}]
[null,"2025-10-14","Tirsdag",{"$f":"IFERROR(VLOOKUP(B131,Påfyldningskalender!B:F,5,0),\"\")","v":""},null,"2025-11-14","Fredag",{"$f":"IFERROR(VLOOKUP(F131,Påfyldningskalender!B:F,5,0),\"\")","v":""},null,"2025-12-14","Søndag",{"$f":"IFERROR(VLOOKUP(J131,Påfyldningskalender!B:F,5,0),\"\")","v":""}]
[null,"2025-10-15","Onsdag",{"$f":"IFERROR(VLOOKUP(B132,Påfyldningskalender!B:F,5,0),\"\")","v":""},null,"2025-11-15","Lørdag",{"$f":"IFERROR(VLOOKUP(F132,Påfyldningskalender!B:F,5,0),\"\")","v":""},null,"2025-12-15","Mandag",{"$f":"IFERROR(VLOOKUP(J132,Påfyldningskalender!B:F,5,0),\"\")","v":""}]
[null,"2025-10-16","Torsdag",{"$f":"IFERROR(VLOOKUP(B133,Påfyldningskalender!B:F,5,0),\"\")","v":""},null,"2025-11-16","Søndag",{"$f":"IFERROR(VLOOKUP(F133,Påfyldningskalender!B:F,5,0),\"\")","v":""},null,"2025-12-16","Tirsdag",{"$f":"IFERROR(VLOOKUP(J133,Påfyldningskalender!B:F,5,0),\"\")","v":""}]
[null,"2025-10-17","Fredag",{"$f":"IFERROR(VLOOKUP(B134,Påfyldningskalender!B:F,5,0),\"\")","v":""},null,"2025-11-17","Mandag",{"$f":"IFERROR(VLOOKUP(F134,Påfyldningskalender!B:F,5,0),\"\")","v":""},null,"2025-12-17","Onsdag",{"$f":"IFERROR(VLOOKUP(J134,Påfyldningskalender!B:F,5,0),\"\")","v":""}]
[null,"2025-10-18","Lørdag",{"$f":"IFERROR(VLOOKUP(B135,Påfyldningskalender!B:F,5,0),\"\")","v":""},null,"2025-11-18","Tirsdag",{"$f":"IFERROR(VLOOKUP(F135,Påfyldningskalender!B:F,5,0),\"\")","v":""},null,"2025-12-18","Torsdag",{"$f":"IFERROR(VLOOKUP(J135,Påfyldningskalender!B:F,5,0),\"\")","v":""}]
[null,"2025-10-19","Søndag",{"$f":"IFERROR(VLOOKUP(B136,Påfyldningskalender!B:F,5,0),\"\")","v":""},null,"2025-11-19","Onsdag",{"$f":"IFERROR(VLOOKUP(F136,Påfyldningskalender!B:F,5,0),\"\")","v":""},null,"2025-12-19","Fredag",{"$f":"IFERROR(VLOOKUP(J136,Påfyldningskalender!B:F,5,0),\"\")","v":""}]
[null,"2025-10-20","Mandag",{"$f":"IFERROR(VLOOKUP(B137,Påfyldningskalender!B:F,5,0),\"\")","v":""},null,"2025-11-20","Torsdag",{"$f":"IFERROR(VLOOKUP(F137,Påfyldningskalender!B:F,5,0),\"\")","v":""},null,"2025-12-20","Lørdag",{"$f":"IFERROR(VLOOKUP(J137,Påfyldningskalender!B:F,5,0),\"\")","v":""}]
[null,"2025-10-21","Tirsdag",{"$f":"IFERROR(VLOOKUP(B138,Påfyldningskalender!B:F,5,0),\"\")","v":""},null,"2025-11-21","Fredag",{"$f":"IFERROR(VLOOKUP(F138,Påfyldningskalender!B:F,5,0),\"\")","v":""},null,"2025-12-21","Søndag",{"$f":"IFERROR(VLOOKUP(J138,Påfyldningskalender!B:F,5,0),\"\")","v":""}]
[null,"2025-10-22","Onsdag",{"$f":"IFERROR(VLOOKUP(B139,Påfyldningskalender!B:F,5,0),\"\")","v":""},null,"2025-11-22","Lørdag",{"$f":"IFERROR(VLOOKUP(F139,Påfyldningskalender!B:F,5,0),\"\")","v":""},null,"2025-12-22","Mandag",{"$f":"IFERROR(VLOOKUP(J139,Påfyldningskalender!B:F,5,0),\"\")","v":""}]
[null,"2025-10-23","Torsdag",{"$f":"IFERROR(VLOOKUP(B140,Påfyldningskalender!B:F,5,0),\"\")","v":""},null,"2025-11-23","Søndag",{"$f":"IFERROR(VLOOKUP(F140,Påfyldningskalender!B:F,5,0),\"\")","v":""},null,"2025-12-23","Tirsdag",{"$f":"IFERROR(VLOOKUP(J140,Påfyldningskalender!B:F,5,0),\"\")","v":""}]
[null,"2025-10-24","Fredag",{"$f":"IFERROR(VLOOKUP(B141,Påfyldningskalender!B:F,5,0),\"\")","v":""},null,"2025-11-24","Mandag",{"$f":"IFERROR(VLOOKUP(F141,Påfyldningskalender!B:F,5,0),\"\")","v":""},null,"2025-12-24","Onsdag",{"$f":"IFERROR(VLOOKUP(J141,Påfyldningskalender!B:F,5,0),\"\")","v":""}]
[null,"2025-10-25","Lørdag",{"$f":"IFERROR(VLOOKUP(B142,Påfyldningskalender!B:F,5,0),\"\")","v":""},null,"2025-11-25","Tirsdag",{"$f":"IFERROR(VLOOKUP(F142,Påfyldningskalender!B:F,5,0),\"\")","v":""},null,"2025-12-25","Torsdag",{"$f":"IFERROR(VLOOKUP(J142,Påfyldningskalender!B:F,5,0),\"\")","v":""}]
[null,"2025-10-26","Søndag",{"$f":"IFERROR(VLOOKUP(B143,Påfyldningskalender!B:F,5,0),\"\")","v":""},null,"2025-11-26","Onsdag",{"$f":"IFERROR(VLOOKUP(F143,Påfyldningskalender!B:F,5,0),\"\")","v":""},null,"2025-12-26","Fredag",{"$f":"IFERROR(VLOOKUP(J143,Påfyldningskalender!B:F,5,0),\"\")","v":""}]
[null,"2025-10-27","Mandag",{"$f":"IFERROR(VLOOKUP(B144,Påfyldningskalender!B:F,5,0),\"\")","v":""},null,"2025-11-27","Torsdag",{"$f":"IFERROR(VLOOKUP(F144,Påfyldningskalender!B:F,5,0),\"\")","v":""},null,"2025-12-27","Lørdag",{"$f":"IFERROR(VLOOKUP(J144,Påfyldningskalender!B:F,5,0),\"\")","v":""}]
[null,"2025-10-28","Tirsdag",{"$f":"IFERROR(VLOOKUP(B145,Påfyldningskalender!B:F,5,0),\"\")","v":""},null,"2025-11-28","Fredag",{"$f":"IFERROR(VLOOKUP(F145,Påfyldningskalender!B:F,5,0),\"\")","v":""},null,"2025-12-28","Søndag",{"$f":"IFERROR(VLOOKUP(J145,Påfyldningskalender!B:F,5,0),\"\")","v":""}]
[null,{"$f":"IF(B145=\"\",\"\",IF(MONTH(B145+1)>MONTH(B145),\"\",B145+1))","v":"2025-10-29"},"Onsdag",{"$f":"IFERROR(VLOOKUP(B146,Påfyldningskalender!B:F,5,0),\"\")","v":""},null,{"$f":"IF(F145=\"\",\"\",IF(MONTH(F145+1)>MONTH(F145),\"\",F145+1))","v":"2025-11-29"},"Lørdag",{"$f":"IFERROR(VLOOKUP(F146,Påfyldningskalender!B:F,5,0),\"\")","v":""},null,{"$f":"IF(J145=\"\",\"\",IF(MONTH(J145+1)>MONTH(J145),\"\",J145+1))","v":"2025-12-29"},"Mandag",{"$f":"IFERROR(VLOOKUP(J146,Påfyldningskalender!B:F,5,0),\"\")","v":""}]
[null,{"$f":"IF(B146=\"\",\"\",IF(MONTH(B146+1)>MONTH(B146),\"\",B146+1))","v":"2025-10-30"},"Torsdag",{"$f":"IFERROR(VLOOKUP(B147,Påfyldningskalender!B:F,5,0),\"\")","v":""},null,{"$f":"IF(F146=\"\",\"\",IF(MONTH(F146+1)>MONTH(F146),\"\",F146+1))","v":"2025-11-30"},"Søndag",{"$f":"IFERROR(VLOOKUP(F147,Påfyldningskalender!B:F,5,0),\"\")","v":""},null,{"$f":"IF(J146=\"\",\"\",IF(MONTH(J146+1)>MONTH(J146),\"\",J146+1))","v":"2025-12-30"},"Tirsdag",{"$f":"IFERROR(VLOOKUP(J147,Påfyldningskalender!B:F,5,0),\"\")","v":""}]
[null,"2025-10-31","Fredag",{"$f":"IFERROR(VLOOKUP(B148,Påfyldningskalender!B:F,5,0),\"\")","v":""},null,"","",{"$f":"IFERROR(VLOOKUP(F148,Påfyldningskalender!B:F,5,0),\"\")","v":""},null,"2025-12-31","Onsdag",{"$f":"IFERROR(VLOOKUP(J148,Påfyldningskalender!B:F,5,0),\"\")","v":""}]
[]
[null,"Piller på lager : ",{"$f":"K115","v":"2025-09-30"},{"$f":"L115","v":0},null,"Piller på lager : ",{"$f":"C153","v":"2025-10-31"},{"$f":"D153","v":0},null,"Piller på lager : ",{"$f":"G153","v":"2025-11-30"},{"$f":"H153","v":0}]
[null,"Fyldt Kg. på lager : ",null,{"$f":"SUMIFS(Købskalender!$D:$D,Købskalender!$A:$A,\">=\"&PilleStatistik!B118,Købskalender!$A:$A,\"<=\"&PilleStatistik!B148)","v":0},null,"Fyldt Kg. på lager : ",null,{"$f":"SUMIFS(Købskalender!$D:$D,Købskalender!$A:$A,\">=\"&PilleStatistik!F118,Købskalender!$A:$A,\"<=\"&PilleStatistik!F147)","v":0},null,"Fyldt Kg. på lager : ",null,{"$f":"SUMIFS(Købskalender!$D:$D,Købskalender!$A:$A,\">=\"&PilleStatistik!J118,Købskalender!$A:$A,\"<=\"&PilleStatistik!J148)","v":0}]
[null,"Antal Kg. Fyldt på magasin : ",null,{"$f":"SUM(D118:D148)","v":0},null,"Antal Kg. Fyldt på magasin : ",null,{"$f":"SUM(H118:H148)","v":0},null,"Antal Kg. Fyldt på magasin : ",null,{"$f":"SUM(L118:L148)","v":0}]
[null,"Kg. på lager : ",{"$f":"MAX(B118:B148)","v":"2025-10-31"},{"$f":"D150+D151-D152","v":0},null,"Kg. på lager : ",{"$f":"MAX(F118:F148)","v":"2025-11-30"},{"$f":"H150+H151-H152","v":0},null,"Kg. på lager : ",{"$f":"MAX(J118:J148)","v":"2025-12-31"},{"$f":"L150+L151-L152","v":0}]

{"sheet":"Års Totaler","index":5,"n_rows":19,"n_cols":8,"rows_kept":19,"cut":false,"hidden":false,"merged":[[0,1,0,7],[1,6,2,7],[1,3,1,4]]}
[null,"ÅrsTotaler"]
[null,"Dagsdato : ",null,{"$f":"TODAY()","v":"2025-01-26"},null,"På lager "]
[null,"Årstal","Overført","Indkøbt","Brugt"]
[null,null,{"$f":"IF(B4<>\"\",F3,\"\")","v":""},{"$f":"SUMIFS(Købskalender!$E:$E,Købskalender!$A:$A,\">=\"&'Års Totaler'!G4,Købskalender!$A:$A,\"<=\"&'Års Totaler'!H4)","v":0},{"$f":"IF(B4<>\"\",SUMIFS(Påfyldningskalender!$F$5:$F$200,Påfyldningskalender!$B$5:$B$200,\">=\"&'Års Totaler'!G4,Påfyldningskalender!$B$5:$B$200,\"<=\"&'Års Totaler'!H4),\"\")","v":""},{"$f":"IF(B4<>\"\",(C4+D4)-E4,\"\")","v":""},{"$f":"IF(B4<>\"\",DATE(B4,T.!$B$33,T.!$C$33),\"\")","v":""},{"$f":"IF(B4<>\"\",DATE(B4,T.!$B$33+11,T.!$C$35),\"\")","v":""}]
[null,null,"",{"$f":"SUMIFS(Købskalender!$E:$E,Købskalender!$A:$A,\">=\"&'Års Totaler'!G5,Købskalender!$A:$A,\"<=\"&'Års Totaler'!H5)","v":0},{"$f":"IF(B5<>\"\",SUMIFS(Påfyldningskalender!$F$5:$F$200,Påfyldningskalender!$B$5:$B$200,\">=\"&'Års Totaler'!G5,Påfyldningskalender!$B$5:$B$200,\"<=\"&'Års Totaler'!H5),\"\")","v":""},"",{"$f":"IF(B5<>\"\",DATE(B5,T.!$B$33,T.!$C$33),\"\")","v":""},{"$f":"IF(B5<>\"\",DATE(B5,T.!$B$33+11,T.!$C$35),\"\")","v":""}]
[null,null,{"$f":"IF(B6<>\"\",F5,\"\")","v":""},{"$f":"SUMIFS(Købskalender!$E:$E,Købskalender!$A:$A,\">=\"&'Års Totaler'!G6,Købskalender!$A:$A,\"<=\"&'Års Totaler'!H6)","v":0},{"$f":"IF(B6<>\"\",SUMIFS(Påfyldningskalender!$F$5:$F$200,Påfyldningskalender!$B$5:$B$200,\">=\"&'Års Totaler'!G6,Påfyldningskalender!$B$5:$B$200,\"<=\"&'Års Totaler'!H6),\"\")","v":""},{"$f":"IF(B6<>\"\",(C6+D6)-E6,\"\")","v":""},{"$f":"IF(B6<>\"\",DATE(B6,T.!$B$33,T.!$C$33),\"\")","v":""},{"$f":"IF(B6<>\"\",DATE(B6,T.!$B$33+11,T.!$C$35),\"\")","v":""}]
[null,null,{"$f":"IF(B7<>\"\",F6,\"\")","v":""},{"$f":"IF(B7<>\"\",SUMIFS(Købskalender!$D:$D,Købskalender!$A:$A,\">=\"&'Års Totaler'!G7,Købskalender!$A:$A,\"<=\"&'Års Totaler'!H7),\"\")","v":""},{"$f":"IF(B7<>\"\",SUMIFS(Påfyldningskalender!$D$5:$D$200,Påfyldningskalender!$B$5:$B$200,\">=\"&'Års Totaler'!G7,Påfyldningskalender!$B$5:$B$200,\"<=\"&'Års Totaler'!H7),\"\")","v":""},{"$f":"IF(B7<>\"\",(C7+D7)-E7,\"\")","v":""},{"$f":"IF(B7<>\"\",DATE(B7,T.!$B$33,T.!$C$33),\"\")","v":""},{"$f":"IF(B7<>\"\",DATE(B7,T.!$B$33+11,T.!$C$35),\"\")","v":""}]
[null,null,"",{"$f":"IF(B8<>\"\",SUMIFS(Købskalender!$D:$D,Købskalender!$A:$A,\">=\"&'Års Totaler'!G8,Købskalender!$A:$A,\"<=\"&'Års Totaler'!H8),\"\")","v":""},{"$f":"IF(B8<>\"\",SUMIFS(Påfyldningskalender!$D$5:$D$200,Påfyldningskalender!$B$5:$B$200,\">=\"&'Års Totaler'!G8,Påfyldningskalender!$B$5:$B$200,\"<=\"&'Års Totaler'!H8),\"\")","v":""},"",{"$f":"IF(B8<>\"\",DATE(B8,T.!$B$33,T.!$C$33),\"\")","v":""},{"$f":"IF(B8<>\"\",DATE(B8,T.!$B$33+11,T.!$C$35),\"\")","v":""}]
[null,null,"",{"$f":"IF(B9<>\"\",SUMIFS(Købskalender!$D:$D,Købskalender!$A:$A,\">=\"&'Års Totaler'!G9,Købskalender!$A:$A,\"<=\"&'Års Totaler'!H9),\"\")","v":""},{"$f":"IF(B9<>\"\",SUMIFS(Påfyldningskalender!$D$5:$D$200,Påfyldningskalender!$B$5:$B$200,\">=\"&'Års Totaler'!G9,Påfyldningskalender!$B$5:$B$200,\"<=\"&'Års Totaler'!H9),\"\")","v":""},"",{"$f":"IF(B9<>\"\",DATE(B9,T.!$B$33,T.!$C$33),\"\")","v":""},{"$f":"IF(B9<>\"\",DATE(B9,T.!$B$33+11,T.!$C$35),\"\")","v":""}]
[null,null,"",{"$f":"IF(B10<>\"\",SUMIFS(Købskalender!$D:$D,Købskalender!$A:$A,\">=\"&'Års Totaler'!G10,Købskalender!$A:$A,\"<=\"&'Års Totaler'!H10),\"\")","v":""},{"$f":"IF(B10<>\"\",SUMIFS(Påfyldningskalender!$D$5:$D$200,Påfyldningskalender!$B$5:$B$200,\">=\"&'Års Totaler'!G10,Påfyldningskalender!$B$5:$B$200,\"<=\"&'Års Totaler'!H10),\"\")","v":""},"",{"$f":"IF(B10<>\"\",DATE(B10,T.!$B$33,T.!$C$33),\"\")","v":""},{"$f":"IF(B10<>\"\",DATE(B10,T.!$B$33+11,T.!$C$35),\"\")","v":""}]
[null,null,"",{"$f":"IF(B11<>\"\",SUMIFS(Købskalender!$D:$D,Købskalender!$A:$A,\">=\"&'Års Totaler'!G11,Købskalender!$A:$A,\"<=\"&'Års Totaler'!H11),\"\")","v":""},{"$f":"IF(B11<>\"\",SUMIFS(Påfyldningskalender!$D$5:$D$200,Påfyldningskalender!$B$5:$B$200,\">=\"&'Års Totaler'!G11,Påfyldningskalender!$B$5:$B$200,\"<=\"&'Års Totaler'!H11),\"\")","v":""},"",{"$f":"IF(B11<>\"\",DATE(B11,T.!$B$33,T.!$C$33),\"\")","v":""},{"$f":"IF(B11<>\"\",DATE(B11,T.!$B$33+11,T.!$C$35),\"\")","v":""}]
[null,null,"",{"$f":"IF(B12<>\"\",SUMIFS(Købskalender!$D:$D,Købskalender!$A:$A,\">=\"&'Års Totaler'!G12,Købskalender!$A:$A,\"<=\"&'Års Totaler'!H12),\"\")","v":""},{"$f":"IF(B12<>\"\",SUMIFS(Påfyldningskalender!$D$5:$D$200,Påfyldningskalender!$B$5:$B$200,\">=\"&'Års Totaler'!G12,Påfyldningskalender!$B$5:$B$200,\"<=\"&'Års Totaler'!H12),\"\")","v":""},"",{"$f":"IF(B12<>\"\",DATE(B12,T.!$B$33,T.!$C$33),\"\")","v":""},{"$f":"IF(B12<>\"\",DATE(B12,T.!$B$33+11,T.!$C$35),\"\")","v":""}]
[null,null,"",{"$f":"IF(B13<>\"\",SUMIFS(Købskalender!$D:$D,Købskalender!$A:$A,\">=\"&'Års Totaler'!G13,Købskalender!$A:$A,\"<=\"&'Års Totaler'!H13),\"\")","v":""},{"$f":"IF(B13<>\"\",SUMIFS(Påfyldningskalender!$D$5:$D$200,Påfyldningskalender!$B$5:$B$200,\">=\"&'Års Totaler'!G13,Påfyldningskalender!$B$5:$B$200,\"<=\"&'Års Totaler'!H13),\"\")","v":""},"",{"$f":"IF(B13<>\"\",DATE(B13,T.!$B$33,T.!$C$33),\"\")","v":""},{"$f":"IF(B13<>\"\",DATE(B13,T.!$B$33+11,T.!$C$35),\"\")","v":""}]
[null,null,"",{"$f":"IF(B14<>\"\",SUMIFS(Købskalender!$D:$D,Købskalender!$A:$A,\">=\"&'Års Totaler'!G14,Købskalender!$A:$A,\"<=\"&'Års Totaler'!H14),\"\")","v":""},{"$f":"IF(B14<>\"\",SUMIFS(Påfyldningskalender!$D$5:$D$200,Påfyldningskalender!$B$5:$B$200,\">=\"&'Års Totaler'!G14,Påfyldningskalender!$B$5:$B$200,\"<=\"&'Års Totaler'!H14),\"\")","v":""},"",{"$f":"IF(B14<>\"\",DATE(B14,T.!$B$33,T.!$C$33),\"\")","v":""},{"$f":"IF(B14<>\"\",DATE(B14,T.!$B$33+11,T.!$C$35),\"\")","v":""}]
[null,null,"",{"$f":"IF(B15<>\"\",SUMIFS(Købskalender!$D:$D,Købskalender!$A:$A,\">=\"&'Års Totaler'!G15,Købskalender!$A:$A,\"<=\"&'Års Totaler'!H15),\"\")","v":""},{"$f":"IF(B15<>\"\",SUMIFS(Påfyldningskalender!$D$5:$D$200,Påfyldningskalender!$B$5:$B$200,\">=\"&'Års Totaler'!G15,Påfyldningskalender!$B$5:$B$200,\"<=\"&'Års Totaler'!H15),\"\")","v":""},"",{"$f":"IF(B15<>\"\",DATE(B15,T.!$B$33,T.!$C$33),\"\")","v":""},{"$f":"IF(B15<>\"\",DATE(B15,T.!$B$33+11,T.!$C$35),\"\")","v":""}]
[null,null,"",{"$f":"IF(B16<>\"\",SUMIFS(Købskalender!$D:$D,Købskalender!$A:$A,\">=\"&'Års Totaler'!G16,Købskalender!$A:$A,\"<=\"&'Års Totaler'!H16),\"\")","v":""},{"$f":"IF(B16<>\"\",SUMIFS(Påfyldningskalender!$D$5:$D$200,Påfyldningskalender!$B$5:$B$200,\">=\"&'Års Totaler'!G16,Påfyldningskalender!$B$5:$B$200,\"<=\"&'Års Totaler'!H16),\"\")","v":""},"",{"$f":"IF(B16<>\"\",DATE(B16,T.!$B$33,T.!$C$33),\"\")","v":""},{"$f":"IF(B16<>\"\",DATE(B16,T.!$B$33+11,T.!$C$35),\"\")","v":""}]
[null,null,"",{"$f":"IF(B17<>\"\",SUMIFS(Købskalender!$D:$D,Købskalender!$A:$A,\">=\"&'Års Totaler'!G17,Købskalender!$A:$A,\"<=\"&'Års Totaler'!H17),\"\")","v":""},{"$f":"IF(B17<>\"\",SUMIFS(Påfyldningskalender!$D$5:$D$200,Påfyldningskalender!$B$5:$B$200,\">=\"&'Års Totaler'!G17,Påfyldningskalender!$B$5:$B$200,\"<=\"&'Års Totaler'!H17),\"\")","v":""},"",{"$f":"IF(B17<>\"\",DATE(B17,T.!$B$33,T.!$C$33),\"\")","v":""},{"$f":"IF(B17<>\"\",DATE(B17,T.!$B$33+11,T.!$C$35),\"\")","v":""}]
[null,null,"",{"$f":"IF(B18<>\"\",SUMIFS(Købskalender!$D:$D,Købskalender!$A:$A,\">=\"&'Års Totaler'!G18,Købskalender!$A:$A,\"<=\"&'Års Totaler'!H18),\"\")","v":""},{"$f":"IF(B18<>\"\",SUMIFS(Påfyldningskalender!$D$5:$D$200,Påfyldningskalender!$B$5:$B$200,\">=\"&'Års Totaler'!G18,Påfyldningskalender!$B$5:$B$200,\"<=\"&'Års Totaler'!H18),\"\")","v":""},"",{"$f":"IF(B18<>\"\",DATE(B18,T.!$B$33,T.!$C$33),\"\")","v":""},{"$f":"IF(B18<>\"\",DATE(B18,T.!$B$33+11,T.!$C$35),\"\")","v":""}]
[null,null,"",{"$f":"IF(B19<>\"\",SUMIFS(Købskalender!$D:$D,Købskalender!$A:$A,\">=\"&'Års Totaler'!G19,Købskalender!$A:$A,\"<=\"&'Års Totaler'!H19),\"\")","v":""},{"$f":"IF(B19<>\"\",SUMIFS(Påfyldningskalender!$D$5:$D$200,Påfyldningskalender!$B$5:$B$200,\">=\"&'Års Totaler'!G19,Påfyldningskalender!$B$5:$B$200,\"<=\"&'Års Totaler'!H19),\"\")","v":""},"",{"$f":"IF(B19<>\"\",DATE(B19,T.!$B$33,T.!$C$33),\"\")","v":""},{"$f":"IF(B19<>\"\",DATE(B19,T.!$B$33+11,T.!$C$35),\"\")","v":""}]

{"sheet":"System","index":6,"n_rows":15,"n_cols":28,"rows_kept":15,"cut":false,"hidden":false,"merged":[[4,1,4,2],[6,1,6,4],[8,0,8,4]]}
[]
["System opsætning"]
[null,null,null,null,null,null,null,null,null,null,null,null,null,null,null,null,null,null,null,null,null,null,null,null,null,null,null,"(Laves som en knap)"]
[]
["Version:","1.01.05 TræPiller"]
[]
["Navn :","Bjarne Hansen"]
[]
[{"$f":"\"Version: \"&B5 &\" / \"&B7","v":"Version: 1.01.05 TræPiller / Bjarne Hansen"}]
[]
[]
[null,null,null,null,null,null,null,null,null,null,"Formel til at finde de 10 største værdier"]
[null,null,null,null,null,null,null,null,null,null,"=største(xx;10) "]
[null,null,null,null,null,null,null,null,null,null,"=sum.hvis(xx:\">\"&A1)"]
[null,null,null,null,null,null,null,null,null,null,"(xx er selvfølgelig det område, hvor dine tal står)"]

{"sheet":"Vejledning","index":7,"n_rows":48,"n_cols":2,"rows_kept":48,"cut":false,"hidden":false,"merged":[]}
[]
[null,"Bruger vejledning til PilleRegnSkab"]
[]
[null,"Fanen T."]
[]
[null,"På denne fane findes :"]
[null,"Info om huset størrelse"]
[null,"Opsætning fyrings sæsonen, er sat til at følge kalender året."]
[null,"Energiindhold i træpillerne"]
[null,"Fabrikat af træpiller (Her kan Der indtastes nye Fabrikater)"]
[]
[null,"KøbsKalender"]
[]
[null,"Her indtastes Dato, Fabrilat og antal indkøbte paller"]
[]
[null,"Påfyldningskalender"]
[]
[null,"Her Indtastes Dato for påfyldning, antal sække og kg pr sæk."]
[]
[null,"Piller På Lager"]
[]
[null,"Her vises Regnskabet for indkøbte piller og Forbrugte pille og antal piller på lager."]
[]
[null,"PilleStatistik"]
[]
[null,"Her vises en oversigt over påfyldte piller på pr dag"]
[]
[null,"Åers Totaler"]
[]
[null,"Her vises en oversigt for hvert år købte, brugte pille og piller på lager til nytår "]
[]
[null,"System"]
[]
[null,"Oplysninger om arket"]
[]
[]
[]
[]
[]
[]
[]
[]
[null,"OpStart af nyt regnskab"]
[]
[null,"Når du stater et nyt regnskab, og du har piller på lager fordi du har fyret med piller et stykke"]
[null,"tid skal lageret indtastes i cellen F3 på fanen Årstotaler og i cellen D4 på fanen købskalender."]
[null,"hvis lige er staret med at fyre med piller skal de første piller som du har købt indtastes i"]
[null,"C5 på fanen Købskalender, dato, fabrikat og antal palle "]