{"text_format":"1","workbook":"xlsx","n_sheets":8,"sheets":["T.","Købskalender","Påfyldningskalender","Piller På Lager","PilleStatistik","Års Totaler","System","Vejledning"],"not_rendered":{"charts":0,"images":11,"macros":1,"external_links":2,"defined_names":16,"comments":4,"pivot_tables":0},"unopened":[],"bounds":{"document_bytes":16777216,"sheet_cells":100000,"rows_first":2000,"rows_last":500,"rows_between":2000,"halvings":0,"cell_chars":16384,"cell_head_chars":4096},"cells_cut":0,"cells_raw":0,"read":"whole","date_system":"1900"}

{"sheet":"T.","index":0,"n_rows":54,"n_cols":10,"rows_kept":54,"cut":false,"hidden":false,"merged":[[0,9,0,15],[38,0,38,2],[39,3,39,4],[3,0,3,6],[5,0,5,6],[23,1,23,4]]}
["Info om hus",null,null,null,null,null,null,null,null,{"$f":"System!A9","v":"Version: 1.01.05 TræPiller / Bjarne Hansen"}]
["Opvarmet areal",200,"m2"]
[]
["Graddage i området (brug lokale data for dit område)"]
[]
["OBS! Brug de graddage der er kompenseret for vind. Det er nok at udfylde for de måneder, hvor der fyres."]
[]
["Januar",519,"stk"]
["Februar",486,"stk"]
["Marts",444,"stk"]
{"$rows_left_out":45}
{"sheet":"Købskalender","index":1,"n_rows":34,"n_cols":13,"rows_kept":34,"cut":false,"hidden":false,"merged":[[1,7,1,8],[0,6,0,9],[14,26,14,27],[15,21,15,25],[4,21,4,25],[4,26,4,27],[10,21,10,24],[11,21,11,24]]}
["Indkøbs kalender",null,null,null,null,null,{"$f":"System!A9","v":"Version: 1.01.05 TræPiller / Bjarne Hansen"}]
[null,null,null,null,null,null,null,"Gns. kilopris",null,{"$f":"IFERROR(SUM(F:F)/SUM(E:E),\"\")","v":""}]
["Dato","Fabrikat","Paller","Sække","Kilo","Pris","Levering.","Pris I alt","kilopris","kilopris"]
[null,null,null,null,{"$f":"IF(A4<>\"\",D4*T.!#REF!,\"\")","v":""},null,null,{"$f":"F4+G4","v":0},{"$f":"IF(A4<>\"\",F4/E4,\"\")","v":""},{"$f":"IFERROR(H4/E4,\"\")","v":""},null,null,"<---- BRUGES KUN VED OPSTART AF NYT REGNSKAB HVOR MAN HAR PILLER PÅ LAGER"]
[null,null,null,{"$f":"IF(A5<>\"\",C5*T.!#REF!,\"\")","v":""},{"$f":"IF(A5<>\"\",D5*T.!#REF!,\"\")","v":""},null,null,{"$f":"F5+G5","v":0},{"$f":"IF(A5<>\"\",F5/E5,\"\")","v":""},{"$f":"IFERROR(H5/E5,\"\")","v":""},null,null,"Ellers bruges denne linje hvor man taster fabrikat og antal paller ind man har købt"]
[null,null,null,{"$f":"IF(A6<>\"\",C6*T.!#REF!,\"\")","v":""},{"$f":"IF(A6<>\"\",D6*T.!#REF!,\"\")","v":""},null,null,{"$f":"F6+G6","v":0},"",""]
[null,null,null,{"$f":"IF(A7<>\"\",C7*T.!#REF!,\"\")","v":""},{"$f":"IF(A7<>\"\",D7*T.!#REF!,\"\")","v":""},null,null,{"$f":"F7+G7","v":0},{"$f":"IF(A7<>\"\",F7/E7,\"\")","v":""},{"$f":"IFERROR(H7/E7,\"\")","v":""}]
[null,null,null,{"$f":"IF(A8<>\"\",C8*T.!#REF!,\"\")","v":""},{"$f":"IF(A8<>\"\",D8*T.!#REF!,\"\")","v":""},null,null,{"$f":"F8+G8","v":0},{"$f":"IF(A8<>\"\",F8/E8,\"\")","v":""},{"$f":"IFERROR(H8/E8,\"\")","v":""}]
[null,null,null,{"$f":"IF(A9<>\"\",C9*T.!#REF!,\"\")","v":""},{"$f":"IF(A9<>\"\",D9*T.!#REF!,\"\")","v":""},null,null,0,"",""]
[null,null,null,{"$f":"IF(A10<>\"\",C10*T.!#REF!,\"\")","v":""},{"$f":"IF(A10<>\"\",D10*T.!#REF!,\"\")","v":""},null,null,{"$f":"F10+G10","v":0},{"$f":"IF(A10<>\"\",F10/E10,\"\")","v":""},{"$f":"IFERROR(H10/E10,\"\")","v":""}]
{"$rows_left_out":25}
{"sheet":"Påfyldningskalender","index":2,"n_rows":140,"n_cols":23,"rows_kept":140,"cut":false,"hidden":false,"merged":[[139,8,139,9],[130,8,130,9],[131,8,131,9],[132,8,132,9],[133,8,133,9],[134,8,134,9],[135,8,135,9],[136,8,136,9],[137,8,137,9],[138,8,138,9],[121,8,121,9],[122,8,122,9],[123,8,123,9],[124,8,124,9],[125,8,125,9],[126,8,126,9],[127,8,127,9],[128,8,128,9],[129,8,129,9],[112,8,112,9],[113,8,113,9],[114,8,114,9],[115,8,115,9],[116,8,116,9],[117,8,117,9],[118,8,118,9],[119,8,119,9],[120,8,120,9],[103,8,103,9],[104,8,104,9],[105,8,105,9],[106,8,106,9],[107,8,107,9],[108,8,108,9],[109,8,109,9],[110,8,110,9],[111,8,111,9],[31,8,31,9],[32,8,32,9],[33,8,33,9],[34,8,34,9],[35,8,35,9],[36,8,36,9],[37,8,37,9],[60,8,60,9],[47,8,47,9],[42,8,42,9],[43,8,43,9],[44,8,44,9],[45,8,45,9],[46,8,46,9],[58,8,58,9],[59,8,59,9],[54,8,54,9],[55,8,55,9],[56,8,56,9],[48,8,48,9],[49,8,49,9],[50,8,50,9],[51,8,51,9],[57,8,57,9],[38,8,38,9],[53,8,53,9],[39,8,39,9],[40,8,40,9],[52,8,52,9],[41,8,41,9],[23,8,23,9],[1,8,1,9],[3,8,3,9],[2,8,2,9],[28,8,28,9],[26,8,26,9],[27,8,27,9],[17,8,17,9],[19,8,19,9],[20,8,20,9],[21,8,21,9],[22,8,22,9],[18,8,18,9],[24,8,24,9],[25,8,25,9],[4,8,4,9],[29,8,29,9],[30,8,30,9],[4,13,4,14],[0,1,0,9],[15,8,15,9],[16,8,16,9],[10,8,10,9],[11,8,11,9],[12,8,12,9],[13,8,13,9],[14,8,14,9],[5,8,5,9],[6,8,6,9],[7,8,7,9],[8,8,8,9],[9,8,9,9],[16,11,16,12],[16,13,16,14],[66,8,66,9],[67,8,67,9],[68,8,68,9],[69,8,69,9],[70,8,70,9],[61,8,61,9],[62,8,62,9],[63,8,63,9],[64,8,64,9],[65,8,65,9],[76,8,76,9],[77,8,77,9],[78,8,78,9],[79,8,79,9],[80,8,80,9],[71,8,71,9],[72,8,72,9],[73,8,73,9],[74,8,74,9],[75,8,75,9],[2,17,2,18],[2,19,2,20],[101,8,101,9],[102,8,102,9],[96,8,96,9],[97,8,97,9],[98,8,98,9],[99,8,99,9],[100,8,100,9],[91,8,91,9],[92,8,92,9],[93,8,93,9],[94,8,94,9],[95,8,95,9],[86,8,86,9],[87,8,87,9],[88,8,88,9],[89,8,89,9],[90,8,90,9],[81,8,81,9],[82,8,82,9],[83,8,83,9],[84,8,84,9],[85,8,85,9],[13,15,13,16],[4,15,4,16],[5,15,5,16],[6,15,6,16],[7,15,7,16],[8,15,8,16],[9,15,9,16],[10,15,10,16],[11,15,11,16],[12,15,12,16]]}
[null,"Påfyldnings kalender"]
[null,"Dato","dage","sække","Kg \npr sæk","kg","kg \npr dag","sække pr dag","Bemærkning",null,null,null,"dage","sække","kg","kg pr dag","sække pr dag"]
[null,null,null,null,null,null,null,null,null,null,null,"genn. Snit",{"$f":"MAX(Påfyldningskalender!B:B)-Påfyldningskalender!B4","v":0},{"$f":"SUM(Påfyldningskalender!D:D)","v":0},{"$f":"SUM(Påfyldningskalender!F:F)","v":0},{"$f":"IFERROR(O3/M3,\"\")","v":""},{"$f":"IFERROR(N3/M3,0)","v":0},{"$f":"IFERROR(L17-7,\"\")","v":-7},null,null,null,{"$f":"SUMIF(B:B,\">\"&MAX(B:B)-7,G:G)/W3","v":{"$error":"#DIV/0!"}},{"$f":"COUNTIF(B:B,\">\"&MAX(B:B)-7)","v":0}]
[]
[null,null,{"$f":"IF(B5<>\"\",B5-B4,\"\")","v":""},null,null,{"$f":"IF(B5<>\"\",D5*E5,\"\")","v":""},{"$f":"IFERROR(F5/C5,\"\")","v":""},{"$f":"IFERROR(D5/C5,\"\")","v":""},null,null,null,null,null,"Kg. pr. år",null,"Sække á 16 Kg."]
[null,null,"",null,null,"","","",null,null,null,null,null,2022,{"$f":"SUMIFS(Påfyldningskalender!F:F,Påfyldningskalender!B:B,\">=\"&'Års Totaler'!G4,Påfyldningskalender!B:B,\"<\"&'Års Totaler'!H4)","v":0},{"$f":"O6/16","v":0}]
[null,null,"",null,null,"","","",null,null,null,null,null,2023,{"$f":"SUMIFS(Påfyldningskalender!F:F,Påfyldningskalender!B:B,\">=\"&'Års Totaler'!G5,Påfyldningskalender!B:B,\"<\"&'Års Totaler'!H5)","v":0},{"$f":"O7/16","v":0}]
[null,null,"",null,null,"","","",null,null,null,null,null,2024,{"$f":"SUMIFS(Påfyldningskalender!F:F,Påfyldningskalender!B:B,\">=\"&'Års Totaler'!G6,Påfyldningskalender!B:B,\"<\"&'Års Totaler'!H6)","v":0},0]
[null,null,"",null,null,"","","",null,null,null,null,null,2025,{"$f":"SUMIFS(Påfyldningskalender!F:F,Påfyldningskalender!B:B,\">=\"&'Års Totaler'!G7,Påfyldningskalender!B:B,\"<\"&'Års Totaler'!H7)","v":0},0]
[null,null,{"$f":"IF(B10<>\"\",B10-B9,\"\")","v":""},null,null,"","","",null,null,null,null,null,2026,{"$f":"SUMIFS(Påfyldningskalender!F:F,Påfyldningskalender!B:B,\">=\"&'Års Totaler'!G8,Påfyldningskalender!B:B,\"<\"&'Års Totaler'!H8)","v":0},0]
{"$rows_left_out":131}
{"sheet":"Piller På Lager","index":3,"n_rows":35,"n_cols":16,"rows_kept":35,"cut":false,"hidden":false,"merged":[[24,3,24,4],[24,1,24,2],[7,5,8,5],[7,6,8,6],[1,1,1,12],[2,6,2,12],[4,5,4,6],[4,7,4,12],[6,3,6,5],[6,6,6,7],[6,8,6,9],[6,10,6,12],[7,1,8,1],[24,6,27,6],[7,14,8,14],[7,15,8,15],[21,2,21,12],[22,8,22,12],[7,7,8,7],[7,8,8,8],[7,9,8,9],[7,10,8,10],[7,11,8,11],[7,12,8,12],[7,2,8,2],[7,3,8,3],[7,4,8,4],[29,2,29,3],[29,4,29,5],[30,5,32,5],[25,1,25,2],[25,3,25,4],[26,1,26,2],[26,3,26,4],[27,1,27,2],[27,3,27,4]]}
[]
[null,"PilleRegnSkab - Piller på lager"]
[null,{"$f":"\"Fyringssæson - \"&T.!B30","v":"Fyringssæson - 2025"},null,null,null,null,{"$f":"System!A9","v":"Version: 1.01.05 TræPiller / Bjarne Hansen"}]
[]
[null,"Dags dato : ",{"$f":"TODAY()","v":"2025-01-26"},"Uge : ",{"$f":"WEEKNUM(C5,2)","v":4},"Forbrugs adresse: ",null,{"$f":"T.!B24","v":"Din Adresse indtastes på fanen T."}]
[]
[null,null,null,"Indkøb pr. måned",null,null,"Fyldt på magasin",null,"Forbrug pr. måned"]
[null,"Måned","Dage","Kg. Leveret","Købs pris kr","Pris pr. kg.","Sække","kg.","Forbrug pr.\ndøgn kg.","Pris pr. kg\ntræpiller","Pris pr.\ndøgn","Pris pr. l. Olie","Besparelses"]
[]
[null,{"$f":"DATE(T.!$B$30,T.!B33,1)","v":"2025-01-01"},{"$f":"TEXT(EOMONTH(B10,0),\"dd\")","v":"31"},{"$f":"SUMIFS(Købskalender!E:E,Købskalender!A:A,\">=\"&B10,Købskalender!A:A,\"<\"&B11)","v":0},{"$f":"SUMIFS(Købskalender!F:F,Købskalender!A:A,\">=0\"&B10,Købskalender!A:A,\"<\"&B11)","v":0},{"$f":"IFERROR(E10/D10,\"\")","v":""},{"$f":"SUMIFS(Påfyldningskalender!D:D,Påfyldningskalender!B:B,\">=\"&B10,Påfyldningskalender!B:B,\"<\"&B11)","v":0},{"$f":"SUMIFS(Påfyldningskalender!F:F,Påfyldningskalender!B:B,\">=\"&B10,Påfyldningskalender!B:B,\"<\"&B11)","v":0},{"$f":"H10/C10","v":0},null,{"$f":"I10*J10","v":0},null,{"$f":"P10-O10","v":0},null,{"$f":"H10*J10","v":0},{"$f":"H10*4.9/10*L10","v":0}]
{"$rows_left_out":26}
{"sheet":"PilleStatistik","index":4,"n_rows":153,"n_cols":23,"rows_kept":153,"cut":false,"hidden":false,"merged":[[21,20,21,21],[22,20,22,21],[24,20,24,21],[25,20,25,21],[15,13,15,14],[15,16,15,17],[23,20,23,21],[7,13,7,14],[19,20,19,21],[20,20,20,21],[7,16,7,17],[7,19,7,20],[11,13,11,14],[11,16,11,17],[11,19,11,20],[75,1,75,2],[75,5,75,6],[75,9,75,10],[78,1,78,3],[26,20,26,21],[27,20,27,21],[28,20,28,21],[29,20,29,21],[30,20,30,21],[31,20,31,21],[32,20,32,21],[113,1,113,2],[113,5,113,6],[113,9,113,10],[112,1,112,2],[112,5,112,6],[112,9,112,10],[151,1,151,2],[151,5,151,6],[151,9,151,10],[116,1,116,3],[116,5,116,7],[116,9,116,11],[150,1,150,2],[150,5,150,6],[150,9,150,10],[3,19,3,20],[78,5,78,7],[78,9,78,11],[74,1,74,2],[74,5,74,6],[36,1,36,2],[36,5,36,6],[36,9,36,10],[37,1,37,2],[37,5,37,6],[37,9,37,10],[34,13,34,20],[40,1,40,3],[40,5,40,7],[40,9,40,11],[74,9,74,10],[2,1,2,3],[2,5,2,7],[2,9,2,11],[3,13,3,14],[3,16,3,17]]}
[]
[null,"Dato","Ugedag","Påfyldt antal Kg.",null,"Dato","Ugedag","Påfyldt antal Kg.",null,"Dato","Ugedag","Påfyldt antal Kg.",null,{"$f":"T.!B30","v":2025}]
[null,{"$f":"CHOOSE(MONTH(B4),\"Januar\",\"Februar\",\"Marts\",\"April\",\"Maj\",\"Juni\",\"juli\",\"August\",\"September\",\"oktober\",\"November\",\"December\")","v":"Januar"},null,null,null,{"$f":"CHOOSE(MONTH(F4),\"Januar\",\"Februar\",\"Marts\",\"April\",\"Maj\",\"Juni\",\"juli\",\"August\",\"September\",\"Oktober\",\"November\",\"December\")","v":"Februar"},null,null,null,{"$f":"CHOOSE(MONTH(J4),\"Januar\",\"Februar\",\"Marts\",\"April\",\"Maj\",\"Juni\",\"juli\",\"August\",\"September\",\"oktober\",\"November\",\"December\")","v":"Marts"}]
[null,{"$f":"T.!B36","v":"2025-01-01"},{"$f":"IF(B4=\"\",\"\",IFERROR(CHOOSE(WEEKDAY(B4,11),\"Mandag\",\"Tirsdag\",\"Onsdag\",\"Torsdag\",\"Fredag\",\"Lørdag\",\"Søndag\"),\"\"))","v":"Onsdag"},{"$f":"IFERROR(VLOOKUP(B4,Påfyldningskalender!B:D,3,0),\"\")","v":""},null,{"$f":"MAX(B4:B34)+1","v":"2025-02-01"},{"$f":"IF(F4=\"\",\"\",IFERROR(CHOOSE(WEEKDAY(F4,11),\"Mandag\",\"Tirsdag\",\"Onsdag\",\"Torsdag\",\"Fredag\",\"Lørdag\",\"Søndag\"),\"\"))","v":"Lørdag"},{"$f":"IFERROR(VLOOKUP(F4,Påfyldningskalender!B:F,5,0),\"\")","v":""},null,{"$f":"MAX(F4:F34)+1","v":"2025-03-01"},{"$f":"IF(J4=\"\",\"\",IFERROR(CHOOSE(WEEKDAY(J4,11),\"Mandag\",\"Tirsdag\",\"Onsdag\",\"Torsdag\",\"Fredag\",\"Lørdag\",\"Søndag\"),\"\"))","v":"Lørdag"},{"$f":"IFERROR(VLOOKUP(J4,Påfyldningskalender!B:F,5,0),\"\")","v":""},null,{"$f":"B3","v":"Januar"},null,null,{"$f":"F3","v":"Februar"},null,null,{"$f":"J3","v":"Marts"}]
[null,{"$f":"B4+1","v":"2025-01-02"},"Torsdag",{"$f":"IFERROR(VLOOKUP(B5,Påfyldningskalender!B:D,3,0),\"\")","v":""},null,{"$f":"F4+1","v":"2025-02-02"},"Søndag",{"$f":"IFERROR(VLOOKUP(F5,Påfyldningskalender!B:F,5,0),\"\")","v":""},null,{"$f":"J4+1","v":"2025-03-02"},"Søndag",{"$f":"IFERROR(VLOOKUP(J5,Påfyldningskalender!B:F,5,0),\"\")","v":""},null,{"$f":"SUM(D4:D33)/(MAX(B4:B34)-MIN(B4:B34))","v":0},"Sække pr. dag",null,{"$f":"H38/Q7","v":0},"Sække pr. dag",null,{"$f":"SUM(L4:L33)/(MAX(J4:J34)-MIN(J4:J34))","v":0},"Sække pr. dag"]
[null,{"$f":"B5+1","v":"2025-01-03"},"Fredag",{"$f":"IFERROR(VLOOKUP(B6,Påfyldningskalender!B:D,3,0),\"\")","v":""},null,{"$f":"F5+1","v":"2025-02-03"},"Mandag",{"$f":"IFERROR(VLOOKUP(F6,Påfyldningskalender!B:F,5,0),\"\")","v":""},null,{"$f":"J5+1","v":"2025-03-03"},"Mandag",{"$f":"IFERROR(VLOOKUP(J6,Påfyldningskalender!B:F,5,0),\"\")","v":""},null,{"$f":"N5*16","v":0},"Kg. Pr. dag",null,{"$f":"Q5*16","v":0},"Kg. Pr. dag",null,{"$f":"T5*16","v":0},"Kg. Pr. dag"]
[null,"2025-01-04","Lørdag",{"$f":"IFERROR(VLOOKUP(B7,Påfyldningskalender!B:D,3,0),\"\")","v":""},null,"2025-02-04","Tirsdag",{"$f":"IFERROR(VLOOKUP(F7,Påfyldningskalender!B:F,5,0),\"\")","v":""},null,"2025-03-04","Tirsdag",{"$f":"IFERROR(VLOOKUP(J7,Påfyldningskalender!B:F,5,0),\"\")","v":""},null,{"$f":"DAY(EOMONTH(B4,0))","v":31},{"$f":"DATE(N2,T.!B33,1)","v":"2025-01-01"},null,{"$f":"DAY(EOMONTH(F4,0))","v":28},{"$f":"DATE(N2,T.!B33+1,1)","v":"2025-02-01"},null,{"$f":"DAY(EOMONTH(J4,0))","v":31}]
[null,"2025-01-05","Søndag",{"$f":"IFERROR(VLOOKUP(B8,Påfyldningskalender!B:D,3,0),\"\")","v":""},null,"2025-02-05","Onsdag",{"$f":"IFERROR(VLOOKUP(F8,Påfyldningskalender!B:F,5,0),\"\")","v":""},null,"2025-03-05","Onsdag",{"$f":"IFERROR(VLOOKUP(J8,Påfyldningskalender!B:F,5,0),\"\")","v":""},null,{"$f":"B41","v":"April"},null,null,{"$f":"F41","v":"Maj"},null,null,{"$f":"J41","v":"Juni"}]
[null,"2025-01-06","Mandag",{"$f":"IFERROR(VLOOKUP(B9,Påfyldningskalender!B:D,3,0),\"\")","v":""},null,"2025-02-06","Torsdag",{"$f":"IFERROR(VLOOKUP(F9,Påfyldningskalender!B:F,5,0),\"\")","v":""},null,"2025-03-06","Torsdag",{"$f":"IFERROR(VLOOKUP(J9,Påfyldningskalender!B:F,5,0),\"\")","v":""},null,{"$f":"D76/N11","v":0},"Sække pr. dag",null,{"$f":"H76/Q11","v":0},"Sække pr. dag",null,{"$f":"SUM(L42:L71)/(MAX(J42:J72)-MIN(J42:J72))","v":0},"Sække pr. dag"]
[null,"2025-01-07","Tirsdag",{"$f":"IFERROR(VLOOKUP(B10,Påfyldningskalender!B:D,3,0),\"\")","v":""},null,"2025-02-07","Fredag",{"$f":"IFERROR(VLOOKUP(F10,Påfyldningskalender!B:F,5,0),\"\")","v":""},null,"2025-03-07","Fredag",{"$f":"IFERROR(VLOOKUP(J10,Påfyldningskalender!B:F,5,0),\"\")","v":""},null,{"$f":"N9*16","v":0},"Kg. Pr. dag",null,{"$f":"Q9*16","v":0},"Kg. Pr. dag",null,{"$f":"T9*16","v":0},"Kg. Pr. dag"]
{"$rows_left_out":144}
{"sheet":"Års Totaler","index":5,"n_rows":19,"n_cols":8,"rows_kept":19,"cut":false,"hidden":false,"merged":[[0,1,0,7],[1,6,2,7],[1,3,1,4]]}
[null,"ÅrsTotaler"]
[null,"Dagsdato : ",null,{"$f":"TODAY()","v":"2025-01-26"},null,"På lager "]
[null,"Årstal","Overført","Indkøbt","Brugt"]
[null,null,{"$f":"IF(B4<>\"\",F3,\"\")","v":""},{"$f":"SUMIFS(Købskalender!$E:$E,Købskalender!$A:$A,\">=\"&'Års Totaler'!G4,Købskalender!$A:$A,\"<=\"&'Års Totaler'!H4)","v":0},{"$f":"IF(B4<>\"\",SUMIFS(Påfyldningskalender!$F$5:$F$200,Påfyldningskalender!$B$5:$B$200,\">=\"&'Års Totaler'!G4,Påfyldningskalender!$B$5:$B$200,\"<=\"&'Års Totaler'!H4),\"\")","v":""},{"$f":"IF(B4<>\"\",(C4+D4)-E4,\"\")","v":""},{"$f":"IF(B4<>\"\",DATE(B4,T.!$B$33,T.!$C$33),\"\")","v":""},{"$f":"IF(B4<>\"\",DATE(B4,T.!$B$33+11,T.!$C$35),\"\")","v":""}]
[null,null,"",{"$f":"SUMIFS(Købskalender!$E:$E,Købskalender!$A:$A,\">=\"&'Års Totaler'!G5,Købskalender!$A:$A,\"<=\"&'Års Totaler'!H5)","v":0},{"$f":"IF(B5<>\"\",SUMIFS(Påfyldningskalender!$F$5:$F$200,Påfyldningskalender!$B$5:$B$200,\">=\"&'Års Totaler'!G5,Påfyldningskalender!$B$5:$B$200,\"<=\"&'Års Totaler'!H5),\"\")","v":""},"",{"$f":"IF(B5<>\"\",DATE(B5,T.!$B$33,T.!$C$33),\"\")","v":""},{"$f":"IF(B5<>\"\",DATE(B5,T.!$B$33+11,T.!$C$35),\"\")","v":""}]
[null,null,{"$f":"IF(B6<>\"\",F5,\"\")","v":""},{"$f":"SUMIFS(Købskalender!$E:$E,Købskalender!$A:$A,\">=\"&'Års Totaler'!G6,Købskalender!$A:$A,\"<=\"&'Års Totaler'!H6)","v":0},{"$f":"IF(B6<>\"\",SUMIFS(Påfyldningskalender!$F$5:$F$200,Påfyldningskalender!$B$5:$B$200,\">=\"&'Års Totaler'!G6,Påfyldningskalender!$B$5:$B$200,\"<=\"&'Års Totaler'!H6),\"\")","v":""},{"$f":"IF(B6<>\"\",(C6+D6)-E6,\"\")","v":""},{"$f":"IF(B6<>\"\",DATE(B6,T.!$B$33,T.!$C$33),\"\")","v":""},{"$f":"IF(B6<>\"\",DATE(B6,T.!$B$33+11,T.!$C$35),\"\")","v":""}]
[null,null,{"$f":"IF(B7<>\"\",F6,\"\")","v":""},{"$f":"IF(B7<>\"\",SUMIFS(Købskalender!$D:$D,Købskalender!$A:$A,\">=\"&'Års Totaler'!G7,Købskalender!$A:$A,\"<=\"&'Års Totaler'!H7),\"\")","v":""},{"$f":"IF(B7<>\"\",SUMIFS(Påfyldningskalender!$D$5:$D$200,Påfyldningskalender!$B$5:$B$200,\">=\"&'Års Totaler'!G7,Påfyldningskalender!$B$5:$B$200,\"<=\"&'Års Totaler'!H7),\"\")","v":""},{"$f":"IF(B7<>\"\",(C7+D7)-E7,\"\")","v":""},{"$f":"IF(B7<>\"\",DATE(B7,T.!$B$33,T.!$C$33),\"\")","v":""},{"$f":"IF(B7<>\"\",DATE(B7,T.!$B$33+11,T.!$C$35),\"\")","v":""}]
[null,null,"",{"$f":"IF(B8<>\"\",SUMIFS(Købskalender!$D:$D,Købskalender!$A:$A,\">=\"&'Års Totaler'!G8,Købskalender!$A:$A,\"<=\"&'Års Totaler'!H8),\"\")","v":""},{"$f":"IF(B8<>\"\",SUMIFS(Påfyldningskalender!$D$5:$D$200,Påfyldningskalender!$B$5:$B$200,\">=\"&'Års Totaler'!G8,Påfyldningskalender!$B$5:$B$200,\"<=\"&'Års Totaler'!H8),\"\")","v":""},"",{"$f":"IF(B8<>\"\",DATE(B8,T.!$B$33,T.!$C$33),\"\")","v":""},{"$f":"IF(B8<>\"\",DATE(B8,T.!$B$33+11,T.!$C$35),\"\")","v":""}]
[null,null,"",{"$f":"IF(B9<>\"\",SUMIFS(Købskalender!$D:$D,Købskalender!$A:$A,\">=\"&'Års Totaler'!G9,Købskalender!$A:$A,\"<=\"&'Års Totaler'!H9),\"\")","v":""},{"$f":"IF(B9<>\"\",SUMIFS(Påfyldningskalender!$D$5:$D$200,Påfyldningskalender!$B$5:$B$200,\">=\"&'Års Totaler'!G9,Påfyldningskalender!$B$5:$B$200,\"<=\"&'Års Totaler'!H9),\"\")","v":""},"",{"$f":"IF(B9<>\"\",DATE(B9,T.!$B$33,T.!$C$33),\"\")","v":""},{"$f":"IF(B9<>\"\",DATE(B9,T.!$B$33+11,T.!$C$35),\"\")","v":""}]
[null,null,"",{"$f":"IF(B10<>\"\",SUMIFS(Købskalender!$D:$D,Købskalender!$A:$A,\">=\"&'Års Totaler'!G10,Købskalender!$A:$A,\"<=\"&'Års Totaler'!H10),\"\")","v":""},{"$f":"IF(B10<>\"\",SUMIFS(Påfyldningskalender!$D$5:$D$200,Påfyldningskalender!$B$5:$B$200,\">=\"&'Års Totaler'!G10,Påfyldningskalender!$B$5:$B$200,\"<=\"&'Års Totaler'!H10),\"\")","v":""},"",{"$f":"IF(B10<>\"\",DATE(B10,T.!$B$33,T.!$C$33),\"\")","v":""},{"$f":"IF(B10<>\"\",DATE(B10,T.!$B$33+11,T.!$C$35),\"\")","v":""}]
{"$rows_left_out":10}
{"sheet":"System","index":6,"n_rows":15,"n_cols":28,"rows_kept":15,"cut":false,"hidden":false,"merged":[[4,1,4,2],[6,1,6,4],[8,0,8,4]]}
[]
["System opsætning"]
[null,null,null,null,null,null,null,null,null,null,null,null,null,null,null,null,null,null,null,null,null,null,null,null,null,null,null,"(Laves som en knap)"]
[]
["Version:","1.01.05 TræPiller"]
[]
["Navn :","Bjarne Hansen"]
[]
[{"$f":"\"Version: \"&B5 &\" / \"&B7","v":"Version: 1.01.05 TræPiller / Bjarne Hansen"}]
[]
{"$rows_left_out":6}
{"sheet":"Vejledning","index":7,"n_rows":48,"n_cols":2,"rows_kept":48,"cut":false,"hidden":false,"merged":[]}
[]
[null,"Bruger vejledning til PilleRegnSkab"]
[]
[null,"Fanen T."]
[]
[null,"På denne fane findes :"]
[null,"Info om huset størrelse"]
[null,"Opsætning fyrings sæsonen, er sat til at følge kalender året."]
[null,"Energiindhold i træpillerne"]
[null,"Fabrikat af træpiller (Her kan Der indtastes nye Fabrikater)"]
{"$rows_left_out":38}