{"text_format":"1","workbook":"xlsx","n_sheets":15,"sheets":["Arbejdes timer","Januar","Februar","Marts","April","MAJ","JUNI","JULI","AUGUST","SEPTEMBER","OKTOBER","NOVEMBER","DECEMBER","T","Ark1"],"not_rendered":{"charts":0,"images":0,"macros":1,"external_links":0,"defined_names":1,"comments":0,"pivot_tables":0},"unopened":[],"bounds":{"document_bytes":16777216,"sheet_cells":100000,"rows_first":2000,"rows_last":500,"rows_between":2000,"halvings":0,"cell_chars":16384,"cell_head_chars":4096},"cells_cut":0,"cells_raw":0,"read":"whole","date_system":"1900"}

{"sheet":"Arbejdes timer","index":0,"n_rows":45,"n_cols":38,"rows_kept":45,"cut":false,"hidden":false,"merged":[[0,21,0,23],[0,28,0,30],[0,35,0,37],[0,4,0,5],[0,7,0,9],[0,11,0,12],[0,18,0,19],[0,25,0,26],[0,32,0,33],[0,14,0,16]]}
[null,null,null,null,"Medarbejder",null,null,"Jacob",null,null,null,"Medarbejder",null,null,"Nina",null,null,null,"Medarbejder",null,null,"René",null,null,null,"Medarbejder",null,null,"Kirsten",null,null,null,"Medarbejder",null,null,"Erik"]
["Uge","Juni",2019,null,"Møde tid","Slut tid",null,"arb.tid","Overarbejde","Bemærkning",null,"Møde tid","Slut tid",null,"arb.tid","Overarbejde","Bemærkning",null,"Møde tid","Slut tid",null,"arb.tid","Overarbejde","Bemærkning",null,"Møde tid","Slut tid",null,"arb.tid","Overarbejde","Bemærkning",null,"Møde tid","Slut tid",null,"arb.tid","Overarbejde","Bemærkning"]
[{"$f":"IF(WEEKDAY(B3,2)=1,WEEKNUM(B3,2),\"\")","v":""},{"$f":"DATE(C2,MATCH(B2,T!D1:D12,0),1)","v":"2015-05-31"},{"$f":"VLOOKUP(WEEKDAY(B3,11),T!$G$1:$H$7,2)","v":"Lørdag"},{"$f":"HelligdagsNavn(B3,0,0)","v":""},"09:00:00","16:00:00",{"$f":"IF(INDEX(INDIRECT(\"'\"&$B$2&\"'!$A$2:$I$34\"),MATCH(B3,INDIRECT(\"'\"&$B$2&\"'!B2:$B$34\"),0),MATCH($H$1,INDIRECT(\"'\"&$B$2&\"'!$A$3:$I$3\"),0))=\"\",\"\",INDEX(INDIRECT(\"'\"&$B$2&\"'!$A$2:$I$34\"),MATCH(B3,INDIRECT(\"'\"&$B$2&\"'!B2:$B$34\"),0),MATCH($H$1,INDIRECT(\"'\"&$B$2&\"'!$A$3:$I$3\"),0)))","v":"9-18"},{"$f":"IF(AND(E3=\"\",F3=\"\"),\"\",F3-E3)","v":"07:00:00"},{"$f":"IFERROR(IF(AND(E3=\"\",F3=\"\"),\"\",IF(G3=\"\",F3-E3,F3-E3-((+CONCATENATE(MID(G3,SEARCH(\"-\",G3,1)+1,LEN(G3)-SEARCH(\"-\",G3,1)),\":\",0)-0)-+CONCATENATE(LEFT(G3,SEARCH(\"-\",G3,1)-1),\":\",0)-0))),\"\")","v":-8.333333333333337E-2},null,null,"09:00:00","18:00:00",null,{"$f":"M3-L3","v":"09:00:00"},{"$f":"IFERROR(IF(AND(L3=\"\",M3=\"\"),\"\",IF(INDIRECT(\"'\"&$B$2&\"'!f5\")=\"\",M3-L3,M3-L3-((+CONCATENATE(MID(INDIRECT(\"'\"&$B$2&\"'!f5\"),SEARCH(\"-\",INDIRECT(\"'\"&$B$2&\"'!f5\"),1)+1,LEN(INDIRECT(\"'\"&$B$2&\"'!f5\"))-SEARCH(\"-\",INDIRECT(\"'\"&$B$2&\"'!f5\"),1)),\":\",0)-0)-+CONCATENATE(LEFT(INDIRECT(\"'\"&$B$2&\"'!f5\"),SEARCH(\"-\",INDIRECT(\"'\"&$B$2&\"'!f5\"),1)-1),\":\",0)-0))),\"\")","v":"09:00:00"},null,null,"09:00:00","16:00:00",null,{"$f":"T3-S3","v":"07:00:00"},{"$f":"IFERROR(IF(AND(S3=\"\",T3=\"\"),\"\",IF(INDIRECT(\"'\"&$B$2&\"'!g5\")=\"\",T3-S3,T3-S3-((+CONCATENATE(MID(INDIRECT(\"'\"&$B$2&\"'!g5\"),SEARCH(\"-\",INDIRECT(\"'\"&$B$2&\"'!g5\"),1)+1,LEN(INDIRECT(\"'\"&$B$2&\"'!g5\"))-SEARCH(\"-\",INDIRECT(\"'\"&$B$2&\"'!g5\"),1)),\":\",0)-0)-+CONCATENATE(LEFT(INDIRECT(\"'\"&$B$2&\"'!g5\"),SEARCH(\"-\",INDIRECT(\"'\"&$B$2&\"'!g5\"),1)-1),\":\",0)-0))),\"\")","v":-2.083333333333337E-2},null,null,null,null,null,{"$f":"AA3-Z3","v":"00:00:00"},null,null,null,null,null,null,{"$f":"AH3-AG3","v":"00:00:00"}]
["",{"$f":"B3+1","v":"2015-06-01"},{"$f":"VLOOKUP(WEEKDAY(B4,11),T!$G$1:$H$7,2)","v":"Søndag"},"","09:00:00","19:00:00",{"$f":"IF(INDEX(INDIRECT(\"'\"&$B$2&\"'!$A$2:$I$34\"),MATCH(B4,INDIRECT(\"'\"&$B$2&\"'!B2:$B$34\"),0),MATCH($H$1,INDIRECT(\"'\"&$B$2&\"'!$A$3:$I$3\"),0))=\"\",\"\",INDEX(INDIRECT(\"'\"&$B$2&\"'!$A$2:$I$34\"),MATCH(B4,INDIRECT(\"'\"&$B$2&\"'!B2:$B$34\"),0),MATCH($H$1,INDIRECT(\"'\"&$B$2&\"'!$A$3:$I$3\"),0)))","v":""},"10:00:00",{"$f":"IFERROR(IF(AND(E4=\"\",F4=\"\"),\"\",IF(G4=\"\",F4-E4,F4-E4-((+CONCATENATE(MID(G4,SEARCH(\"-\",G4,1)+1,LEN(G4)-SEARCH(\"-\",G4,1)),\":\",0)-0)-+CONCATENATE(LEFT(G4,SEARCH(\"-\",G4,1)-1),\":\",0)-0))),\"\")","v":"10:00:00"},null,null,"09:00:00","16:30:00",null,{"$f":"M4-L4","v":"07:30:00"},{"$f":"IFERROR(IF(AND(L4=\"\",M4=\"\"),\"\",IF(INDIRECT(\"'\"&$B$2&\"'!f6\")=\"\",M4-L4,M4-L4-((+CONCATENATE(MID(INDIRECT(\"'\"&$B$2&\"'!f6\"),SEARCH(\"-\",INDIRECT(\"'\"&$B$2&\"'!f6\"),1)+1,LEN(INDIRECT(\"'\"&$B$2&\"'!f6\"))-SEARCH(\"-\",INDIRECT(\"'\"&$B$2&\"'!f6\"),1)),\":\",0)-0)-+CONCATENATE(LEFT(INDIRECT(\"'\"&$B$2&\"'!f6\"),SEARCH(\"-\",INDIRECT(\"'\"&$B$2&\"'!f6\"),1)-1),\":\",0)-0))),\"\")","v":-6.25E-2},null,null,null,null,null,{"$f":"T4-S4","v":"00:00:00"},"",null,null,null,null,null,{"$f":"AA4-Z4","v":"00:00:00"},null,null,null,null,null,null,{"$f":"AH4-AG4","v":"00:00:00"}]
[23,{"$f":"B4+1","v":"2015-06-02"},{"$f":"VLOOKUP(WEEKDAY(B5,11),T!$G$1:$H$7,2)","v":"Mandag"},"","09:00:00","18:00:00",{"$f":"IF(INDEX(INDIRECT(\"'\"&$B$2&\"'!$A$2:$I$34\"),MATCH(B5,INDIRECT(\"'\"&$B$2&\"'!B2:$B$34\"),0),MATCH($H$1,INDIRECT(\"'\"&$B$2&\"'!$A$3:$I$3\"),0))=\"\",\"\",INDEX(INDIRECT(\"'\"&$B$2&\"'!$A$2:$I$34\"),MATCH(B5,INDIRECT(\"'\"&$B$2&\"'!B2:$B$34\"),0),MATCH($H$1,INDIRECT(\"'\"&$B$2&\"'!$A$3:$I$3\"),0)))","v":"9-18"},"09:00:00",{"$f":"IFERROR(IF(AND(E5=\"\",F5=\"\"),\"\",IF(G5=\"\",F5-E5,F5-E5-((+CONCATENATE(MID(G5,SEARCH(\"-\",G5,1)+1,LEN(G5)-SEARCH(\"-\",G5,1)),\":\",0)-0)-+CONCATENATE(LEFT(G5,SEARCH(\"-\",G5,1)-1),\":\",0)-0))),\"\")","v":"00:00:00"},null,null,"09:00:00","15:00:00",null,"06:00:00",{"$f":"IFERROR(IF(AND(L5=\"\",M5=\"\"),\"\",IF(INDIRECT(\"'\"&$B$2&\"'!f7\")=\"\",M5-L5,M5-L5-((+CONCATENATE(MID(INDIRECT(\"'\"&$B$2&\"'!f7\"),SEARCH(\"-\",INDIRECT(\"'\"&$B$2&\"'!f7\"),1)+1,LEN(INDIRECT(\"'\"&$B$2&\"'!f7\"))-SEARCH(\"-\",INDIRECT(\"'\"&$B$2&\"'!f7\"),1)),\":\",0)-0)-+CONCATENATE(LEFT(INDIRECT(\"'\"&$B$2&\"'!f7\"),SEARCH(\"-\",INDIRECT(\"'\"&$B$2&\"'!f7\"),1)-1),\":\",0)-0))),\"\")","v":-0.125},null,null,null,null,null,"00:00:00","",null,null,null,null,null,"00:00:00",null,null,null,null,null,null,"00:00:00"]
["","2015-06-03",{"$f":"VLOOKUP(WEEKDAY(B6,11),T!$G$1:$H$7,2)","v":"Tirsdag"},"","08:00:00","12:00:00","9-15","04:00:00",{"$f":"IFERROR(IF(AND(E6=\"\",F6=\"\"),\"\",IF(G6=\"\",F6-E6,F6-E6-((+CONCATENATE(MID(G6,SEARCH(\"-\",G6,1)+1,LEN(G6)-SEARCH(\"-\",G6,1)),\":\",0)-0)-+CONCATENATE(LEFT(G6,SEARCH(\"-\",G6,1)-1),\":\",0)-0))),\"\")","v":-8.3333333333333315E-2},null,null,null,null,null,"00:00:00",{"$f":"IFERROR(IF(AND(L6=\"\",M6=\"\"),\"\",IF(INDIRECT(\"'\"&$B$2&\"'!e5\")=\"\",M6-L6,M6-L6-((+CONCATENATE(MID(INDIRECT(\"'\"&$B$2&\"'!e5\"),SEARCH(\"-\",INDIRECT(\"'\"&$B$2&\"'!e5\"),1)+1,LEN(INDIRECT(\"'\"&$B$2&\"'!e5\"))-SEARCH(\"-\",INDIRECT(\"'\"&$B$2&\"'!e5\"),1)),\":\",0)-0)-+CONCATENATE(LEFT(INDIRECT(\"'\"&$B$2&\"'!e5\"),SEARCH(\"-\",INDIRECT(\"'\"&$B$2&\"'!'Arbejdes timer'!e5\"),1)-1),\":\",0)-0))),\"\")","v":""},null,null,null,null,null,"00:00:00","",null,null,null,null,null,"00:00:00",null,null,null,null,null,null,"00:00:00"]
["","2015-06-04",{"$f":"VLOOKUP(WEEKDAY(B7,11),T!$G$1:$H$7,2)","v":"Onsdag"},"Grundlovsdag","09:00:00","18:00:00","10-14","09:00:00","05:00:00",null,null,null,null,null,"00:00:00",{"$f":"IFERROR(IF(AND(L7=\"\",M7=\"\"),\"\",IF(INDIRECT(\"'\"&$B$2&\"'!e5\")=\"\",M7-L7,M7-L7-((+CONCATENATE(MID(INDIRECT(\"'\"&$B$2&\"'!e5\"),SEARCH(\"-\",INDIRECT(\"'\"&$B$2&\"'!e5\"),1)+1,LEN(INDIRECT(\"'\"&$B$2&\"'!e5\"))-SEARCH(\"-\",INDIRECT(\"'\"&$B$2&\"'!e5\"),1)),\":\",0)-0)-+CONCATENATE(LEFT(INDIRECT(\"'\"&$B$2&\"'!e5\"),SEARCH(\"-\",INDIRECT(\"'\"&$B$2&\"'!'Arbejdes timer'!e5\"),1)-1),\":\",0)-0))),\"\")","v":""},null,null,null,null,null,"00:00:00","",null,null,null,null,null,"00:00:00",null,null,null,null,null,null,"00:00:00"]
["","2015-06-05",{"$f":"VLOOKUP(WEEKDAY(B8,11),T!$G$1:$H$7,2)","v":"Torsdag"},"","08:00:00","15:00:00","9-18","07:00:00",-8.3333333333333315E-2,null,null,null,null,null,"00:00:00",{"$f":"IFERROR(IF(AND(L8=\"\",M8=\"\"),\"\",IF(INDIRECT(\"'\"&$B$2&\"'!e5\")=\"\",M8-L8,M8-L8-((+CONCATENATE(MID(INDIRECT(\"'\"&$B$2&\"'!e5\"),SEARCH(\"-\",INDIRECT(\"'\"&$B$2&\"'!e5\"),1)+1,LEN(INDIRECT(\"'\"&$B$2&\"'!e5\"))-SEARCH(\"-\",INDIRECT(\"'\"&$B$2&\"'!e5\"),1)),\":\",0)-0)-+CONCATENATE(LEFT(INDIRECT(\"'\"&$B$2&\"'!e5\"),SEARCH(\"-\",INDIRECT(\"'\"&$B$2&\"'!'Arbejdes timer'!e5\"),1)-1),\":\",0)-0))),\"\")","v":""},null,null,null,null,null,"00:00:00","",null,null,null,null,null,"00:00:00",null,null,null,null,null,null,"00:00:00"]
["","2015-06-06",{"$f":"VLOOKUP(WEEKDAY(B9,11),T!$G$1:$H$7,2)","v":"Fredag"},"","10:00:00","16:00:00","",{"$f":"IF(AND(E9=\"\",F9=\"\"),\"\",F9-E9)","v":"06:00:00"},"06:00:00",null,null,null,null,null,"00:00:00",{"$f":"IFERROR(IF(AND(L9=\"\",M9=\"\"),\"\",IF(INDIRECT(\"'\"&$B$2&\"'!e5\")=\"\",M9-L9,M9-L9-((+CONCATENATE(MID(INDIRECT(\"'\"&$B$2&\"'!e5\"),SEARCH(\"-\",INDIRECT(\"'\"&$B$2&\"'!e5\"),1)+1,LEN(INDIRECT(\"'\"&$B$2&\"'!e5\"))-SEARCH(\"-\",INDIRECT(\"'\"&$B$2&\"'!e5\"),1)),\":\",0)-0)-+CONCATENATE(LEFT(INDIRECT(\"'\"&$B$2&\"'!e5\"),SEARCH(\"-\",INDIRECT(\"'\"&$B$2&\"'!'Arbejdes timer'!e5\"),1)-1),\":\",0)-0))),\"\")","v":""},null,null,null,null,null,"00:00:00","",null,null,null,null,null,"00:00:00",null,null,null,null,null,null,"00:00:00"]
[null," ",null,null,null,null,null,{"$f":"SUM(H3:H9)","v":2.1666666666666665},{"$f":"SUM(I3:I9)","v":0.62499999999999989},null,null,null,null,null,{"$f":"SUM(O3:O9)","v":0.9375},{"$f":"SUM(P3:P9)","v":0.1875}]
[{"$f":"IF(WEEKDAY(B11,2)=1,WEEKNUM(B11,2),\"\")","v":""},null,null,null,null,null,null,null,{"$f":"IF(AND(E11=\"\",F11=\"\"),\"\",IF(INDIRECT(\"'\"&$B$2&\"'!d12\")=\"\",F11-E11,F11-E11-((+CONCATENATE(MID(INDIRECT(\"'\"&$B$2&\"'!d12\"),SEARCH(\"-\",INDIRECT(\"'\"&$B$2&\"'!d12\"),1)+1,LEN(INDIRECT(\"'\"&$B$2&\"'!d12\"))-SEARCH(\"-\",INDIRECT(\"'\"&$B$2&\"'!d12\"),1)),\":\",0)-0)-+CONCATENATE(LEFT(INDIRECT(\"'\"&$B$2&\"'!d12\"),SEARCH(\"-\",INDIRECT(\"'\"&$B$2&\"'!d12\"),1)-1),\":\",0)-0)))","v":""}]
["",{"$f":"B9+1","v":"2015-06-07"},{"$f":"VLOOKUP(WEEKDAY(B12,11),T!$G$1:$H$7,2)","v":"Lørdag"},{"$f":"HelligdagsNavn(B12,0,0)","v":""},"08:00:00","14:00:00",{"$f":"IF(AND(E12=\"\",F12=\"\"),\"\",IF(INDEX(INDIRECT(\"'\"&$B$2&\"'!$A$2:$I$34\"),MATCH(B12,INDIRECT(\"'\"&$B$2&\"'!B2:$B$34\"),0),MATCH($H$1,INDIRECT(\"'\"&$B$2&\"'!$A$3:$I$3\"),0))=\"\",\"\",INDEX(INDIRECT(\"'\"&$B$2&\"'!$A$2:$I$34\"),MATCH(B12,INDIRECT(\"'\"&$B$2&\"'!B2:$B$34\"),0),MATCH($H$1,INDIRECT(\"'\"&$B$2&\"'!$A$3:$I$3\"),0))))","v":""},{"$f":"IF(AND(E12=\"\",F12=\"\"),\"\",F12-E12)","v":"06:00:00"},{"$f":"IFERROR(IF(AND(E12=\"\",F12=\"\"),\"\",IF(G12=\"\",F12-E12,F12-E12-((+CONCATENATE(MID(G12,SEARCH(\"-\",G12,1)+1,LEN(G12)-SEARCH(\"-\",G12,1)),\":\",0)-0)-+CONCATENATE(LEFT(G12,SEARCH(\"-\",G12,1)-1),\":\",0)-0))),\"\")","v":"06:00:00"}]
["",{"$f":"B12+1","v":"2015-06-08"},{"$f":"VLOOKUP(WEEKDAY(B13,11),T!$G$1:$H$7,2)","v":"Søndag"},"Pinsedag",null,null,{"$f":"IF(AND(E13=\"\",F13=\"\"),\"\",IF(INDEX(INDIRECT(\"'\"&$B$2&\"'!$A$2:$I$34\"),MATCH(B13,INDIRECT(\"'\"&$B$2&\"'!B2:$B$34\"),0),MATCH($H$1,INDIRECT(\"'\"&$B$2&\"'!$A$3:$I$3\"),0))=\"\",\"\",INDEX(INDIRECT(\"'\"&$B$2&\"'!$A$2:$I$34\"),MATCH(B13,INDIRECT(\"'\"&$B$2&\"'!B2:$B$34\"),0),MATCH($H$1,INDIRECT(\"'\"&$B$2&\"'!$A$3:$I$3\"),0))))","v":""},"",""]
[24,{"$f":"B13+1","v":"2015-06-09"},{"$f":"VLOOKUP(WEEKDAY(B14,11),T!$G$1:$H$7,2)","v":"Mandag"},"2. Pinsedag","09:00:00","16:00:00",{"$f":"IF(AND(E14=\"\",F14=\"\"),\"\",IF(INDEX(INDIRECT(\"'\"&$B$2&\"'!$A$2:$I$34\"),MATCH(B14,INDIRECT(\"'\"&$B$2&\"'!B2:$B$34\"),0),MATCH($H$1,INDIRECT(\"'\"&$B$2&\"'!$A$3:$I$3\"),0))=\"\",\"\",INDEX(INDIRECT(\"'\"&$B$2&\"'!$A$2:$I$34\"),MATCH(B14,INDIRECT(\"'\"&$B$2&\"'!B2:$B$34\"),0),MATCH($H$1,INDIRECT(\"'\"&$B$2&\"'!$A$3:$I$3\"),0))))","v":"9-18"},{"$f":"IF(AND(E14=\"\",F14=\"\"),\"\",F14-E14)","v":"07:00:00"},-8.333333333333337E-2]
["","2015-06-10",{"$f":"VLOOKUP(WEEKDAY(B15,11),T!$G$1:$H$7,2)","v":"Tirsdag"},"3. Pinsedag",null,null,{"$f":"IF(AND(E15=\"\",F15=\"\"),\"\",IF(INDEX(INDIRECT(\"'\"&$B$2&\"'!$A$2:$I$34\"),MATCH(B15,INDIRECT(\"'\"&$B$2&\"'!B2:$B$34\"),0),MATCH($H$1,INDIRECT(\"'\"&$B$2&\"'!$A$3:$I$3\"),0))=\"\",\"\",INDEX(INDIRECT(\"'\"&$B$2&\"'!$A$2:$I$34\"),MATCH(B15,INDIRECT(\"'\"&$B$2&\"'!B2:$B$34\"),0),MATCH($H$1,INDIRECT(\"'\"&$B$2&\"'!$A$3:$I$3\"),0))))","v":""},{"$f":"IF(AND(E15=\"\",F15=\"\"),\"\",F15-E15)","v":""},""]
["","2015-06-11",{"$f":"VLOOKUP(WEEKDAY(B16,11),T!$G$1:$H$7,2)","v":"Onsdag"},"",null,null,"",{"$f":"IF(AND(E16=\"\",F16=\"\"),\"\",F16-E16)","v":""},""]
["","2015-06-12",{"$f":"VLOOKUP(WEEKDAY(B17,11),T!$G$1:$H$7,2)","v":"Torsdag"},"",null,null,"","",""]
["",{"$f":"B17+1","v":"2015-06-13"},{"$f":"VLOOKUP(WEEKDAY(B18,11),T!$G$1:$H$7,2)","v":"Fredag"},"",null,null,"","",""]
[null," ",null,null,null,null,null,{"$f":"SUM(H12:H18)","v":0.54166666666666674},{"$f":"SUM(I12:I18)","v":0.16666666666666669}]
[null," "]
[{"$f":"IF(WEEKDAY(B21,2)=1,WEEKNUM(B21,2),\"\")","v":""},{"$f":"B18+1","v":"2015-06-14"},{"$f":"VLOOKUP(WEEKDAY(B21,11),T!$G$1:$H$7,2)","v":"Lørdag"},{"$f":"HelligdagsNavn(B21,0,0)","v":""},"09:00:00","19:00:00",{"$f":"IF(AND(E21=\"\",F21=\"\"),\"\",IF(INDEX(INDIRECT(\"'\"&$B$2&\"'!$A$2:$I$34\"),MATCH(B21,INDIRECT(\"'\"&$B$2&\"'!B2:$B$34\"),0),MATCH($H$1,INDIRECT(\"'\"&$B$2&\"'!$A$3:$I$3\"),0))=\"\",\"\",INDEX(INDIRECT(\"'\"&$B$2&\"'!$A$2:$I$34\"),MATCH(B21,INDIRECT(\"'\"&$B$2&\"'!B2:$B$34\"),0),MATCH($H$1,INDIRECT(\"'\"&$B$2&\"'!$A$3:$I$3\"),0))))","v":"9-18"},{"$f":"IF(AND(E21=\"\",F21=\"\"),\"\",F21-E21)","v":"10:00:00"},{"$f":"IFERROR(IF(AND(E21=\"\",F21=\"\"),\"\",IF(G21=\"\",F21-E21,F21-E21-((+CONCATENATE(MID(G21,SEARCH(\"-\",G21,1)+1,LEN(G21)-SEARCH(\"-\",G21,1)),\":\",0)-0)-+CONCATENATE(LEFT(G21,SEARCH(\"-\",G21,1)-1),\":\",0)-0))),\"\")","v":"01:00:00"}]
["",{"$f":"B21+1","v":"2015-06-15"},{"$f":"VLOOKUP(WEEKDAY(B22,11),T!$G$1:$H$7,2)","v":"Søndag"},"",null,null,"","",""]
[25,{"$f":"B22+1","v":"2015-06-16"},{"$f":"VLOOKUP(WEEKDAY(B23,11),T!$G$1:$H$7,2)","v":"Mandag"},"",null,null,"","",""]
["","2015-06-17",{"$f":"VLOOKUP(WEEKDAY(B24,11),T!$G$1:$H$7,2)","v":"Tirsdag"},"",null,null,"","",""]
["","2015-06-18",{"$f":"VLOOKUP(WEEKDAY(B25,11),T!$G$1:$H$7,2)","v":"Onsdag"},"",null,null,"","",""]
["","2015-06-19",{"$f":"VLOOKUP(WEEKDAY(B26,11),T!$G$1:$H$7,2)","v":"Torsdag"},"",null,null,"","",""]
["","2015-06-20",{"$f":"VLOOKUP(WEEKDAY(B27,11),T!$G$1:$H$7,2)","v":"Fredag"},"",null,null,"","",""]
[""]
[""]
["",{"$f":"B27+1","v":"2015-06-21"},{"$f":"VLOOKUP(WEEKDAY(B30,11),T!$G$1:$H$7,2)","v":"Lørdag"},{"$f":"HelligdagsNavn(B30,0,0)","v":""},null,null,{"$f":"IF(AND(E30=\"\",F30=\"\"),\"\",IF(INDEX(INDIRECT(\"'\"&$B$2&\"'!$A$2:$I$34\"),MATCH(B30,INDIRECT(\"'\"&$B$2&\"'!B2:$B$34\"),0),MATCH($H$1,INDIRECT(\"'\"&$B$2&\"'!$A$3:$I$3\"),0))=\"\",\"\",INDEX(INDIRECT(\"'\"&$B$2&\"'!$A$2:$I$34\"),MATCH(B30,INDIRECT(\"'\"&$B$2&\"'!B2:$B$34\"),0),MATCH($H$1,INDIRECT(\"'\"&$B$2&\"'!$A$3:$I$3\"),0))))","v":""},{"$f":"IF(AND(E30=\"\",F30=\"\"),\"\",F30-E30)","v":""},{"$f":"IFERROR(IF(AND(E30=\"\",F30=\"\"),\"\",IF(G30=\"\",F30-E30,F30-E30-((+CONCATENATE(MID(G30,SEARCH(\"-\",G30,1)+1,LEN(G30)-SEARCH(\"-\",G30,1)),\":\",0)-0)-+CONCATENATE(LEFT(G30,SEARCH(\"-\",G30,1)-1),\":\",0)-0))),\"\")","v":""}]
["",{"$f":"B30+1","v":"2015-06-22"},{"$f":"VLOOKUP(WEEKDAY(B31,11),T!$G$1:$H$7,2)","v":"Søndag"},"Sankt Hansaften",null,null,"","",""]
[26,"2015-06-23",{"$f":"VLOOKUP(WEEKDAY(B32,11),T!$G$1:$H$7,2)","v":"Mandag"},"Sankt Hansdag",null,null,"","",""]
["","2015-06-24",{"$f":"VLOOKUP(WEEKDAY(B33,11),T!$G$1:$H$7,2)","v":"Tirsdag"},"",null,null,"","",""]
["","2015-06-25",{"$f":"VLOOKUP(WEEKDAY(B34,11),T!$G$1:$H$7,2)","v":"Onsdag"},"",null,null,"","",""]
["","2015-06-26",{"$f":"VLOOKUP(WEEKDAY(B35,11),T!$G$1:$H$7,2)","v":"Torsdag"},"",null,null,"","",""]
["","2015-06-27",{"$f":"VLOOKUP(WEEKDAY(B36,11),T!$G$1:$H$7,2)","v":"Fredag"},"",null,null,"","",""]
[null," "]
[null," "]
[{"$f":"IFERROR(IF(WEEKDAY(B39,2)=1,WEEKNUM(B39,2),\"\"),\"\")","v":""},{"$f":"IF(MONTH(B36+1)>MONTH(B36),\"\",B36+1)","v":"2015-06-28"},{"$f":"IFERROR(VLOOKUP(WEEKDAY(B39,11),T!$G$1:$H$7,2),\"\")","v":"Lørdag"},{"$f":"IFERROR(HelligdagsNavn(B39,0,0),\"\")","v":""},null,null,{"$f":"IF(AND(E39=\"\",F39=\"\"),\"\",IF(INDEX(INDIRECT(\"'\"&$B$2&\"'!$A$2:$I$34\"),MATCH(B39,INDIRECT(\"'\"&$B$2&\"'!B2:$B$34\"),0),MATCH($H$1,INDIRECT(\"'\"&$B$2&\"'!$A$3:$I$3\"),0))=\"\",\"\",INDEX(INDIRECT(\"'\"&$B$2&\"'!$A$2:$I$34\"),MATCH(B39,INDIRECT(\"'\"&$B$2&\"'!B2:$B$34\"),0),MATCH($H$1,INDIRECT(\"'\"&$B$2&\"'!$A$3:$I$3\"),0))))","v":""},{"$f":"IF(AND(E39=\"\",F39=\"\"),\"\",F39-E39)","v":""},{"$f":"IFERROR(IF(AND(E39=\"\",F39=\"\"),\"\",IF(G39=\"\",F39-E39,F39-E39-((+CONCATENATE(MID(G39,SEARCH(\"-\",G39,1)+1,LEN(G39)-SEARCH(\"-\",G39,1)),\":\",0)-0)-+CONCATENATE(LEFT(G39,SEARCH(\"-\",G39,1)-1),\":\",0)-0))),\"\")","v":""}]
[{"$f":"IFERROR(IF(WEEKDAY(B40,2)=1,WEEKNUM(B40,2),\"\"),\"\")","v":""},{"$f":"IFERROR(IF(MONTH(B39+1)>MONTH(B39),\"\",B39+1),\"\")","v":"2015-06-29"},{"$f":"IFERROR(VLOOKUP(WEEKDAY(B40,11),T!$G$1:$H$7,2),\"\")","v":"Søndag"},{"$f":"IFERROR(HelligdagsNavn(B40,0,0),\"\")","v":""},null,null,"","",""]
["",{"$f":"IFERROR(IF(MONTH(B40+1)>MONTH(B40),\"\",B40+1),\"\")","v":""},{"$f":"IFERROR(VLOOKUP(WEEKDAY(B41,11),T!$G$1:$H$7,2),\"\")","v":""},"",null,null,"","",""]
[]
[]
[]
[null,{"$f":"INDEX(Januar!$A$2:$I$34,MATCH(B5,Januar!$B$2:$B$34,0),MATCH($H$1,Januar!$A$3:$I$3,0))","v":{"$error":"#N/A"}},null,null,null,null,"G kolonnen kan skjules"]

{"sheet":"Januar","index":1,"n_rows":37,"n_cols":13,"rows_kept":37,"cut":false,"hidden":false,"merged":[[1,4,1,8]]}
[null,1]
[null,4,null,"Helligdage","Vagtskema",null,null,null,null,"Nina","2014-12-31"]
["Uge",{"$f":"VLOOKUP(B1,T!C1:D12,2,0)","v":"Januar"},{"$f":"'Arbejdes timer'!C2","v":2019},null,"Jacob","Nina","René","Kirsten","Erik",null,null,null,"René"]
[{"$f":"IF(WEEKDAY(B4,2)=1,WEEKNUM(B4,2),\"\")","v":""},{"$f":"DATE(C3,B1,1)","v":"2014-12-31"},{"$f":"VLOOKUP(WEEKDAY(B4,11),T!$G$1:$H$7,2)","v":"Tirsdag"},{"$f":"HelligdagsNavn(B4,0,0)","v":"Nytårsdag"},null,"9-18","9-16:30","9-16","9-17"]
[{"$f":"IF(WEEKDAY(B5,2)=1,WEEKNUM(B5,2),\"\")","v":""},{"$f":"B4+1","v":"2015-01-01"},{"$f":"VLOOKUP(WEEKDAY(B5,11),T!$G$1:$H$7,2)","v":"Onsdag"},{"$f":"HelligdagsNavn(B5,0,0)","v":""},"9-18",null,"9-16:30","8-14","9-17"]
["",{"$f":"B5+1","v":"2015-01-02"},{"$f":"VLOOKUP(WEEKDAY(B6,11),T!$G$1:$H$7,2)","v":"Torsdag"},"","9-18",null,"9-16:30","8-14","9-17"]
["","2015-01-03",{"$f":"VLOOKUP(WEEKDAY(B7,11),T!$G$1:$H$7,2)","v":"Fredag"},"",null,"9-18","9-16:30","8-14","9-17"]
["","2015-01-04",{"$f":"VLOOKUP(WEEKDAY(B8,11),T!$G$1:$H$7,2)","v":"Lørdag"},"","9-18","9-18","9-16:30","8-14","9-17"]
["","2015-01-05",{"$f":"VLOOKUP(WEEKDAY(B9,11),T!$G$1:$H$7,2)","v":"Søndag"},"Helligtrekongersdag","9-15"]
[2,"2015-01-06",{"$f":"VLOOKUP(WEEKDAY(B10,11),T!$G$1:$H$7,2)","v":"Mandag"},"","10-14"]
["",{"$f":"B10+1","v":"2015-01-07"},{"$f":"VLOOKUP(WEEKDAY(B11,11),T!$G$1:$H$7,2)","v":"Tirsdag"},"","9-18",null,"9-16:30","9-16","9-17"]
["",{"$f":"B11+1","v":"2015-01-08"},{"$f":"VLOOKUP(WEEKDAY(B12,11),T!$G$1:$H$7,2)","v":"Onsdag"},"",null,"9-18","9-16:30","9-14","9-17"]
["","2015-01-09",{"$f":"VLOOKUP(WEEKDAY(B13,11),T!$G$1:$H$7,2)","v":"Torsdag"},"",null,"9-18","9-16:30","9-14","9-17"]
["","2015-01-10",{"$f":"VLOOKUP(WEEKDAY(B14,11),T!$G$1:$H$7,2)","v":"Fredag"},"","9-18",null,"9-16:30","9-14","9-17"]
["","2015-01-11",{"$f":"VLOOKUP(WEEKDAY(B15,11),T!$G$1:$H$7,2)","v":"Lørdag"},"","9-18","9-18","9-16:30","9-14","9-17"]
["","2015-01-12",{"$f":"VLOOKUP(WEEKDAY(B16,11),T!$G$1:$H$7,2)","v":"Søndag"},"",null,"9-15"]
[3,"2015-01-13",{"$f":"VLOOKUP(WEEKDAY(B17,11),T!$G$1:$H$7,2)","v":"Mandag"},"",null,"10-14"]
["",{"$f":"B17+1","v":"2015-01-14"},{"$f":"VLOOKUP(WEEKDAY(B18,11),T!$G$1:$H$7,2)","v":"Tirsdag"},"",null,"9-18","9-16:30","9-16","9-17"]
["",{"$f":"B18+1","v":"2015-01-15"},{"$f":"VLOOKUP(WEEKDAY(B19,11),T!$G$1:$H$7,2)","v":"Onsdag"},"","9-18",null,"9-16:30","8-14","9-17"]
["","2015-01-16",{"$f":"VLOOKUP(WEEKDAY(B20,11),T!$G$1:$H$7,2)","v":"Torsdag"},"","9-18",null,"9-16:30","8-14","9-17"]
["","2015-01-17",{"$f":"VLOOKUP(WEEKDAY(B21,11),T!$G$1:$H$7,2)","v":"Fredag"},"",null,"9-18","OFF","OFF","OFF"]
["","2015-01-18",{"$f":"VLOOKUP(WEEKDAY(B22,11),T!$G$1:$H$7,2)","v":"Lørdag"},"","9-18","9-18","OFF","OFF","OFF"]
["","2015-01-19",{"$f":"VLOOKUP(WEEKDAY(B23,11),T!$G$1:$H$7,2)","v":"Søndag"},"","9-15"]
[4,"2015-01-20",{"$f":"VLOOKUP(WEEKDAY(B24,11),T!$G$1:$H$7,2)","v":"Mandag"},"","10-14"]
["",{"$f":"B24+1","v":"2015-01-21"},{"$f":"VLOOKUP(WEEKDAY(B25,11),T!$G$1:$H$7,2)","v":"Tirsdag"},"","9-18",null,"OFF","OFF","OFF"]
["",{"$f":"B25+1","v":"2015-01-22"},{"$f":"VLOOKUP(WEEKDAY(B26,11),T!$G$1:$H$7,2)","v":"Onsdag"},"",null,"9-18","9-16:30","9-14","9-17"]
["","2015-01-23",{"$f":"VLOOKUP(WEEKDAY(B27,11),T!$G$1:$H$7,2)","v":"Torsdag"},"",null,"9-18","9-16:30","9-14","9-17"]
["","2015-01-24",{"$f":"VLOOKUP(WEEKDAY(B28,11),T!$G$1:$H$7,2)","v":"Fredag"},"","9-18",null,"9-16:30","9-14","9-17"]
["","2015-01-25",{"$f":"VLOOKUP(WEEKDAY(B29,11),T!$G$1:$H$7,2)","v":"Lørdag"},"","9-18","9-18","9-16:30","9-14","9-17"]
["","2015-01-26",{"$f":"VLOOKUP(WEEKDAY(B30,11),T!$G$1:$H$7,2)","v":"Søndag"},"",null,"9-15"]
[5,"2015-01-27",{"$f":"VLOOKUP(WEEKDAY(B31,11),T!$G$1:$H$7,2)","v":"Mandag"},"",null,"10-14"]
["",{"$f":"B31+1","v":"2015-01-28"},{"$f":"VLOOKUP(WEEKDAY(B32,11),T!$G$1:$H$7,2)","v":"Tirsdag"},"",null,"9-18","9-16:30","9-16","9-17"]
["",{"$f":"B32+1","v":"2015-01-29"},{"$f":"VLOOKUP(WEEKDAY(B33,11),T!$G$1:$H$7,2)","v":"Onsdag"},"","9-18",null,"9-16:30","8-14","9-17"]
["","2015-01-30",{"$f":"VLOOKUP(WEEKDAY(B34,11),T!$G$1:$H$7,2)","v":"Torsdag"},"","9-18","9-18","9-16:30","8-14","9-17"]
[]
[]
[null,null,{"$f":"INDEX($A$2:$I$34,MATCH(K2,$B$2:$B$34,0),MATCH(J2,$A$3:$I$3,0))","v":"9-18"}]

{"sheet":"Februar","index":2,"n_rows":34,"n_cols":10,"rows_kept":34,"cut":false,"hidden":false,"merged":[[1,4,1,8]]}
[null,2]
[null,4,null,"Helligdage","Vagtskema"]
["Uge",{"$f":"VLOOKUP(B1,T!C1:D12,2,0)","v":"Februar"},{"$f":"'Arbejdes timer'!C2","v":2019},null,"Jacob","Nina","René","Kirsten","Erik"]
[{"$f":"IF(WEEKDAY(B4,2)=1,WEEKNUM(B4,2),\"\")","v":""},{"$f":"DATE(C3,B1,1)","v":"2015-01-31"},{"$f":"VLOOKUP(WEEKDAY(B4,11),T!$G$1:$H$7,2)","v":"Fredag"},{"$f":"HelligdagsNavn(B4,0,0)","v":""},null,"9-18","9-16:30","9-16","9-17"]
[{"$f":"IF(WEEKDAY(B5,2)=1,WEEKNUM(B5,2),\"\")","v":""},{"$f":"B4+1","v":"2015-02-01"},{"$f":"VLOOKUP(WEEKDAY(B5,11),T!$G$1:$H$7,2)","v":"Lørdag"},{"$f":"HelligdagsNavn(B5,0,0)","v":"Maria Renselsesdag"},"9-18",null,"9-16:30","8-14","9-17"]
["",{"$f":"B5+1","v":"2015-02-02"},{"$f":"VLOOKUP(WEEKDAY(B6,11),T!$G$1:$H$7,2)","v":"Søndag"},"","9-18",null,"9-16:30","8-14","9-17"]
[6,"2015-02-03",{"$f":"VLOOKUP(WEEKDAY(B7,11),T!$G$1:$H$7,2)","v":"Mandag"},"",null,"9-18","9-16:30","8-14","9-17"]
["","2015-02-04",{"$f":"VLOOKUP(WEEKDAY(B8,11),T!$G$1:$H$7,2)","v":"Tirsdag"},"","9-18","9-18","9-16:30","8-14","9-17"]
["","2015-02-05",{"$f":"VLOOKUP(WEEKDAY(B9,11),T!$G$1:$H$7,2)","v":"Onsdag"},"","9-15"]
["","2015-02-06",{"$f":"VLOOKUP(WEEKDAY(B10,11),T!$G$1:$H$7,2)","v":"Torsdag"},"","10-14"]
["",{"$f":"B10+1","v":"2015-02-07"},{"$f":"VLOOKUP(WEEKDAY(B11,11),T!$G$1:$H$7,2)","v":"Fredag"},"","9-18",null,"9-16:30","9-16","9-17"]
["",{"$f":"B11+1","v":"2015-02-08"},{"$f":"VLOOKUP(WEEKDAY(B12,11),T!$G$1:$H$7,2)","v":"Lørdag"},"",null,"9-18","9-16:30","9-14","9-17"]
["","2015-02-09",{"$f":"VLOOKUP(WEEKDAY(B13,11),T!$G$1:$H$7,2)","v":"Søndag"},"",null,"9-18","9-16:30","9-14","9-17"]
[7,"2015-02-10",{"$f":"VLOOKUP(WEEKDAY(B14,11),T!$G$1:$H$7,2)","v":"Mandag"},"","9-18",null,"9-16:30","9-14","9-17"]
["","2015-02-11",{"$f":"VLOOKUP(WEEKDAY(B15,11),T!$G$1:$H$7,2)","v":"Tirsdag"},"","9-18","9-18","9-16:30","9-14","9-17"]
["","2015-02-12",{"$f":"VLOOKUP(WEEKDAY(B16,11),T!$G$1:$H$7,2)","v":"Onsdag"},"",null,"9-15"]
["","2015-02-13",{"$f":"VLOOKUP(WEEKDAY(B17,11),T!$G$1:$H$7,2)","v":"Torsdag"},"",null,"10-14"]
["",{"$f":"B17+1","v":"2015-02-14"},{"$f":"VLOOKUP(WEEKDAY(B18,11),T!$G$1:$H$7,2)","v":"Fredag"},"",null,"9-18","9-16:30","9-16","9-17"]
["",{"$f":"B18+1","v":"2015-02-15"},{"$f":"VLOOKUP(WEEKDAY(B19,11),T!$G$1:$H$7,2)","v":"Lørdag"},"","9-18",null,"9-16:30","8-14","9-17"]
["","2015-02-16",{"$f":"VLOOKUP(WEEKDAY(B20,11),T!$G$1:$H$7,2)","v":"Søndag"},"","9-18",null,"9-16:30","8-14","9-17"]
[8,"2015-02-17",{"$f":"VLOOKUP(WEEKDAY(B21,11),T!$G$1:$H$7,2)","v":"Mandag"},"",null,"9-18","OFF","OFF","OFF"]
["","2015-02-18",{"$f":"VLOOKUP(WEEKDAY(B22,11),T!$G$1:$H$7,2)","v":"Tirsdag"},"","9-18","9-18","OFF","OFF","OFF"]
["","2015-02-19",{"$f":"VLOOKUP(WEEKDAY(B23,11),T!$G$1:$H$7,2)","v":"Onsdag"},"","9-15"]
["","2015-02-20",{"$f":"VLOOKUP(WEEKDAY(B24,11),T!$G$1:$H$7,2)","v":"Torsdag"},"","10-14"]
["",{"$f":"B24+1","v":"2015-02-21"},{"$f":"VLOOKUP(WEEKDAY(B25,11),T!$G$1:$H$7,2)","v":"Fredag"},"","9-18",null,"OFF","OFF","OFF"]
["",{"$f":"B25+1","v":"2015-02-22"},{"$f":"VLOOKUP(WEEKDAY(B26,11),T!$G$1:$H$7,2)","v":"Lørdag"},"",null,"9-18","9-16:30","9-14","9-17"]
["","2015-02-23",{"$f":"VLOOKUP(WEEKDAY(B27,11),T!$G$1:$H$7,2)","v":"Søndag"},"",null,"9-18","9-16:30","9-14","9-17"]
[9,"2015-02-24",{"$f":"VLOOKUP(WEEKDAY(B28,11),T!$G$1:$H$7,2)","v":"Mandag"},"","9-18",null,"9-16:30","9-14","9-17"]
["","2015-02-25",{"$f":"VLOOKUP(WEEKDAY(B29,11),T!$G$1:$H$7,2)","v":"Tirsdag"},"","9-18","9-18","9-16:30","9-14","9-17"]
["","2015-02-26",{"$f":"VLOOKUP(WEEKDAY(B30,11),T!$G$1:$H$7,2)","v":"Onsdag"},"",null,"9-15"]
["","2015-02-27",{"$f":"VLOOKUP(WEEKDAY(B31,11),T!$G$1:$H$7,2)","v":"Torsdag"},"",null,"10-14"]
[{"$f":"IFERROR(IF(WEEKDAY(B32,2)=1,WEEKNUM(B32,2),\"\"),\"\")","v":""},{"$f":"IF(MONTH(B31+1)>MONTH(B31),\"\",B31+1)","v":""},{"$f":"IFERROR(VLOOKUP(WEEKDAY(B32,11),T!$G$1:$H$7,2),\"\")","v":""},{"$f":"IF(B32=\"\",\"\",HelligdagsNavn(B32,0,0))","v":""}]
[{"$f":"IFERROR(IF(WEEKDAY(B33,2)=1,WEEKNUM(B33,2),\"\"),\"\")","v":""},{"$f":"IFERROR(IF(MONTH(B32+1)>MONTH(B32),\"\",B32+1),\"\")","v":""},{"$f":"IFERROR(VLOOKUP(WEEKDAY(B33,11),T!$G$1:$H$7,2),\"\")","v":""},{"$f":"IFERROR(VLOOKUP(WEEKDAY(C33,11),T!$G$1:$H$7,2),\"\")","v":""},{"$f":"IFERROR(VLOOKUP(WEEKDAY(D33,11),T!$G$1:$H$7,2),\"\")","v":""},{"$f":"IFERROR(VLOOKUP(WEEKDAY(E33,11),T!$G$1:$H$7,2),\"\")","v":""},{"$f":"IFERROR(VLOOKUP(WEEKDAY(F33,11),T!$G$1:$H$7,2),\"\")","v":""},{"$f":"IFERROR(VLOOKUP(WEEKDAY(G33,11),T!$G$1:$H$7,2),\"\")","v":""},{"$f":"IFERROR(VLOOKUP(WEEKDAY(H33,11),T!$G$1:$H$7,2),\"\")","v":""},{"$f":"IFERROR(VLOOKUP(WEEKDAY(I33,11),T!$G$1:$H$7,2),\"\")","v":""}]
["",{"$f":"IFERROR(IF(MONTH(B33+1)>MONTH(B33),\"\",B33+1),\"\")","v":""},{"$f":"IFERROR(VLOOKUP(WEEKDAY(B34,11),T!$G$1:$H$7,2),\"\")","v":""},{"$f":"IFERROR(VLOOKUP(WEEKDAY(C34,11),T!$G$1:$H$7,2),\"\")","v":""},{"$f":"IFERROR(VLOOKUP(WEEKDAY(D34,11),T!$G$1:$H$7,2),\"\")","v":""},{"$f":"IFERROR(VLOOKUP(WEEKDAY(E34,11),T!$G$1:$H$7,2),\"\")","v":""},{"$f":"IFERROR(VLOOKUP(WEEKDAY(F34,11),T!$G$1:$H$7,2),\"\")","v":""},{"$f":"IFERROR(VLOOKUP(WEEKDAY(G34,11),T!$G$1:$H$7,2),\"\")","v":""},{"$f":"IFERROR(VLOOKUP(WEEKDAY(H34,11),T!$G$1:$H$7,2),\"\")","v":""},{"$f":"IFERROR(VLOOKUP(WEEKDAY(I34,11),T!$G$1:$H$7,2),\"\")","v":""}]

{"sheet":"Marts","index":3,"n_rows":35,"n_cols":9,"rows_kept":35,"cut":false,"hidden":false,"merged":[[1,4,1,8]]}
[null,3]
[null,4,null,"Helligdage","Vagtskema"]
["Uge",{"$f":"VLOOKUP(B1,T!C1:D12,2,0)","v":"Marts"},{"$f":"'Arbejdes timer'!C2","v":2019},null,"Jacob","Nina","René","Kirsten","Erik"]
[]
[{"$f":"IF(WEEKDAY(B5,2)=1,WEEKNUM(B5,2),\"\")","v":""},{"$f":"DATE(C3,B1,1)","v":"2015-02-28"},{"$f":"VLOOKUP(WEEKDAY(B5,11),T!$G$1:$H$7,2)","v":"Fredag"},{"$f":"HelligdagsNavn(B5,0,0)","v":""},null,"9-18","9-16:30","9-16","9-17"]
[{"$f":"IF(WEEKDAY(B6,2)=1,WEEKNUM(B6,2),\"\")","v":""},{"$f":"B5+1","v":"2015-03-01"},{"$f":"VLOOKUP(WEEKDAY(B6,11),T!$G$1:$H$7,2)","v":"Lørdag"},{"$f":"HelligdagsNavn(B6,0,0)","v":""},"9-18",null,"9-16:30","8-14","9-17"]
["",{"$f":"B6+1","v":"2015-03-02"},{"$f":"VLOOKUP(WEEKDAY(B7,11),T!$G$1:$H$7,2)","v":"Søndag"},"Fastelavn","9-18",null,"9-16:30","8-14","9-17"]
[10,"2015-03-03",{"$f":"VLOOKUP(WEEKDAY(B8,11),T!$G$1:$H$7,2)","v":"Mandag"},"",null,"9-18","9-16:30","8-14","9-17"]
["","2015-03-04",{"$f":"VLOOKUP(WEEKDAY(B9,11),T!$G$1:$H$7,2)","v":"Tirsdag"},"","9-18","9-18","9-16:30","8-14","9-17"]
["","2015-03-05",{"$f":"VLOOKUP(WEEKDAY(B10,11),T!$G$1:$H$7,2)","v":"Onsdag"},"","9-15"]
["","2015-03-06",{"$f":"VLOOKUP(WEEKDAY(B11,11),T!$G$1:$H$7,2)","v":"Torsdag"},"","10-14"]
["",{"$f":"B11+1","v":"2015-03-07"},{"$f":"VLOOKUP(WEEKDAY(B12,11),T!$G$1:$H$7,2)","v":"Fredag"},"","9-18",null,"9-16:30","9-16","9-17"]
["",{"$f":"B12+1","v":"2015-03-08"},{"$f":"VLOOKUP(WEEKDAY(B13,11),T!$G$1:$H$7,2)","v":"Lørdag"},"",null,"9-18","9-16:30","9-14","9-17"]
["","2015-03-09",{"$f":"VLOOKUP(WEEKDAY(B14,11),T!$G$1:$H$7,2)","v":"Søndag"},"",null,"9-18","9-16:30","9-14","9-17"]
[11,"2015-03-10",{"$f":"VLOOKUP(WEEKDAY(B15,11),T!$G$1:$H$7,2)","v":"Mandag"},"","9-18",null,"9-16:30","9-14","9-17"]
["","2015-03-11",{"$f":"VLOOKUP(WEEKDAY(B16,11),T!$G$1:$H$7,2)","v":"Tirsdag"},"","9-18","9-18","9-16:30","9-14","9-17"]
["","2015-03-12",{"$f":"VLOOKUP(WEEKDAY(B17,11),T!$G$1:$H$7,2)","v":"Onsdag"},"",null,"9-15"]
["","2015-03-13",{"$f":"VLOOKUP(WEEKDAY(B18,11),T!$G$1:$H$7,2)","v":"Torsdag"},"",null,"10-14"]
["",{"$f":"B18+1","v":"2015-03-14"},{"$f":"VLOOKUP(WEEKDAY(B19,11),T!$G$1:$H$7,2)","v":"Fredag"},"",null,"9-18","9-16:30","9-16","9-17"]
["",{"$f":"B19+1","v":"2015-03-15"},{"$f":"VLOOKUP(WEEKDAY(B20,11),T!$G$1:$H$7,2)","v":"Lørdag"},"","9-18",null,"9-16:30","8-14","9-17"]
["","2015-03-16",{"$f":"VLOOKUP(WEEKDAY(B21,11),T!$G$1:$H$7,2)","v":"Søndag"},"","9-18",null,"9-16:30","8-14","9-17"]
[12,"2015-03-17",{"$f":"VLOOKUP(WEEKDAY(B22,11),T!$G$1:$H$7,2)","v":"Mandag"},"",null,"9-18","OFF","OFF","OFF"]
["","2015-03-18",{"$f":"VLOOKUP(WEEKDAY(B23,11),T!$G$1:$H$7,2)","v":"Tirsdag"},"","9-18","9-18","OFF","OFF","OFF"]
["","2015-03-19",{"$f":"VLOOKUP(WEEKDAY(B24,11),T!$G$1:$H$7,2)","v":"Onsdag"},"","9-15"]
["","2015-03-20",{"$f":"VLOOKUP(WEEKDAY(B25,11),T!$G$1:$H$7,2)","v":"Torsdag"},"","10-14"]
["",{"$f":"B25+1","v":"2015-03-21"},{"$f":"VLOOKUP(WEEKDAY(B26,11),T!$G$1:$H$7,2)","v":"Fredag"},"","9-18",null,"OFF","OFF","OFF"]
["",{"$f":"B26+1","v":"2015-03-22"},{"$f":"VLOOKUP(WEEKDAY(B27,11),T!$G$1:$H$7,2)","v":"Lørdag"},"",null,"9-18","9-16:30","9-14","9-17"]
["","2015-03-23",{"$f":"VLOOKUP(WEEKDAY(B28,11),T!$G$1:$H$7,2)","v":"Søndag"},"",null,"9-18","9-16:30","9-14","9-17"]
[13,"2015-03-24",{"$f":"VLOOKUP(WEEKDAY(B29,11),T!$G$1:$H$7,2)","v":"Mandag"},"Maria Bebudelsesdag","9-18",null,"9-16:30","9-14","9-17"]
["","2015-03-25",{"$f":"VLOOKUP(WEEKDAY(B30,11),T!$G$1:$H$7,2)","v":"Tirsdag"},"","9-18","9-18","9-16:30","9-14","9-17"]
["","2015-03-26",{"$f":"VLOOKUP(WEEKDAY(B31,11),T!$G$1:$H$7,2)","v":"Onsdag"},"",null,"9-15"]
["","2015-03-27",{"$f":"VLOOKUP(WEEKDAY(B32,11),T!$G$1:$H$7,2)","v":"Torsdag"},"",null,"10-14"]
["",{"$f":"B32+1","v":"2015-03-28"},{"$f":"VLOOKUP(WEEKDAY(B33,11),T!$G$1:$H$7,2)","v":"Fredag"},"",null,"9-18","9-16:30","9-16","9-17"]
["",{"$f":"B33+1","v":"2015-03-29"},{"$f":"VLOOKUP(WEEKDAY(B34,11),T!$G$1:$H$7,2)","v":"Lørdag"},"","9-18",null,"9-16:30","8-14","9-17"]
["","2015-03-30",{"$f":"VLOOKUP(WEEKDAY(B35,11),T!$G$1:$H$7,2)","v":"Søndag"},"Sommertid Start"]

{"sheet":"April","index":4,"n_rows":35,"n_cols":9,"rows_kept":35,"cut":false,"hidden":false,"merged":[[1,4,1,8]]}
[null,4]
[null,4,null,"Helligdage","Vagtskema"]
["Uge","APRIL",{"$f":"'Arbejdes timer'!C2","v":2019},null,"Jacob","Nina","René","Kirsten","Erik"]
[]
[{"$f":"IF(WEEKDAY(B5,2)=1,WEEKNUM(B5,2),\"\")","v":14},{"$f":"DATE(C3,B1,1)","v":"2015-03-31"},{"$f":"VLOOKUP(WEEKDAY(B5,11),T!$G$1:$H$7,2)","v":"Mandag"},{"$f":"HelligdagsNavn(B5,0,0)","v":""},null,"9-18","9-16:30","9-16","9-17"]
[{"$f":"IF(WEEKDAY(B6,2)=1,WEEKNUM(B6,2),\"\")","v":""},{"$f":"B5+1","v":"2015-04-01"},{"$f":"VLOOKUP(WEEKDAY(B6,11),T!$G$1:$H$7,2)","v":"Tirsdag"},{"$f":"HelligdagsNavn(B6,0,0)","v":""},"9-18",null,"9-16:30","8-14","9-17"]
["",{"$f":"B6+1","v":"2015-04-02"},{"$f":"VLOOKUP(WEEKDAY(B7,11),T!$G$1:$H$7,2)","v":"Onsdag"},"","9-18",null,"9-16:30","8-14","9-17"]
["","2015-04-03",{"$f":"VLOOKUP(WEEKDAY(B8,11),T!$G$1:$H$7,2)","v":"Torsdag"},"",null,"9-18","9-16:30","8-14","9-17"]
["","2015-04-04",{"$f":"VLOOKUP(WEEKDAY(B9,11),T!$G$1:$H$7,2)","v":"Fredag"},"","9-18","9-18","9-16:30","8-14","9-17"]
["","2015-04-05",{"$f":"VLOOKUP(WEEKDAY(B10,11),T!$G$1:$H$7,2)","v":"Lørdag"},"","9-15"]
["","2015-04-06",{"$f":"VLOOKUP(WEEKDAY(B11,11),T!$G$1:$H$7,2)","v":"Søndag"},"","10-14"]
[15,{"$f":"B11+1","v":"2015-04-07"},{"$f":"VLOOKUP(WEEKDAY(B12,11),T!$G$1:$H$7,2)","v":"Mandag"},"","9-18",null,"9-16:30","9-16","9-17"]
["",{"$f":"B12+1","v":"2015-04-08"},{"$f":"VLOOKUP(WEEKDAY(B13,11),T!$G$1:$H$7,2)","v":"Tirsdag"},"",null,"9-18","9-16:30","9-14","9-17"]
["","2015-04-09",{"$f":"VLOOKUP(WEEKDAY(B14,11),T!$G$1:$H$7,2)","v":"Onsdag"},"",null,"9-18","9-16:30","9-14","9-17"]
["","2015-04-10",{"$f":"VLOOKUP(WEEKDAY(B15,11),T!$G$1:$H$7,2)","v":"Torsdag"},"","9-18",null,"9-16:30","9-14","9-17"]
["","2015-04-11",{"$f":"VLOOKUP(WEEKDAY(B16,11),T!$G$1:$H$7,2)","v":"Fredag"},"","9-18","9-18","9-16:30","9-14","9-17"]
["","2015-04-12",{"$f":"VLOOKUP(WEEKDAY(B17,11),T!$G$1:$H$7,2)","v":"Lørdag"},"",null,"9-15"]
["","2015-04-13",{"$f":"VLOOKUP(WEEKDAY(B18,11),T!$G$1:$H$7,2)","v":"Søndag"},"Palmesøndag",null,"10-14"]
[16,{"$f":"B18+1","v":"2015-04-14"},{"$f":"VLOOKUP(WEEKDAY(B19,11),T!$G$1:$H$7,2)","v":"Mandag"},"",null,"9-18","9-16:30","9-16","9-17"]
["",{"$f":"B19+1","v":"2015-04-15"},{"$f":"VLOOKUP(WEEKDAY(B20,11),T!$G$1:$H$7,2)","v":"Tirsdag"},"","9-18",null,"9-16:30","8-14","9-17"]
["","2015-04-16",{"$f":"VLOOKUP(WEEKDAY(B21,11),T!$G$1:$H$7,2)","v":"Onsdag"},"","9-18",null,"9-16:30","8-14","9-17"]
["","2015-04-17",{"$f":"VLOOKUP(WEEKDAY(B22,11),T!$G$1:$H$7,2)","v":"Torsdag"},"Skærtorsdag",null,"9-18","OFF","OFF","OFF"]
["","2015-04-18",{"$f":"VLOOKUP(WEEKDAY(B23,11),T!$G$1:$H$7,2)","v":"Fredag"},"Langfredag","9-18","9-18","OFF","OFF","OFF"]
["","2015-04-19",{"$f":"VLOOKUP(WEEKDAY(B24,11),T!$G$1:$H$7,2)","v":"Lørdag"},"","9-15"]
["","2015-04-20",{"$f":"VLOOKUP(WEEKDAY(B25,11),T!$G$1:$H$7,2)","v":"Søndag"},"Påskedag","10-14"]
[17,{"$f":"B25+1","v":"2015-04-21"},{"$f":"VLOOKUP(WEEKDAY(B26,11),T!$G$1:$H$7,2)","v":"Mandag"},"2. Påskedag","9-18",null,"OFF","OFF","OFF"]
["",{"$f":"B26+1","v":"2015-04-22"},{"$f":"VLOOKUP(WEEKDAY(B27,11),T!$G$1:$H$7,2)","v":"Tirsdag"},"3. Påskedag",null,"9-18","9-16:30","9-14","9-17"]
["","2015-04-23",{"$f":"VLOOKUP(WEEKDAY(B28,11),T!$G$1:$H$7,2)","v":"Onsdag"},"",null,"9-18","9-16:30","9-14","9-17"]
["","2015-04-24",{"$f":"VLOOKUP(WEEKDAY(B29,11),T!$G$1:$H$7,2)","v":"Torsdag"},"","9-18",null,"9-16:30","9-14","9-17"]
["","2015-04-25",{"$f":"VLOOKUP(WEEKDAY(B30,11),T!$G$1:$H$7,2)","v":"Fredag"},"","9-18","9-18","9-16:30","9-14","9-17"]
["","2015-04-26",{"$f":"VLOOKUP(WEEKDAY(B31,11),T!$G$1:$H$7,2)","v":"Lørdag"},"",null,"9-15"]
["","2015-04-27",{"$f":"VLOOKUP(WEEKDAY(B32,11),T!$G$1:$H$7,2)","v":"Søndag"},"",null,"10-14"]
[18,{"$f":"B32+1","v":"2015-04-28"},{"$f":"VLOOKUP(WEEKDAY(B33,11),T!$G$1:$H$7,2)","v":"Mandag"},"",null,"9-18","9-16:30","9-16","9-17"]
["",{"$f":"B33+1","v":"2015-04-29"},{"$f":"VLOOKUP(WEEKDAY(B34,11),T!$G$1:$H$7,2)","v":"Tirsdag"},"","9-18",null,"9-16:30","8-14","9-17"]
[{"$f":"IFERROR(IF(WEEKDAY(B35,2)=1,WEEKNUM(B35,2),\"\"),\"\")","v":""},{"$f":"IF(MONTH(B34+1)>MONTH(B34),\"\",B34+1)","v":""},{"$f":"IFERROR(VLOOKUP(WEEKDAY(B35,11),T!$G$1:$H$7,2),\"\")","v":""},{"$f":"IF(B35=\"\",\"\",HelligdagsNavn(B35,0,0))","v":""}]

{"sheet":"MAJ","index":5,"n_rows":37,"n_cols":9,"rows_kept":37,"cut":false,"hidden":false,"merged":[[1,4,1,8]]}
[null,5]
[null,null," ","bemærkninger","Vagtskema"]
["Uge",{"$f":"VLOOKUP(B1,T!C1:D12,2,0)","v":"Maj"},{"$f":"'Arbejdes timer'!C2","v":2019},null,"Jacob","Nina","René","Kirsten","Erik"]
[null,null,null,{"$f":"EOMONTH(DATE(C3,B1,1),-1)","v":"2015-04-29"}]
[{"$f":"IF(WEEKDAY(B5,2)=1,WEEKNUM(B5,2),\"\")","v":""},{"$f":"DATE(C3,B1,1)","v":"2015-04-30"},{"$f":"VLOOKUP(WEEKDAY(B5,11),T!$G$1:$H$7,2)","v":"Onsdag"},{"$f":"HelligdagsNavn(B5,0,0)","v":""},"9-18",null,"9-16:30","8-14","9-17"]
[{"$f":"IF(WEEKDAY(B6,2)=1,WEEKNUM(B6,2),\"\")","v":""},{"$f":"B5+1","v":"2015-05-01"},{"$f":"VLOOKUP(WEEKDAY(B6,11),T!$G$1:$H$7,2)","v":"Torsdag"},{"$f":"HelligdagsNavn(B6,0,0)","v":""},null,"9-18","9-16:30","8-14","9-17"]
["",{"$f":"B6+1","v":"2015-05-02"},{"$f":"VLOOKUP(WEEKDAY(B7,11),T!$G$1:$H$7,2)","v":"Fredag"},"","9-18","9-18","9-16:30","8-14","9-17"]
["",{"$f":"B7+1","v":"2015-05-03"},{"$f":"VLOOKUP(WEEKDAY(B8,11),T!$G$1:$H$7,2)","v":"Lørdag"},"","9-15"]
["","2015-05-04",{"$f":"VLOOKUP(WEEKDAY(B9,11),T!$G$1:$H$7,2)","v":"Søndag"},"","10-14"]
[19,{"$f":"B9+1","v":"2015-05-05"},{"$f":"VLOOKUP(WEEKDAY(B10,11),T!$G$1:$H$7,2)","v":"Mandag"},"","9-18",null,"9-16:30","9-16","9-17"]
["",{"$f":"B10+1","v":"2015-05-06"},{"$f":"VLOOKUP(WEEKDAY(B11,11),T!$G$1:$H$7,2)","v":"Tirsdag"},"",null,"9-18","9-16:30","9-14","9-17"]
["",{"$f":"B11+1","v":"2015-05-07"},{"$f":"VLOOKUP(WEEKDAY(B12,11),T!$G$1:$H$7,2)","v":"Onsdag"},"",null,"9-18","9-16:30","9-14","9-17"]
["","2015-05-08",{"$f":"VLOOKUP(WEEKDAY(B13,11),T!$G$1:$H$7,2)","v":"Torsdag"},"","9-18",null,"9-16:30","9-14","9-17"]
["","2015-05-09",{"$f":"VLOOKUP(WEEKDAY(B14,11),T!$G$1:$H$7,2)","v":"Fredag"},"","9-18","9-18","9-16:30","9-14","9-17"]
["","2015-05-10",{"$f":"VLOOKUP(WEEKDAY(B15,11),T!$G$1:$H$7,2)","v":"Lørdag"},"",null,"9-15"]
["","2015-05-11",{"$f":"VLOOKUP(WEEKDAY(B16,11),T!$G$1:$H$7,2)","v":"Søndag"},"Morsdag",null,"10-14"]
[20,{"$f":"B16+1","v":"2015-05-12"},{"$f":"VLOOKUP(WEEKDAY(B17,11),T!$G$1:$H$7,2)","v":"Mandag"},"",null,"9-18","9-16:30","9-16","9-17"]
["",{"$f":"B17+1","v":"2015-05-13"},{"$f":"VLOOKUP(WEEKDAY(B18,11),T!$G$1:$H$7,2)","v":"Tirsdag"},"","9-18",null,"9-16:30","8-14","9-17"]
["",{"$f":"B18+1","v":"2015-05-14"},{"$f":"VLOOKUP(WEEKDAY(B19,11),T!$G$1:$H$7,2)","v":"Onsdag"},"","9-18",null,"9-16:30","8-14","9-17"]
["","2015-05-15",{"$f":"VLOOKUP(WEEKDAY(B20,11),T!$G$1:$H$7,2)","v":"Torsdag"},"",null,"9-18","9-16:30","8-14","9-17"]
["","2015-05-16",{"$f":"VLOOKUP(WEEKDAY(B21,11),T!$G$1:$H$7,2)","v":"Fredag"},"Store Bededag","9-18","9-18","9-16:30","8-14","9-17"]
["","2015-05-17",{"$f":"VLOOKUP(WEEKDAY(B22,11),T!$G$1:$H$7,2)","v":"Lørdag"},"","9-15"]
["","2015-05-18",{"$f":"VLOOKUP(WEEKDAY(B23,11),T!$G$1:$H$7,2)","v":"Søndag"},"","10-14"]
[21,{"$f":"B23+1","v":"2015-05-19"},{"$f":"VLOOKUP(WEEKDAY(B24,11),T!$G$1:$H$7,2)","v":"Mandag"},"","9-18",null,"9-16:30","9-16","9-17"]
["",{"$f":"B24+1","v":"2015-05-20"},{"$f":"VLOOKUP(WEEKDAY(B25,11),T!$G$1:$H$7,2)","v":"Tirsdag"},"",null,"9-18","9-16:30","9-14","9-17"]
["",{"$f":"B25+1","v":"2015-05-21"},{"$f":"VLOOKUP(WEEKDAY(B26,11),T!$G$1:$H$7,2)","v":"Onsdag"},"",null,"9-18","9-16:30","9-14","9-17"]
["","2015-05-22",{"$f":"VLOOKUP(WEEKDAY(B27,11),T!$G$1:$H$7,2)","v":"Torsdag"},"","9-18",null,"9-16:30","9-14","9-17"]
["","2015-05-23",{"$f":"VLOOKUP(WEEKDAY(B28,11),T!$G$1:$H$7,2)","v":"Fredag"},"","9-18","9-18","9-16:30","9-14","9-17"]
["","2015-05-24",{"$f":"VLOOKUP(WEEKDAY(B29,11),T!$G$1:$H$7,2)","v":"Lørdag"},"",null,"9-15"]
["","2015-05-25",{"$f":"VLOOKUP(WEEKDAY(B30,11),T!$G$1:$H$7,2)","v":"Søndag"},"",null,"10-14"]
[22,{"$f":"B30+1","v":"2015-05-26"},{"$f":"VLOOKUP(WEEKDAY(B31,11),T!$G$1:$H$7,2)","v":"Mandag"},"",null,"9-18","9-16:30","9-16","9-17"]
["",{"$f":"B31+1","v":"2015-05-27"},{"$f":"VLOOKUP(WEEKDAY(B32,11),T!$G$1:$H$7,2)","v":"Tirsdag"},"","9-18",null,"9-16:30","8-14","9-17"]
["",{"$f":"B32+1","v":"2015-05-28"},{"$f":"VLOOKUP(WEEKDAY(B33,11),T!$G$1:$H$7,2)","v":"Onsdag"},"","9-18",null,"9-16:30","8-14","9-17"]
["","2015-05-29",{"$f":"VLOOKUP(WEEKDAY(B34,11),T!$G$1:$H$7,2)","v":"Torsdag"},"Kristi Himmelfartsdag",null,"9-18","9-16:30","8-14","9-17"]
["","2015-05-30",{"$f":"VLOOKUP(WEEKDAY(B35,11),T!$G$1:$H$7,2)","v":"Fredag"},"","9-18","9-18","9-16:30","8-14","9-17"]
[null,null,null,""]
[null,null,null,""]

{"sheet":"JUNI","index":6,"n_rows":35,"n_cols":9,"rows_kept":35,"cut":false,"hidden":false,"merged":[[1,4,1,8]]}
[null,6]
[null,null," ","Bemærkninger","Vagtskema"]
["Uge",{"$f":"VLOOKUP(B1,T!C1:D12,2,0)","v":"Juni"},{"$f":"'Arbejdes timer'!C2","v":2019},null,"Jacob","Nina","René","Kirsten","Erik"]
[null,null,null,{"$f":"EOMONTH(DATE(C3,B1,1),-1)","v":"2015-05-30"}]
[{"$f":"IF(WEEKDAY(B5,2)=1,WEEKNUM(B5,2),\"\")","v":""},{"$f":"DATE(C3,B1,1)","v":"2015-05-31"},{"$f":"VLOOKUP(WEEKDAY(B5,11),T!$G$1:$H$7,2)","v":"Lørdag"},{"$f":"HelligdagsNavn(B5,0,0)","v":""},"9-18",null,"9-16:30","8-14","9-17"]
[{"$f":"IF(WEEKDAY(B6,2)=1,WEEKNUM(B6,2),\"\")","v":""},{"$f":"B5+1","v":"2015-06-01"},{"$f":"VLOOKUP(WEEKDAY(B6,11),T!$G$1:$H$7,2)","v":"Søndag"},{"$f":"HelligdagsNavn(B6,0,0)","v":""},null,"9-18","9-16:30","8-14","9-17"]
[23,{"$f":"B6+1","v":"2015-06-02"},{"$f":"VLOOKUP(WEEKDAY(B7,11),T!$G$1:$H$7,2)","v":"Mandag"},"","9-18","9-18","9-16:30","8-14","9-17"]
["",{"$f":"B7+1","v":"2015-06-03"},{"$f":"VLOOKUP(WEEKDAY(B8,11),T!$G$1:$H$7,2)","v":"Tirsdag"},"","9-15"]
["","2015-06-04",{"$f":"VLOOKUP(WEEKDAY(B9,11),T!$G$1:$H$7,2)","v":"Onsdag"},"Grundlovsdag","10-14"]
["",{"$f":"B9+1","v":"2015-06-05"},{"$f":"VLOOKUP(WEEKDAY(B10,11),T!$G$1:$H$7,2)","v":"Torsdag"},"","9-18",null,"9-16:30","9-16","9-17"]
["",{"$f":"B10+1","v":"2015-06-06"},{"$f":"VLOOKUP(WEEKDAY(B11,11),T!$G$1:$H$7,2)","v":"Fredag"},"",null,"9-18","9-16:30","9-14","9-17"]
["",{"$f":"B11+1","v":"2015-06-07"},{"$f":"VLOOKUP(WEEKDAY(B12,11),T!$G$1:$H$7,2)","v":"Lørdag"},"",null,"9-18","9-16:30","9-14","9-17"]
["","2015-06-08",{"$f":"VLOOKUP(WEEKDAY(B13,11),T!$G$1:$H$7,2)","v":"Søndag"},"Pinsedag","9-18",null,"9-16:30","9-14","9-17"]
[24,"2015-06-09",{"$f":"VLOOKUP(WEEKDAY(B14,11),T!$G$1:$H$7,2)","v":"Mandag"},"2. Pinsedag","9-18","9-18","9-16:30","9-14","9-17"]
["","2015-06-10",{"$f":"VLOOKUP(WEEKDAY(B15,11),T!$G$1:$H$7,2)","v":"Tirsdag"},"3. Pinsedag",null,"9-15"]
["","2015-06-11",{"$f":"VLOOKUP(WEEKDAY(B16,11),T!$G$1:$H$7,2)","v":"Onsdag"},"",null,"10-14"]
["",{"$f":"B16+1","v":"2015-06-12"},{"$f":"VLOOKUP(WEEKDAY(B17,11),T!$G$1:$H$7,2)","v":"Torsdag"},"",null,"9-18","9-16:30","9-16","9-17"]
["",{"$f":"B17+1","v":"2015-06-13"},{"$f":"VLOOKUP(WEEKDAY(B18,11),T!$G$1:$H$7,2)","v":"Fredag"},"","9-18",null,"9-16:30","8-14","9-17"]
["",{"$f":"B18+1","v":"2015-06-14"},{"$f":"VLOOKUP(WEEKDAY(B19,11),T!$G$1:$H$7,2)","v":"Lørdag"},"","9-18",null,"9-16:30","8-14","9-17"]
["","2015-06-15",{"$f":"VLOOKUP(WEEKDAY(B20,11),T!$G$1:$H$7,2)","v":"Søndag"},"",null,"9-18","9-16:30","8-14","9-17"]
[25,"2015-06-16",{"$f":"VLOOKUP(WEEKDAY(B21,11),T!$G$1:$H$7,2)","v":"Mandag"},"","9-18","9-18","9-16:30","8-14","9-17"]
["","2015-06-17",{"$f":"VLOOKUP(WEEKDAY(B22,11),T!$G$1:$H$7,2)","v":"Tirsdag"},"","9-15"]
["","2015-06-18",{"$f":"VLOOKUP(WEEKDAY(B23,11),T!$G$1:$H$7,2)","v":"Onsdag"},"","10-14"]
["",{"$f":"B23+1","v":"2015-06-19"},{"$f":"VLOOKUP(WEEKDAY(B24,11),T!$G$1:$H$7,2)","v":"Torsdag"},"","9-18",null,"9-16:30","9-16","9-17"]
["",{"$f":"B24+1","v":"2015-06-20"},{"$f":"VLOOKUP(WEEKDAY(B25,11),T!$G$1:$H$7,2)","v":"Fredag"},"",null,"9-18","9-16:30","9-14","9-17"]
["",{"$f":"B25+1","v":"2015-06-21"},{"$f":"VLOOKUP(WEEKDAY(B26,11),T!$G$1:$H$7,2)","v":"Lørdag"},"",null,"9-18","9-16:30","9-14","9-17"]
["","2015-06-22",{"$f":"VLOOKUP(WEEKDAY(B27,11),T!$G$1:$H$7,2)","v":"Søndag"},"Sankt Hansaften","9-18",null,"9-16:30","9-14","9-17"]
[26,"2015-06-23",{"$f":"VLOOKUP(WEEKDAY(B28,11),T!$G$1:$H$7,2)","v":"Mandag"},"Sankt Hansdag","9-18","9-18","9-16:30","9-14","9-17"]
["","2015-06-24",{"$f":"VLOOKUP(WEEKDAY(B29,11),T!$G$1:$H$7,2)","v":"Tirsdag"},"",null,"9-15"]
["","2015-06-25",{"$f":"VLOOKUP(WEEKDAY(B30,11),T!$G$1:$H$7,2)","v":"Onsdag"},"",null,"10-14"]
["",{"$f":"B30+1","v":"2015-06-26"},{"$f":"VLOOKUP(WEEKDAY(B31,11),T!$G$1:$H$7,2)","v":"Torsdag"},"",null,"9-18","9-16:30","9-16","9-17"]
["",{"$f":"B31+1","v":"2015-06-27"},{"$f":"VLOOKUP(WEEKDAY(B32,11),T!$G$1:$H$7,2)","v":"Fredag"},"","9-18",null,"9-16:30","8-14","9-17"]
["",{"$f":"B32+1","v":"2015-06-28"},{"$f":"VLOOKUP(WEEKDAY(B33,11),T!$G$1:$H$7,2)","v":"Lørdag"},"","9-18",null,"9-16:30","8-14","9-17"]
["","2015-06-29",{"$f":"VLOOKUP(WEEKDAY(B34,11),T!$G$1:$H$7,2)","v":"Søndag"},"",null,"9-18","9-16:30","8-14","9-17"]
[27,"2015-06-30",{"$f":"VLOOKUP(WEEKDAY(B35,11),T!$G$1:$H$7,2)","v":"Mandag"},"","9-18","9-18","9-16:30","8-14","9-17"]

{"sheet":"JULI","index":7,"n_rows":35,"n_cols":9,"rows_kept":35,"cut":false,"hidden":false,"merged":[[1,4,1,8]]}
[null,7]
[null,null," ","bemærkninger","Vagtskema"]
["Uge",{"$f":"VLOOKUP(B1,T!C1:D12,2,0)","v":"Juli"},{"$f":"'Arbejdes timer'!C2","v":2019},null,"Jacob","Nina","René","Kirsten","Erik"]
[null,null,null,{"$f":"EOMONTH(DATE(C3,B1,1),-1)","v":"2015-06-29"}]
[{"$f":"IF(WEEKDAY(B5,2)=1,WEEKNUM(B5,2),\"\")","v":27},{"$f":"DATE(C3,B1,1)","v":"2015-06-30"},{"$f":"VLOOKUP(WEEKDAY(B5,11),T!$G$1:$H$7,2)","v":"Mandag"},{"$f":"HelligdagsNavn(B5,0,0)","v":""},"9-18",null,"9-16:30","8-14","9-17"]
[{"$f":"IF(WEEKDAY(B6,2)=1,WEEKNUM(B6,2),\"\")","v":""},{"$f":"B5+1","v":"2015-07-01"},{"$f":"VLOOKUP(WEEKDAY(B6,11),T!$G$1:$H$7,2)","v":"Tirsdag"},{"$f":"HelligdagsNavn(B6,0,0)","v":"Maria Besøgelsesdag"},null,"9-18","9-16:30","8-14","9-17"]
["",{"$f":"B6+1","v":"2015-07-02"},{"$f":"VLOOKUP(WEEKDAY(B7,11),T!$G$1:$H$7,2)","v":"Onsdag"},"","9-18","9-18","9-16:30","8-14","9-17"]
["",{"$f":"B7+1","v":"2015-07-03"},{"$f":"VLOOKUP(WEEKDAY(B8,11),T!$G$1:$H$7,2)","v":"Torsdag"},"","9-15"]
["","2015-07-04",{"$f":"VLOOKUP(WEEKDAY(B9,11),T!$G$1:$H$7,2)","v":"Fredag"},"","10-14"]
["",{"$f":"B9+1","v":"2015-07-05"},{"$f":"VLOOKUP(WEEKDAY(B10,11),T!$G$1:$H$7,2)","v":"Lørdag"},"","9-18",null,"9-16:30","9-16","9-17"]
["",{"$f":"B10+1","v":"2015-07-06"},{"$f":"VLOOKUP(WEEKDAY(B11,11),T!$G$1:$H$7,2)","v":"Søndag"},"",null,"9-18","9-16:30","9-14","9-17"]
[28,{"$f":"B11+1","v":"2015-07-07"},{"$f":"VLOOKUP(WEEKDAY(B12,11),T!$G$1:$H$7,2)","v":"Mandag"},"",null,"9-18","9-16:30","9-14","9-17"]
["","2015-07-08",{"$f":"VLOOKUP(WEEKDAY(B13,11),T!$G$1:$H$7,2)","v":"Tirsdag"},"","9-18",null,"9-16:30","9-14","9-17"]
["","2015-07-09",{"$f":"VLOOKUP(WEEKDAY(B14,11),T!$G$1:$H$7,2)","v":"Onsdag"},"","9-18","9-18","9-16:30","9-14","9-17"]
["","2015-07-10",{"$f":"VLOOKUP(WEEKDAY(B15,11),T!$G$1:$H$7,2)","v":"Torsdag"},"",null,"9-15"]
["","2015-07-11",{"$f":"VLOOKUP(WEEKDAY(B16,11),T!$G$1:$H$7,2)","v":"Fredag"},"",null,"10-14"]
["",{"$f":"B16+1","v":"2015-07-12"},{"$f":"VLOOKUP(WEEKDAY(B17,11),T!$G$1:$H$7,2)","v":"Lørdag"},"",null,"9-18","9-16:30","9-16","9-17"]
["",{"$f":"B17+1","v":"2015-07-13"},{"$f":"VLOOKUP(WEEKDAY(B18,11),T!$G$1:$H$7,2)","v":"Søndag"},"","9-18",null,"9-16:30","8-14","9-17"]
[29,{"$f":"B18+1","v":"2015-07-14"},{"$f":"VLOOKUP(WEEKDAY(B19,11),T!$G$1:$H$7,2)","v":"Mandag"},"","9-18",null,"9-16:30","8-14","9-17"]
["","2015-07-15",{"$f":"VLOOKUP(WEEKDAY(B20,11),T!$G$1:$H$7,2)","v":"Tirsdag"},"",null,"9-18","9-16:30","8-14","9-17"]
["","2015-07-16",{"$f":"VLOOKUP(WEEKDAY(B21,11),T!$G$1:$H$7,2)","v":"Onsdag"},"","9-18","9-18","9-16:30","8-14","9-17"]
["","2015-07-17",{"$f":"VLOOKUP(WEEKDAY(B22,11),T!$G$1:$H$7,2)","v":"Torsdag"},"","9-15"]
["","2015-07-18",{"$f":"VLOOKUP(WEEKDAY(B23,11),T!$G$1:$H$7,2)","v":"Fredag"},"","10-14"]
["",{"$f":"B23+1","v":"2015-07-19"},{"$f":"VLOOKUP(WEEKDAY(B24,11),T!$G$1:$H$7,2)","v":"Lørdag"},"","9-18",null,"9-16:30","9-16","9-17"]
["",{"$f":"B24+1","v":"2015-07-20"},{"$f":"VLOOKUP(WEEKDAY(B25,11),T!$G$1:$H$7,2)","v":"Søndag"},"",null,"9-18","9-16:30","9-14","9-17"]
[30,{"$f":"B25+1","v":"2015-07-21"},{"$f":"VLOOKUP(WEEKDAY(B26,11),T!$G$1:$H$7,2)","v":"Mandag"},"",null,"9-18","9-16:30","9-14","9-17"]
["","2015-07-22",{"$f":"VLOOKUP(WEEKDAY(B27,11),T!$G$1:$H$7,2)","v":"Tirsdag"},"","9-18",null,"9-16:30","9-14","9-17"]
["","2015-07-23",{"$f":"VLOOKUP(WEEKDAY(B28,11),T!$G$1:$H$7,2)","v":"Onsdag"},"","9-18","9-18","9-16:30","9-14","9-17"]
["","2015-07-24",{"$f":"VLOOKUP(WEEKDAY(B29,11),T!$G$1:$H$7,2)","v":"Torsdag"},"",null,"9-15"]
["","2015-07-25",{"$f":"VLOOKUP(WEEKDAY(B30,11),T!$G$1:$H$7,2)","v":"Fredag"},"",null,"10-14"]
["",{"$f":"B30+1","v":"2015-07-26"},{"$f":"VLOOKUP(WEEKDAY(B31,11),T!$G$1:$H$7,2)","v":"Lørdag"},"",null,"9-18","9-16:30","9-16","9-17"]
["",{"$f":"B31+1","v":"2015-07-27"},{"$f":"VLOOKUP(WEEKDAY(B32,11),T!$G$1:$H$7,2)","v":"Søndag"},"Ólavsøkuaftan","9-18",null,"9-16:30","8-14","9-17"]
[31,{"$f":"B32+1","v":"2015-07-28"},{"$f":"VLOOKUP(WEEKDAY(B33,11),T!$G$1:$H$7,2)","v":"Mandag"},"Ólavsøkudagur","9-18",null,"9-16:30","8-14","9-17"]
["","2015-07-29",{"$f":"VLOOKUP(WEEKDAY(B34,11),T!$G$1:$H$7,2)","v":"Tirsdag"},"",null,"9-18","9-16:30","8-14","9-17"]
["","2015-07-30",{"$f":"VLOOKUP(WEEKDAY(B35,11),T!$G$1:$H$7,2)","v":"Onsdag"},"","9-18","9-18","9-16:30","8-14","9-17"]

{"sheet":"AUGUST","index":8,"n_rows":35,"n_cols":9,"rows_kept":35,"cut":false,"hidden":false,"merged":[[1,4,1,8]]}
[null,8]
[null,null," ","bemærkninger","Vagtskema"]
["Uge",{"$f":"VLOOKUP(B1,T!C1:D12,2,0)","v":"August"},{"$f":"'Arbejdes timer'!C2","v":2019},null,"Jacob","Nina","René","Kirsten","Erik"]
[null,null,null,{"$f":"EOMONTH(DATE(C3,B1,1),-1)","v":"2015-07-30"}]
[{"$f":"IF(WEEKDAY(B5,2)=1,WEEKNUM(B5,2),\"\")","v":""},{"$f":"DATE(C3,B1,1)","v":"2015-07-31"},{"$f":"VLOOKUP(WEEKDAY(B5,11),T!$G$1:$H$7,2)","v":"Torsdag"},{"$f":"HelligdagsNavn(B5,0,0)","v":""},"9-18",null,"9-16:30","8-14","9-17"]
[{"$f":"IF(WEEKDAY(B6,2)=1,WEEKNUM(B6,2),\"\")","v":""},{"$f":"B5+1","v":"2015-08-01"},{"$f":"VLOOKUP(WEEKDAY(B6,11),T!$G$1:$H$7,2)","v":"Fredag"},{"$f":"HelligdagsNavn(B6,0,0)","v":""},null,"9-18","9-16:30","8-14","9-17"]
["",{"$f":"B6+1","v":"2015-08-02"},{"$f":"VLOOKUP(WEEKDAY(B7,11),T!$G$1:$H$7,2)","v":"Lørdag"},"","9-18","9-18","9-16:30","8-14","9-17"]
["",{"$f":"B7+1","v":"2015-08-03"},{"$f":"VLOOKUP(WEEKDAY(B8,11),T!$G$1:$H$7,2)","v":"Søndag"},"","9-15"]
[32,"2015-08-04",{"$f":"VLOOKUP(WEEKDAY(B9,11),T!$G$1:$H$7,2)","v":"Mandag"},"","10-14"]
["",{"$f":"B9+1","v":"2015-08-05"},{"$f":"VLOOKUP(WEEKDAY(B10,11),T!$G$1:$H$7,2)","v":"Tirsdag"},"","9-18",null,"9-16:30","9-16","9-17"]
["",{"$f":"B10+1","v":"2015-08-06"},{"$f":"VLOOKUP(WEEKDAY(B11,11),T!$G$1:$H$7,2)","v":"Onsdag"},"",null,"9-18","9-16:30","9-14","9-17"]
["",{"$f":"B11+1","v":"2015-08-07"},{"$f":"VLOOKUP(WEEKDAY(B12,11),T!$G$1:$H$7,2)","v":"Torsdag"},"",null,"9-18","9-16:30","9-14","9-17"]
["","2015-08-08",{"$f":"VLOOKUP(WEEKDAY(B13,11),T!$G$1:$H$7,2)","v":"Fredag"},"","9-18",null,"9-16:30","9-14","9-17"]
["","2015-08-09",{"$f":"VLOOKUP(WEEKDAY(B14,11),T!$G$1:$H$7,2)","v":"Lørdag"},"","9-18","9-18","9-16:30","9-14","9-17"]
["","2015-08-10",{"$f":"VLOOKUP(WEEKDAY(B15,11),T!$G$1:$H$7,2)","v":"Søndag"},"",null,"9-15"]
[33,"2015-08-11",{"$f":"VLOOKUP(WEEKDAY(B16,11),T!$G$1:$H$7,2)","v":"Mandag"},"",null,"10-14"]
["",{"$f":"B16+1","v":"2015-08-12"},{"$f":"VLOOKUP(WEEKDAY(B17,11),T!$G$1:$H$7,2)","v":"Tirsdag"},"",null,"9-18","9-16:30","9-16","9-17"]
["",{"$f":"B17+1","v":"2015-08-13"},{"$f":"VLOOKUP(WEEKDAY(B18,11),T!$G$1:$H$7,2)","v":"Onsdag"},"","9-18",null,"9-16:30","8-14","9-17"]
["",{"$f":"B18+1","v":"2015-08-14"},{"$f":"VLOOKUP(WEEKDAY(B19,11),T!$G$1:$H$7,2)","v":"Torsdag"},"","9-18",null,"9-16:30","8-14","9-17"]
["","2015-08-15",{"$f":"VLOOKUP(WEEKDAY(B20,11),T!$G$1:$H$7,2)","v":"Fredag"},"",null,"9-18","9-16:30","8-14","9-17"]
["","2015-08-16",{"$f":"VLOOKUP(WEEKDAY(B21,11),T!$G$1:$H$7,2)","v":"Lørdag"},"","9-18","9-18","9-16:30","8-14","9-17"]
["","2015-08-17",{"$f":"VLOOKUP(WEEKDAY(B22,11),T!$G$1:$H$7,2)","v":"Søndag"},"","9-15"]
[34,"2015-08-18",{"$f":"VLOOKUP(WEEKDAY(B23,11),T!$G$1:$H$7,2)","v":"Mandag"},"","10-14"]
["",{"$f":"B23+1","v":"2015-08-19"},{"$f":"VLOOKUP(WEEKDAY(B24,11),T!$G$1:$H$7,2)","v":"Tirsdag"},"","9-18",null,"9-16:30","9-16","9-17"]
["",{"$f":"B24+1","v":"2015-08-20"},{"$f":"VLOOKUP(WEEKDAY(B25,11),T!$G$1:$H$7,2)","v":"Onsdag"},"",null,"9-18","9-16:30","9-14","9-17"]
["",{"$f":"B25+1","v":"2015-08-21"},{"$f":"VLOOKUP(WEEKDAY(B26,11),T!$G$1:$H$7,2)","v":"Torsdag"},"",null,"9-18","9-16:30","9-14","9-17"]
["","2015-08-22",{"$f":"VLOOKUP(WEEKDAY(B27,11),T!$G$1:$H$7,2)","v":"Fredag"},"","9-18",null,"9-16:30","9-14","9-17"]
["","2015-08-23",{"$f":"VLOOKUP(WEEKDAY(B28,11),T!$G$1:$H$7,2)","v":"Lørdag"},"","9-18","9-18","9-16:30","9-14","9-17"]
["","2015-08-24",{"$f":"VLOOKUP(WEEKDAY(B29,11),T!$G$1:$H$7,2)","v":"Søndag"},"",null,"9-15"]
[35,"2015-08-25",{"$f":"VLOOKUP(WEEKDAY(B30,11),T!$G$1:$H$7,2)","v":"Mandag"},"",null,"10-14"]
["",{"$f":"B30+1","v":"2015-08-26"},{"$f":"VLOOKUP(WEEKDAY(B31,11),T!$G$1:$H$7,2)","v":"Tirsdag"},"",null,"9-18","9-16:30","9-16","9-17"]
["",{"$f":"B31+1","v":"2015-08-27"},{"$f":"VLOOKUP(WEEKDAY(B32,11),T!$G$1:$H$7,2)","v":"Onsdag"},"","9-18",null,"9-16:30","8-14","9-17"]
["",{"$f":"B32+1","v":"2015-08-28"},{"$f":"VLOOKUP(WEEKDAY(B33,11),T!$G$1:$H$7,2)","v":"Torsdag"},"","9-18",null,"9-16:30","8-14","9-17"]
["","2015-08-29",{"$f":"VLOOKUP(WEEKDAY(B34,11),T!$G$1:$H$7,2)","v":"Fredag"},"",null,"9-18","9-16:30","8-14","9-17"]
["","2015-08-30",{"$f":"VLOOKUP(WEEKDAY(B35,11),T!$G$1:$H$7,2)","v":"Lørdag"},"","9-18","9-18","9-16:30","8-14","9-17"]

{"sheet":"SEPTEMBER","index":9,"n_rows":35,"n_cols":9,"rows_kept":35,"cut":false,"hidden":false,"merged":[[1,4,1,8]]}
[null,9]
[null,null," ","bemærkninger","Vagtskema"]
["Uge",{"$f":"VLOOKUP(B1,T!C1:D12,2,0)","v":"September"},{"$f":"'Arbejdes timer'!C2","v":2019},null,"Jacob","Nina","René","Kirsten","Erik"]
[null,null,null,{"$f":"EOMONTH(DATE(C3,B1,1),-1)","v":"2015-08-30"}]
[{"$f":"IF(WEEKDAY(B5,2)=1,WEEKNUM(B5,2),\"\")","v":""},{"$f":"DATE(C3,B1,1)","v":"2015-08-31"},{"$f":"VLOOKUP(WEEKDAY(B5,11),T!$G$1:$H$7,2)","v":"Søndag"},{"$f":"HelligdagsNavn(B5,0,0)","v":""},"9-18",null,"9-16:30","8-14","9-17"]
[{"$f":"IF(WEEKDAY(B6,2)=1,WEEKNUM(B6,2),\"\")","v":36},{"$f":"B5+1","v":"2015-09-01"},{"$f":"VLOOKUP(WEEKDAY(B6,11),T!$G$1:$H$7,2)","v":"Mandag"},{"$f":"HelligdagsNavn(B6,0,0)","v":""},null,"9-18","9-16:30","8-14","9-17"]
["",{"$f":"B6+1","v":"2015-09-02"},{"$f":"VLOOKUP(WEEKDAY(B7,11),T!$G$1:$H$7,2)","v":"Tirsdag"},"","9-18","9-18","9-16:30","8-14","9-17"]
["",{"$f":"B7+1","v":"2015-09-03"},{"$f":"VLOOKUP(WEEKDAY(B8,11),T!$G$1:$H$7,2)","v":"Onsdag"},"","9-15"]
["","2015-09-04",{"$f":"VLOOKUP(WEEKDAY(B9,11),T!$G$1:$H$7,2)","v":"Torsdag"},"","10-14"]
["",{"$f":"B9+1","v":"2015-09-05"},{"$f":"VLOOKUP(WEEKDAY(B10,11),T!$G$1:$H$7,2)","v":"Fredag"},"","9-18",null,"9-16:30","9-16","9-17"]
["",{"$f":"B10+1","v":"2015-09-06"},{"$f":"VLOOKUP(WEEKDAY(B11,11),T!$G$1:$H$7,2)","v":"Lørdag"},"",null,"9-18","9-16:30","9-14","9-17"]
["",{"$f":"B11+1","v":"2015-09-07"},{"$f":"VLOOKUP(WEEKDAY(B12,11),T!$G$1:$H$7,2)","v":"Søndag"},"",null,"9-18","9-16:30","9-14","9-17"]
[37,"2015-09-08",{"$f":"VLOOKUP(WEEKDAY(B13,11),T!$G$1:$H$7,2)","v":"Mandag"},"","9-18",null,"9-16:30","9-14","9-17"]
["","2015-09-09",{"$f":"VLOOKUP(WEEKDAY(B14,11),T!$G$1:$H$7,2)","v":"Tirsdag"},"","9-18","9-18","9-16:30","9-14","9-17"]
["","2015-09-10",{"$f":"VLOOKUP(WEEKDAY(B15,11),T!$G$1:$H$7,2)","v":"Onsdag"},"",null,"9-15"]
["","2015-09-11",{"$f":"VLOOKUP(WEEKDAY(B16,11),T!$G$1:$H$7,2)","v":"Torsdag"},"",null,"10-14"]
["",{"$f":"B16+1","v":"2015-09-12"},{"$f":"VLOOKUP(WEEKDAY(B17,11),T!$G$1:$H$7,2)","v":"Fredag"},"",null,"9-18","9-16:30","9-16","9-17"]
["",{"$f":"B17+1","v":"2015-09-13"},{"$f":"VLOOKUP(WEEKDAY(B18,11),T!$G$1:$H$7,2)","v":"Lørdag"},"","9-18",null,"9-16:30","8-14","9-17"]
["",{"$f":"B18+1","v":"2015-09-14"},{"$f":"VLOOKUP(WEEKDAY(B19,11),T!$G$1:$H$7,2)","v":"Søndag"},"","9-18",null,"9-16:30","8-14","9-17"]
[38,"2015-09-15",{"$f":"VLOOKUP(WEEKDAY(B20,11),T!$G$1:$H$7,2)","v":"Mandag"},"",null,"9-18","9-16:30","8-14","9-17"]
["","2015-09-16",{"$f":"VLOOKUP(WEEKDAY(B21,11),T!$G$1:$H$7,2)","v":"Tirsdag"},"","9-18","9-18","9-16:30","8-14","9-17"]
["","2015-09-17",{"$f":"VLOOKUP(WEEKDAY(B22,11),T!$G$1:$H$7,2)","v":"Onsdag"},"","9-15"]
["","2015-09-18",{"$f":"VLOOKUP(WEEKDAY(B23,11),T!$G$1:$H$7,2)","v":"Torsdag"},"","10-14"]
["",{"$f":"B23+1","v":"2015-09-19"},{"$f":"VLOOKUP(WEEKDAY(B24,11),T!$G$1:$H$7,2)","v":"Fredag"},"","9-18",null,"9-16:30","9-16","9-17"]
["",{"$f":"B24+1","v":"2015-09-20"},{"$f":"VLOOKUP(WEEKDAY(B25,11),T!$G$1:$H$7,2)","v":"Lørdag"},"",null,"9-18","9-16:30","9-14","9-17"]
["",{"$f":"B25+1","v":"2015-09-21"},{"$f":"VLOOKUP(WEEKDAY(B26,11),T!$G$1:$H$7,2)","v":"Søndag"},"",null,"9-18","9-16:30","9-14","9-17"]
[39,"2015-09-22",{"$f":"VLOOKUP(WEEKDAY(B27,11),T!$G$1:$H$7,2)","v":"Mandag"},"","9-18",null,"9-16:30","9-14","9-17"]
["","2015-09-23",{"$f":"VLOOKUP(WEEKDAY(B28,11),T!$G$1:$H$7,2)","v":"Tirsdag"},"","9-18","9-18","9-16:30","9-14","9-17"]
["","2015-09-24",{"$f":"VLOOKUP(WEEKDAY(B29,11),T!$G$1:$H$7,2)","v":"Onsdag"},"",null,"9-15"]
["","2015-09-25",{"$f":"VLOOKUP(WEEKDAY(B30,11),T!$G$1:$H$7,2)","v":"Torsdag"},"",null,"10-14"]
["",{"$f":"B30+1","v":"2015-09-26"},{"$f":"VLOOKUP(WEEKDAY(B31,11),T!$G$1:$H$7,2)","v":"Fredag"},"",null,"9-18","9-16:30","9-16","9-17"]
["",{"$f":"B31+1","v":"2015-09-27"},{"$f":"VLOOKUP(WEEKDAY(B32,11),T!$G$1:$H$7,2)","v":"Lørdag"},"","9-18",null,"9-16:30","8-14","9-17"]
["",{"$f":"B32+1","v":"2015-09-28"},{"$f":"VLOOKUP(WEEKDAY(B33,11),T!$G$1:$H$7,2)","v":"Søndag"},"Mikkelsdag","9-18",null,"9-16:30","8-14","9-17"]
[40,"2015-09-29",{"$f":"VLOOKUP(WEEKDAY(B34,11),T!$G$1:$H$7,2)","v":"Mandag"},"",null,"9-18","9-16:30","8-14","9-17"]
[""]

{"sheet":"OKTOBER","index":10,"n_rows":35,"n_cols":9,"rows_kept":35,"cut":false,"hidden":false,"merged":[[1,4,1,8]]}
[null,10]
[null,null," ","bemærkninger","Vagtskema"]
["Uge",{"$f":"VLOOKUP(B1,T!C1:D12,2,0)","v":"Oktober"},{"$f":"'Arbejdes timer'!C2","v":2019},null,"Jacob","Nina","René","Kirsten","Erik"]
[null,null,null,{"$f":"EOMONTH(DATE(C3,B1,1),-1)","v":"2015-09-29"}]
[{"$f":"IF(WEEKDAY(B5,2)=1,WEEKNUM(B5,2),\"\")","v":""},{"$f":"DATE(C3,B1,1)","v":"2015-09-30"},{"$f":"VLOOKUP(WEEKDAY(B5,11),T!$G$1:$H$7,2)","v":"Tirsdag"},{"$f":"HelligdagsNavn(B5,0,0)","v":""},"9-18",null,"9-16:30","8-14","9-17"]
[{"$f":"IF(WEEKDAY(B6,2)=1,WEEKNUM(B6,2),\"\")","v":""},{"$f":"B5+1","v":"2015-10-01"},{"$f":"VLOOKUP(WEEKDAY(B6,11),T!$G$1:$H$7,2)","v":"Onsdag"},{"$f":"HelligdagsNavn(B6,0,0)","v":""},null,"9-18","9-16:30","8-14","9-17"]
["",{"$f":"B6+1","v":"2015-10-02"},{"$f":"VLOOKUP(WEEKDAY(B7,11),T!$G$1:$H$7,2)","v":"Torsdag"},"","9-18","9-18","9-16:30","8-14","9-17"]
["",{"$f":"B7+1","v":"2015-10-03"},{"$f":"VLOOKUP(WEEKDAY(B8,11),T!$G$1:$H$7,2)","v":"Fredag"},"","9-15"]
["","2015-10-04",{"$f":"VLOOKUP(WEEKDAY(B9,11),T!$G$1:$H$7,2)","v":"Lørdag"},"","10-14"]
["",{"$f":"B9+1","v":"2015-10-05"},{"$f":"VLOOKUP(WEEKDAY(B10,11),T!$G$1:$H$7,2)","v":"Søndag"},"","9-18",null,"9-16:30","9-16","9-17"]
[41,{"$f":"B10+1","v":"2015-10-06"},{"$f":"VLOOKUP(WEEKDAY(B11,11),T!$G$1:$H$7,2)","v":"Mandag"},"",null,"9-18","9-16:30","9-14","9-17"]
["",{"$f":"B11+1","v":"2015-10-07"},{"$f":"VLOOKUP(WEEKDAY(B12,11),T!$G$1:$H$7,2)","v":"Tirsdag"},"",null,"9-18","9-16:30","9-14","9-17"]
["","2015-10-08",{"$f":"VLOOKUP(WEEKDAY(B13,11),T!$G$1:$H$7,2)","v":"Onsdag"},"","9-18",null,"9-16:30","9-14","9-17"]
["","2015-10-09",{"$f":"VLOOKUP(WEEKDAY(B14,11),T!$G$1:$H$7,2)","v":"Torsdag"},"","9-18","9-18","9-16:30","9-14","9-17"]
["","2015-10-10",{"$f":"VLOOKUP(WEEKDAY(B15,11),T!$G$1:$H$7,2)","v":"Fredag"},"",null,"9-15"]
["","2015-10-11",{"$f":"VLOOKUP(WEEKDAY(B16,11),T!$G$1:$H$7,2)","v":"Lørdag"},"",null,"10-14"]
["",{"$f":"B16+1","v":"2015-10-12"},{"$f":"VLOOKUP(WEEKDAY(B17,11),T!$G$1:$H$7,2)","v":"Søndag"},"",null,"9-18","9-16:30","9-16","9-17"]
[42,{"$f":"B17+1","v":"2015-10-13"},{"$f":"VLOOKUP(WEEKDAY(B18,11),T!$G$1:$H$7,2)","v":"Mandag"},"","9-18",null,"9-16:30","8-14","9-17"]
["",{"$f":"B18+1","v":"2015-10-14"},{"$f":"VLOOKUP(WEEKDAY(B19,11),T!$G$1:$H$7,2)","v":"Tirsdag"},"","9-18",null,"9-16:30","8-14","9-17"]
["","2015-10-15",{"$f":"VLOOKUP(WEEKDAY(B20,11),T!$G$1:$H$7,2)","v":"Onsdag"},"",null,"9-18","9-16:30","8-14","9-17"]
["","2015-10-16",{"$f":"VLOOKUP(WEEKDAY(B21,11),T!$G$1:$H$7,2)","v":"Torsdag"},"","9-18","9-18","9-16:30","8-14","9-17"]
["","2015-10-17",{"$f":"VLOOKUP(WEEKDAY(B22,11),T!$G$1:$H$7,2)","v":"Fredag"},"","9-15"]
["","2015-10-18",{"$f":"VLOOKUP(WEEKDAY(B23,11),T!$G$1:$H$7,2)","v":"Lørdag"},"","10-14"]
["",{"$f":"B23+1","v":"2015-10-19"},{"$f":"VLOOKUP(WEEKDAY(B24,11),T!$G$1:$H$7,2)","v":"Søndag"},"","9-18",null,"9-16:30","9-16","9-17"]
[43,{"$f":"B24+1","v":"2015-10-20"},{"$f":"VLOOKUP(WEEKDAY(B25,11),T!$G$1:$H$7,2)","v":"Mandag"},"",null,"9-18","9-16:30","9-14","9-17"]
["",{"$f":"B25+1","v":"2015-10-21"},{"$f":"VLOOKUP(WEEKDAY(B26,11),T!$G$1:$H$7,2)","v":"Tirsdag"},"",null,"9-18","9-16:30","9-14","9-17"]
["","2015-10-22",{"$f":"VLOOKUP(WEEKDAY(B27,11),T!$G$1:$H$7,2)","v":"Onsdag"},"","9-18",null,"9-16:30","9-14","9-17"]
["","2015-10-23",{"$f":"VLOOKUP(WEEKDAY(B28,11),T!$G$1:$H$7,2)","v":"Torsdag"},"","9-18","9-18","9-16:30","9-14","9-17"]
["","2015-10-24",{"$f":"VLOOKUP(WEEKDAY(B29,11),T!$G$1:$H$7,2)","v":"Fredag"},"",null,"9-15"]
["","2015-10-25",{"$f":"VLOOKUP(WEEKDAY(B30,11),T!$G$1:$H$7,2)","v":"Lørdag"},"",null,"10-14"]
["",{"$f":"B30+1","v":"2015-10-26"},{"$f":"VLOOKUP(WEEKDAY(B31,11),T!$G$1:$H$7,2)","v":"Søndag"},"Sommertid Slut",null,"9-18","9-16:30","9-16","9-17"]
[44,{"$f":"B31+1","v":"2015-10-27"},{"$f":"VLOOKUP(WEEKDAY(B32,11),T!$G$1:$H$7,2)","v":"Mandag"},"","9-18",null,"9-16:30","8-14","9-17"]
["",{"$f":"B32+1","v":"2015-10-28"},{"$f":"VLOOKUP(WEEKDAY(B33,11),T!$G$1:$H$7,2)","v":"Tirsdag"},"","9-18",null,"9-16:30","8-14","9-17"]
["","2015-10-29",{"$f":"VLOOKUP(WEEKDAY(B34,11),T!$G$1:$H$7,2)","v":"Onsdag"},"",null,"9-18","9-16:30","8-14","9-17"]
["","2015-10-30",{"$f":"VLOOKUP(WEEKDAY(B35,11),T!$G$1:$H$7,2)","v":"Torsdag"},"","9-18","9-18","9-16:30","8-14","9-17"]

{"sheet":"NOVEMBER","index":11,"n_rows":35,"n_cols":9,"rows_kept":35,"cut":false,"hidden":false,"merged":[[1,4,1,8]]}
[null,11]
[null,null," ","bemærkninger","Vagtskema"]
["Uge",{"$f":"VLOOKUP(B1,T!C1:D12,2,0)","v":"November"},{"$f":"'Arbejdes timer'!C2","v":2019},null,"Jacob","Nina","René","Kirsten","Erik"]
[null,null,null,{"$f":"EOMONTH(DATE(C3,B1,1),-1)","v":"2015-10-30"}]
[{"$f":"IF(WEEKDAY(B5,2)=1,WEEKNUM(B5,2),\"\")","v":""},{"$f":"DATE(C3,B1,1)","v":"2015-10-31"},{"$f":"VLOOKUP(WEEKDAY(B5,11),T!$G$1:$H$7,2)","v":"Fredag"},{"$f":"HelligdagsNavn(B5,0,0)","v":"AlleHelgensdag"},"9-18",null,"9-16:30","8-14","9-17"]
[{"$f":"IF(WEEKDAY(B6,2)=1,WEEKNUM(B6,2),\"\")","v":""},{"$f":"B5+1","v":"2015-11-01"},{"$f":"VLOOKUP(WEEKDAY(B6,11),T!$G$1:$H$7,2)","v":"Lørdag"},{"$f":"HelligdagsNavn(B6,0,0)","v":"AlleSjælesdag"},null,"9-18","9-16:30","8-14","9-17"]
["",{"$f":"B6+1","v":"2015-11-02"},{"$f":"VLOOKUP(WEEKDAY(B7,11),T!$G$1:$H$7,2)","v":"Søndag"},"","9-18","9-18","9-16:30","8-14","9-17"]
[45,{"$f":"B7+1","v":"2015-11-03"},{"$f":"VLOOKUP(WEEKDAY(B8,11),T!$G$1:$H$7,2)","v":"Mandag"},"","9-15"]
["","2015-11-04",{"$f":"VLOOKUP(WEEKDAY(B9,11),T!$G$1:$H$7,2)","v":"Tirsdag"},"","10-14"]
["",{"$f":"B9+1","v":"2015-11-05"},{"$f":"VLOOKUP(WEEKDAY(B10,11),T!$G$1:$H$7,2)","v":"Onsdag"},"","9-18",null,"9-16:30","9-16","9-17"]
["",{"$f":"B10+1","v":"2015-11-06"},{"$f":"VLOOKUP(WEEKDAY(B11,11),T!$G$1:$H$7,2)","v":"Torsdag"},"",null,"9-18","9-16:30","9-14","9-17"]
["",{"$f":"B11+1","v":"2015-11-07"},{"$f":"VLOOKUP(WEEKDAY(B12,11),T!$G$1:$H$7,2)","v":"Fredag"},"",null,"9-18","9-16:30","9-14","9-17"]
["","2015-11-08",{"$f":"VLOOKUP(WEEKDAY(B13,11),T!$G$1:$H$7,2)","v":"Lørdag"},"","9-18",null,"9-16:30","9-14","9-17"]
["","2015-11-09",{"$f":"VLOOKUP(WEEKDAY(B14,11),T!$G$1:$H$7,2)","v":"Søndag"},"Mortensaften","9-18","9-18","9-16:30","9-14","9-17"]
[46,"2015-11-10",{"$f":"VLOOKUP(WEEKDAY(B15,11),T!$G$1:$H$7,2)","v":"Mandag"},"Mortensdag",null,"9-15"]
["","2015-11-11",{"$f":"VLOOKUP(WEEKDAY(B16,11),T!$G$1:$H$7,2)","v":"Tirsdag"},"",null,"10-14"]
["",{"$f":"B16+1","v":"2015-11-12"},{"$f":"VLOOKUP(WEEKDAY(B17,11),T!$G$1:$H$7,2)","v":"Onsdag"},"",null,"9-18","9-16:30","9-16","9-17"]
["",{"$f":"B17+1","v":"2015-11-13"},{"$f":"VLOOKUP(WEEKDAY(B18,11),T!$G$1:$H$7,2)","v":"Torsdag"},"","9-18",null,"9-16:30","8-14","9-17"]
["",{"$f":"B18+1","v":"2015-11-14"},{"$f":"VLOOKUP(WEEKDAY(B19,11),T!$G$1:$H$7,2)","v":"Fredag"},"","9-18",null,"9-16:30","8-14","9-17"]
["","2015-11-15",{"$f":"VLOOKUP(WEEKDAY(B20,11),T!$G$1:$H$7,2)","v":"Lørdag"},"",null,"9-18","9-16:30","8-14","9-17"]
["","2015-11-16",{"$f":"VLOOKUP(WEEKDAY(B21,11),T!$G$1:$H$7,2)","v":"Søndag"},"","9-18","9-18","9-16:30","8-14","9-17"]
[47,"2015-11-17",{"$f":"VLOOKUP(WEEKDAY(B22,11),T!$G$1:$H$7,2)","v":"Mandag"},"","9-15"]
["","2015-11-18",{"$f":"VLOOKUP(WEEKDAY(B23,11),T!$G$1:$H$7,2)","v":"Tirsdag"},"","10-14"]
["",{"$f":"B23+1","v":"2015-11-19"},{"$f":"VLOOKUP(WEEKDAY(B24,11),T!$G$1:$H$7,2)","v":"Onsdag"},"","9-18",null,"9-16:30","9-16","9-17"]
["",{"$f":"B24+1","v":"2015-11-20"},{"$f":"VLOOKUP(WEEKDAY(B25,11),T!$G$1:$H$7,2)","v":"Torsdag"},"",null,"9-18","9-16:30","9-14","9-17"]
["",{"$f":"B25+1","v":"2015-11-21"},{"$f":"VLOOKUP(WEEKDAY(B26,11),T!$G$1:$H$7,2)","v":"Fredag"},"",null,"9-18","9-16:30","9-14","9-17"]
["","2015-11-22",{"$f":"VLOOKUP(WEEKDAY(B27,11),T!$G$1:$H$7,2)","v":"Lørdag"},"","9-18",null,"9-16:30","9-14","9-17"]
["","2015-11-23",{"$f":"VLOOKUP(WEEKDAY(B28,11),T!$G$1:$H$7,2)","v":"Søndag"},"","9-18","9-18","9-16:30","9-14","9-17"]
[48,"2015-11-24",{"$f":"VLOOKUP(WEEKDAY(B29,11),T!$G$1:$H$7,2)","v":"Mandag"},"",null,"9-15"]
["","2015-11-25",{"$f":"VLOOKUP(WEEKDAY(B30,11),T!$G$1:$H$7,2)","v":"Tirsdag"},"",null,"10-14"]
["",{"$f":"B30+1","v":"2015-11-26"},{"$f":"VLOOKUP(WEEKDAY(B31,11),T!$G$1:$H$7,2)","v":"Onsdag"},"",null,"9-18","9-16:30","9-16","9-17"]
["",{"$f":"B31+1","v":"2015-11-27"},{"$f":"VLOOKUP(WEEKDAY(B32,11),T!$G$1:$H$7,2)","v":"Torsdag"},"","9-18",null,"9-16:30","8-14","9-17"]
["",{"$f":"B32+1","v":"2015-11-28"},{"$f":"VLOOKUP(WEEKDAY(B33,11),T!$G$1:$H$7,2)","v":"Fredag"},"","9-18",null,"9-16:30","8-14","9-17"]
["","2015-11-29",{"$f":"VLOOKUP(WEEKDAY(B34,11),T!$G$1:$H$7,2)","v":"Lørdag"},"",null,"9-18","9-16:30","8-14","9-17"]
[""]

{"sheet":"DECEMBER","index":12,"n_rows":35,"n_cols":9,"rows_kept":35,"cut":false,"hidden":false,"merged":[[1,4,1,8]]}
[null,12]
[null,null," ","bemærkninger","Vagtskema"]
["Uge",{"$f":"VLOOKUP(B1,T!C1:D12,2,0)","v":"December"},{"$f":"'Arbejdes timer'!C2","v":2019},null,"Jacob","Nina","René","Kirsten","Erik"]
[null,null,null,{"$f":"EOMONTH(DATE(C3,B1,1),-1)","v":"2015-11-29"}]
[{"$f":"IF(WEEKDAY(B5,2)=1,WEEKNUM(B5,2),\"\")","v":""},{"$f":"DATE(C3,B1,1)","v":"2015-11-30"},{"$f":"VLOOKUP(WEEKDAY(B5,11),T!$G$1:$H$7,2)","v":"Søndag"},{"$f":"HelligdagsNavn(B5,0,0)","v":""},"9-18",null,"9-16:30","8-14","9-17"]
[{"$f":"IF(WEEKDAY(B6,2)=1,WEEKNUM(B6,2),\"\")","v":49},{"$f":"B5+1","v":"2015-12-01"},{"$f":"VLOOKUP(WEEKDAY(B6,11),T!$G$1:$H$7,2)","v":"Mandag"},{"$f":"HelligdagsNavn(B6,0,0)","v":""},null,"9-18","9-16:30","8-14","9-17"]
["",{"$f":"B6+1","v":"2015-12-02"},{"$f":"VLOOKUP(WEEKDAY(B7,11),T!$G$1:$H$7,2)","v":"Tirsdag"},"","9-18","9-18","9-16:30","8-14","9-17"]
["",{"$f":"B7+1","v":"2015-12-03"},{"$f":"VLOOKUP(WEEKDAY(B8,11),T!$G$1:$H$7,2)","v":"Onsdag"},"","9-15"]
["","2015-12-04",{"$f":"VLOOKUP(WEEKDAY(B9,11),T!$G$1:$H$7,2)","v":"Torsdag"},"","10-14"]
["",{"$f":"B9+1","v":"2015-12-05"},{"$f":"VLOOKUP(WEEKDAY(B10,11),T!$G$1:$H$7,2)","v":"Fredag"},"","9-18",null,"9-16:30","9-16","9-17"]
["",{"$f":"B10+1","v":"2015-12-06"},{"$f":"VLOOKUP(WEEKDAY(B11,11),T!$G$1:$H$7,2)","v":"Lørdag"},"",null,"9-18","9-16:30","9-14","9-17"]
["",{"$f":"B11+1","v":"2015-12-07"},{"$f":"VLOOKUP(WEEKDAY(B12,11),T!$G$1:$H$7,2)","v":"Søndag"},"",null,"9-18","9-16:30","9-14","9-17"]
[50,"2015-12-08",{"$f":"VLOOKUP(WEEKDAY(B13,11),T!$G$1:$H$7,2)","v":"Mandag"},"","9-18",null,"9-16:30","9-14","9-17"]
["","2015-12-09",{"$f":"VLOOKUP(WEEKDAY(B14,11),T!$G$1:$H$7,2)","v":"Tirsdag"},"","9-18","9-18","9-16:30","9-14","9-17"]
["","2015-12-10",{"$f":"VLOOKUP(WEEKDAY(B15,11),T!$G$1:$H$7,2)","v":"Onsdag"},"",null,"9-15"]
["","2015-12-11",{"$f":"VLOOKUP(WEEKDAY(B16,11),T!$G$1:$H$7,2)","v":"Torsdag"},"",null,"10-14"]
["",{"$f":"B16+1","v":"2015-12-12"},{"$f":"VLOOKUP(WEEKDAY(B17,11),T!$G$1:$H$7,2)","v":"Fredag"},"",null,"9-18","9-16:30","9-16","9-17"]
["",{"$f":"B17+1","v":"2015-12-13"},{"$f":"VLOOKUP(WEEKDAY(B18,11),T!$G$1:$H$7,2)","v":"Lørdag"},"","9-18",null,"9-16:30","8-14","9-17"]
["",{"$f":"B18+1","v":"2015-12-14"},{"$f":"VLOOKUP(WEEKDAY(B19,11),T!$G$1:$H$7,2)","v":"Søndag"},"","9-18",null,"9-16:30","8-14","9-17"]
[51,"2015-12-15",{"$f":"VLOOKUP(WEEKDAY(B20,11),T!$G$1:$H$7,2)","v":"Mandag"},"",null,"9-18","9-16:30","8-14","9-17"]
["","2015-12-16",{"$f":"VLOOKUP(WEEKDAY(B21,11),T!$G$1:$H$7,2)","v":"Tirsdag"},"","9-18","9-18","9-16:30","8-14","9-17"]
["","2015-12-17",{"$f":"VLOOKUP(WEEKDAY(B22,11),T!$G$1:$H$7,2)","v":"Onsdag"},"","9-15"]
["","2015-12-18",{"$f":"VLOOKUP(WEEKDAY(B23,11),T!$G$1:$H$7,2)","v":"Torsdag"},"","10-14"]
["",{"$f":"B23+1","v":"2015-12-19"},{"$f":"VLOOKUP(WEEKDAY(B24,11),T!$G$1:$H$7,2)","v":"Fredag"},"","9-18",null,"9-16:30","9-16","9-17"]
["",{"$f":"B24+1","v":"2015-12-20"},{"$f":"VLOOKUP(WEEKDAY(B25,11),T!$G$1:$H$7,2)","v":"Lørdag"},"",null,"9-18","9-16:30","9-14","9-17"]
["",{"$f":"B25+1","v":"2015-12-21"},{"$f":"VLOOKUP(WEEKDAY(B26,11),T!$G$1:$H$7,2)","v":"Søndag"},"",null,"9-18","9-16:30","9-14","9-17"]
[{"$f":"IF(WEEKDAY(B27,2)=1,_xlfn.ISOWEEKNUM(B27),\"\")","v":52},"2015-12-22",{"$f":"VLOOKUP(WEEKDAY(B27,11),T!$G$1:$H$7,2)","v":"Mandag"},"","9-18",null,"9-16:30","9-14","9-17"]
[{"$f":"IF(WEEKDAY(B28,2)=1,_xlfn.ISOWEEKNUM(B28),\"\")","v":""},"2015-12-23",{"$f":"VLOOKUP(WEEKDAY(B28,11),T!$G$1:$H$7,2)","v":"Tirsdag"},"Julaftensdag","9-18","9-18","9-16:30","9-14","9-17"]
["","2015-12-24",{"$f":"VLOOKUP(WEEKDAY(B29,11),T!$G$1:$H$7,2)","v":"Onsdag"},"1. Juledag",null,"9-15"]
["","2015-12-25",{"$f":"VLOOKUP(WEEKDAY(B30,11),T!$G$1:$H$7,2)","v":"Torsdag"},"2. Juledag",null,"10-14"]
["",{"$f":"B30+1","v":"2015-12-26"},{"$f":"VLOOKUP(WEEKDAY(B31,11),T!$G$1:$H$7,2)","v":"Fredag"},"3. Juledag",null,"9-18","9-16:30","9-16","9-17"]
["",{"$f":"B31+1","v":"2015-12-27"},{"$f":"VLOOKUP(WEEKDAY(B32,11),T!$G$1:$H$7,2)","v":"Lørdag"},"","9-18",null,"9-16:30","8-14","9-17"]
["",{"$f":"B32+1","v":"2015-12-28"},{"$f":"VLOOKUP(WEEKDAY(B33,11),T!$G$1:$H$7,2)","v":"Søndag"},"","9-18",null,"9-16:30","8-14","9-17"]
[1,"2015-12-29",{"$f":"VLOOKUP(WEEKDAY(B34,11),T!$G$1:$H$7,2)","v":"Mandag"},"",null,"9-18","9-16:30","8-14","9-17"]
["","2015-12-30",{"$f":"VLOOKUP(WEEKDAY(B35,11),T!$G$1:$H$7,2)","v":"Tirsdag"},"Nytårsaftensdag","9-18","9-18","9-16:30","8-14","9-17"]

{"sheet":"T","index":13,"n_rows":25,"n_cols":11,"rows_kept":25,"cut":false,"hidden":false,"merged":[]}
["Norm timer","07:24:00",1,"Januar",1,"November",1,"Mandag"]
[null,null,2,"Februar",2,null,2,"Tirsdag"]
[null,null,3,"Marts",3,null,3,"Onsdag"]
[null,null,4,"April",4,null,4,"Torsdag"]
[null,null,5,"Maj",5,null,5,"Fredag"]
[null,null,6,"Juni",6,null,6,"Lørdag"]
[null,null,7,"Juli",7,null,7,"Søndag"]
[null,null,8,"August",8]
[null,null,9,"September",9]
[null,null,10,"Oktober",10]
[null,null,11,"November",11]
[null,null,12,"December",12]
[]
[]
[]
[]
[]
[]
[]
[]
[]
[]
[]
[]
[null,null,null,null,null,null,null,null,null,null,{"$f":"MATCH(F1,D1:D12,0)","v":11}]

{"sheet":"Ark1","index":14,"n_rows":12,"n_cols":4,"rows_kept":12,"cut":false,"hidden":false,"merged":[]}
[]
[null,"09:00:00","18:00:00",{"$f":"TEXT(B2,\"T:mm\")&\"-\"&TEXT(C2,\"t\")","v":"9:00-18"}]
[null,"09:00:00","16:30:00",{"$f":"TEXT(B3,\"T\")&\"-\"&TEXT(C3,\"t:mm\")","v":"9-16:30"}]
[]
[]
[null,"9-18"]
[null,"10-14"]
[null,"9-16:30"]
[]
[]
[]
[null,null,{"$f":"WEEKDAY(D12+2,2)","v":"1900-01-05"},"2015-04-30"]