{"text_format":"1","workbook":"xlsx","n_sheets":15,"sheets":["Arbejdes timer","Januar","Februar","Marts","April","MAJ","JUNI","JULI","AUGUST","SEPTEMBER","OKTOBER","NOVEMBER","DECEMBER","T","Ark1"],"not_rendered":{"charts":0,"images":0,"macros":1,"external_links":0,"defined_names":1,"comments":0,"pivot_tables":0},"unopened":[],"bounds":{"document_bytes":16777216,"sheet_cells":100000,"rows_first":2000,"rows_last":500,"rows_between":2000,"halvings":0,"cell_chars":16384,"cell_head_chars":4096},"cells_cut":0,"cells_raw":0,"read":"whole","date_system":"1900"}

{"sheet":"Arbejdes timer","index":0,"n_rows":45,"n_cols":38,"rows_kept":45,"cut":false,"hidden":false,"merged":[[0,21,0,23],[0,28,0,30],[0,35,0,37],[0,4,0,5],[0,7,0,9],[0,11,0,12],[0,18,0,19],[0,25,0,26],[0,32,0,33],[0,14,0,16]]}
[null,null,null,null,"Medarbejder",null,null,"Jacob",null,null,null,"Medarbejder",null,null,"Nina",null,null,null,"Medarbejder",null,null,"René",null,null,null,"Medarbejder",null,null,"Kirsten",null,null,null,"Medarbejder",null,null,"Erik"]
["Uge","Juni",2019,null,"Møde tid","Slut tid",null,"arb.tid","Overarbejde","Bemærkning",null,"Møde tid","Slut tid",null,"arb.tid","Overarbejde","Bemærkning",null,"Møde tid","Slut tid",null,"arb.tid","Overarbejde","Bemærkning",null,"Møde tid","Slut tid",null,"arb.tid","Overarbejde","Bemærkning",null,"Møde tid","Slut tid",null,"arb.tid","Overarbejde","Bemærkning"]
[{"$f":"IF(WEEKDAY(B3,2)=1,WEEKNUM(B3,2),\"\")","v":""},{"$f":"DATE(C2,MATCH(B2,T!D1:D12,0),1)","v":"2015-05-31"},{"$f":"VLOOKUP(WEEKDAY(B3,11),T!$G$1:$H$7,2)","v":"Lørdag"},{"$f":"HelligdagsNavn(B3,0,0)","v":""},"09:00:00","16:00:00",{"$f":"IF(INDEX(INDIRECT(\"'\"&$B$2&\"'!$A$2:$I$34\"),MATCH(B3,INDIRECT(\"'\"&$B$2&\"'!B2:$B$34\"),0),MATCH($H$1,INDIRECT(\"'\"&$B$2&\"'!$A$3:$I$3\"),0))=\"\",\"\",INDEX(INDIRECT(\"'\"&$B$2&\"'!$A$2:$I$34\"),MATCH(B3,INDIRECT(\"'\"&$B$2&\"'!B2:$B$34\"),0),MATCH($H$1,INDIRECT(\"'\"&$B$2&\"'!$A$3:$I$3\"),0)))","v":"9-18"},{"$f":"IF(AND(E3=\"\",F3=\"\"),\"\",F3-E3)","v":"07:00:00"},{"$f":"IFERROR(IF(AND(E3=\"\",F3=\"\"),\"\",IF(G3=\"\",F3-E3,F3-E3-((+CONCATENATE(MID(G3,SEARCH(\"-\",G3,1)+1,LEN(G3)-SEARCH(\"-\",G3,1)),\":\",0)-0)-+CONCATENATE(LEFT(G3,SEARCH(\"-\",G3,1)-1),\":\",0)-0))),\"\")","v":-8.333333333333337E-2},null,null,"09:00:00","18:00:00",null,{"$f":"M3-L3","v":"09:00:00"},{"$f":"IFERROR(IF(AND(L3=\"\",M3=\"\"),\"\",IF(INDIRECT(\"'\"&$B$2&\"'!f5\")=\"\",M3-L3,M3-L3-((+CONCATENATE(MID(INDIRECT(\"'\"&$B$2&\"'!f5\"),SEARCH(\"-\",INDIRECT(\"'\"&$B$2&\"'!f5\"),1)+1,LEN(INDIRECT(\"'\"&$B$2&\"'!f5\"))-SEARCH(\"-\",INDIRECT(\"'\"&$B$2&\"'!f5\"),1)),\":\",0)-0)-+CONCATENATE(LEFT(INDIRECT(\"'\"&$B$2&\"'!f5\"),SEARCH(\"-\",INDIRECT(\"'\"&$B$2&\"'!f5\"),1)-1),\":\",0)-0))),\"\")","v":"09:00:00"},null,null,"09:00:00","16:00:00",null,{"$f":"T3-S3","v":"07:00:00"},{"$f":"IFERROR(IF(AND(S3=\"\",T3=\"\"),\"\",IF(INDIRECT(\"'\"&$B$2&\"'!g5\")=\"\",T3-S3,T3-S3-((+CONCATENATE(MID(INDIRECT(\"'\"&$B$2&\"'!g5\"),SEARCH(\"-\",INDIRECT(\"'\"&$B$2&\"'!g5\"),1)+1,LEN(INDIRECT(\"'\"&$B$2&\"'!g5\"))-SEARCH(\"-\",INDIRECT(\"'\"&$B$2&\"'!g5\"),1)),\":\",0)-0)-+CONCATENATE(LEFT(INDIRECT(\"'\"&$B$2&\"'!g5\"),SEARCH(\"-\",INDIRECT(\"'\"&$B$2&\"'!g5\"),1)-1),\":\",0)-0))),\"\")","v":-2.083333333333337E-2},null,null,null,null,null,{"$f":"AA3-Z3","v":"00:00:00"},null,null,null,null,null,null,{"$f":"AH3-AG3","v":"00:00:00"}]
["",{"$f":"B3+1","v":"2015-06-01"},{"$f":"VLOOKUP(WEEKDAY(B4,11),T!$G$1:$H$7,2)","v":"Søndag"},"","09:00:00","19:00:00",{"$f":"IF(INDEX(INDIRECT(\"'\"&$B$2&\"'!$A$2:$I$34\"),MATCH(B4,INDIRECT(\"'\"&$B$2&\"'!B2:$B$34\"),0),MATCH($H$1,INDIRECT(\"'\"&$B$2&\"'!$A$3:$I$3\"),0))=\"\",\"\",INDEX(INDIRECT(\"'\"&$B$2&\"'!$A$2:$I$34\"),MATCH(B4,INDIRECT(\"'\"&$B$2&\"'!B2:$B$34\"),0),MATCH($H$1,INDIRECT(\"'\"&$B$2&\"'!$A$3:$I$3\"),0)))","v":""},"10:00:00",{"$f":"IFERROR(IF(AND(E4=\"\",F4=\"\"),\"\",IF(G4=\"\",F4-E4,F4-E4-((+CONCATENATE(MID(G4,SEARCH(\"-\",G4,1)+1,LEN(G4)-SEARCH(\"-\",G4,1)),\":\",0)-0)-+CONCATENATE(LEFT(G4,SEARCH(\"-\",G4,1)-1),\":\",0)-0))),\"\")","v":"10:00:00"},null,null,"09:00:00","16:30:00",null,{"$f":"M4-L4","v":"07:30:00"},{"$f":"IFERROR(IF(AND(L4=\"\",M4=\"\"),\"\",IF(INDIRECT(\"'\"&$B$2&\"'!f6\")=\"\",M4-L4,M4-L4-((+CONCATENATE(MID(INDIRECT(\"'\"&$B$2&\"'!f6\"),SEARCH(\"-\",INDIRECT(\"'\"&$B$2&\"'!f6\"),1)+1,LEN(INDIRECT(\"'\"&$B$2&\"'!f6\"))-SEARCH(\"-\",INDIRECT(\"'\"&$B$2&\"'!f6\"),1)),\":\",0)-0)-+CONCATENATE(LEFT(INDIRECT(\"'\"&$B$2&\"'!f6\"),SEARCH(\"-\",INDIRECT(\"'\"&$B$2&\"'!f6\"),1)-1),\":\",0)-0))),\"\")","v":-6.25E-2},null,null,null,null,null,{"$f":"T4-S4","v":"00:00:00"},"",null,null,null,null,null,{"$f":"AA4-Z4","v":"00:00:00"},null,null,null,null,null,null,{"$f":"AH4-AG4","v":"00:00:00"}]
[23,{"$f":"B4+1","v":"2015-06-02"},{"$f":"VLOOKUP(WEEKDAY(B5,11),T!$G$1:$H$7,2)","v":"Mandag"},"","09:00:00","18:00:00",{"$f":"IF(INDEX(INDIRECT(\"'\"&$B$2&\"'!$A$2:$I$34\"),MATCH(B5,INDIRECT(\"'\"&$B$2&\"'!B2:$B$34\"),0),MATCH($H$1,INDIRECT(\"'\"&$B$2&\"'!$A$3:$I$3\"),0))=\"\",\"\",INDEX(INDIRECT(\"'\"&$B$2&\"'!$A$2:$I$34\"),MATCH(B5,INDIRECT(\"'\"&$B$2&\"'!B2:$B$34\"),0),MATCH($H$1,INDIRECT(\"'\"&$B$2&\"'!$A$3:$I$3\"),0)))","v":"9-18"},"09:00:00",{"$f":"IFERROR(IF(AND(E5=\"\",F5=\"\"),\"\",IF(G5=\"\",F5-E5,F5-E5-((+CONCATENATE(MID(G5,SEARCH(\"-\",G5,1)+1,LEN(G5)-SEARCH(\"-\",G5,1)),\":\",0)-0)-+CONCATENATE(LEFT(G5,SEARCH(\"-\",G5,1)-1),\":\",0)-0))),\"\")","v":"00:00:00"},null,null,"09:00:00","15:00:00",null,"06:00:00",{"$f":"IFERROR(IF(AND(L5=\"\",M5=\"\"),\"\",IF(INDIRECT(\"'\"&$B$2&\"'!f7\")=\"\",M5-L5,M5-L5-((+CONCATENATE(MID(INDIRECT(\"'\"&$B$2&\"'!f7\"),SEARCH(\"-\",INDIRECT(\"'\"&$B$2&\"'!f7\"),1)+1,LEN(INDIRECT(\"'\"&$B$2&\"'!f7\"))-SEARCH(\"-\",INDIRECT(\"'\"&$B$2&\"'!f7\"),1)),\":\",0)-0)-+CONCATENATE(LEFT(INDIRECT(\"'\"&$B$2&\"'!f7\"),SEARCH(\"-\",INDIRECT(\"'\"&$B$2&\"'!f7\"),1)-1),\":\",0)-0))),\"\")","v":-0.125},null,null,null,null,null,"00:00:00","",null,null,null,null,null,"00:00:00",null,null,null,null,null,null,"00:00:00"]
["","2015-06-03",{"$f":"VLOOKUP(WEEKDAY(B6,11),T!$G$1:$H$7,2)","v":"Tirsdag"},"","08:00:00","12:00:00","9-15","04:00:00",{"$f":"IFERROR(IF(AND(E6=\"\",F6=\"\"),\"\",IF(G6=\"\",F6-E6,F6-E6-((+CONCATENATE(MID(G6,SEARCH(\"-\",G6,1)+1,LEN(G6)-SEARCH(\"-\",G6,1)),\":\",0)-0)-+CONCATENATE(LEFT(G6,SEARCH(\"-\",G6,1)-1),\":\",0)-0))),\"\")","v":-8.3333333333333315E-2},null,null,null,null,null,"00:00:00",{"$f":"IFERROR(IF(AND(L6=\"\",M6=\"\"),\"\",IF(INDIRECT(\"'\"&$B$2&\"'!e5\")=\"\",M6-L6,M6-L6-((+CONCATENATE(MID(INDIRECT(\"'\"&$B$2&\"'!e5\"),SEARCH(\"-\",INDIRECT(\"'\"&$B$2&\"'!e5\"),1)+1,LEN(INDIRECT(\"'\"&$B$2&\"'!e5\"))-SEARCH(\"-\",INDIRECT(\"'\"&$B$2&\"'!e5\"),1)),\":\",0)-0)-+CONCATENATE(LEFT(INDIRECT(\"'\"&$B$2&\"'!e5\"),SEARCH(\"-\",INDIRECT(\"'\"&$B$2&\"'!'Arbejdes timer'!e5\"),1)-1),\":\",0)-0))),\"\")","v":""},null,null,null,null,null,"00:00:00","",null,null,null,null,null,"00:00:00",null,null,null,null,null,null,"00:00:00"]
["","2015-06-04",{"$f":"VLOOKUP(WEEKDAY(B7,11),T!$G$1:$H$7,2)","v":"Onsdag"},"Grundlovsdag","09:00:00","18:00:00","10-14","09:00:00","05:00:00",null,null,null,null,null,"00:00:00",{"$f":"IFERROR(IF(AND(L7=\"\",M7=\"\"),\"\",IF(INDIRECT(\"'\"&$B$2&\"'!e5\")=\"\",M7-L7,M7-L7-((+CONCATENATE(MID(INDIRECT(\"'\"&$B$2&\"'!e5\"),SEARCH(\"-\",INDIRECT(\"'\"&$B$2&\"'!e5\"),1)+1,LEN(INDIRECT(\"'\"&$B$2&\"'!e5\"))-SEARCH(\"-\",INDIRECT(\"'\"&$B$2&\"'!e5\"),1)),\":\",0)-0)-+CONCATENATE(LEFT(INDIRECT(\"'\"&$B$2&\"'!e5\"),SEARCH(\"-\",INDIRECT(\"'\"&$B$2&\"'!'Arbejdes timer'!e5\"),1)-1),\":\",0)-0))),\"\")","v":""},null,null,null,null,null,"00:00:00","",null,null,null,null,null,"00:00:00",null,null,null,null,null,null,"00:00:00"]
["","2015-06-05",{"$f":"VLOOKUP(WEEKDAY(B8,11),T!$G$1:$H$7,2)","v":"Torsdag"},"","08:00:00","15:00:00","9-18","07:00:00",-8.3333333333333315E-2,null,null,null,null,null,"00:00:00",{"$f":"IFERROR(IF(AND(L8=\"\",M8=\"\"),\"\",IF(INDIRECT(\"'\"&$B$2&\"'!e5\")=\"\",M8-L8,M8-L8-((+CONCATENATE(MID(INDIRECT(\"'\"&$B$2&\"'!e5\"),SEARCH(\"-\",INDIRECT(\"'\"&$B$2&\"'!e5\"),1)+1,LEN(INDIRECT(\"'\"&$B$2&\"'!e5\"))-SEARCH(\"-\",INDIRECT(\"'\"&$B$2&\"'!e5\"),1)),\":\",0)-0)-+CONCATENATE(LEFT(INDIRECT(\"'\"&$B$2&\"'!e5\"),SEARCH(\"-\",INDIRECT(\"'\"&$B$2&\"'!'Arbejdes timer'!e5\"),1)-1),\":\",0)-0))),\"\")","v":""},null,null,null,null,null,"00:00:00","",null,null,null,null,null,"00:00:00",null,null,null,null,null,null,"00:00:00"]
["","2015-06-06",{"$f":"VLOOKUP(WEEKDAY(B9,11),T!$G$1:$H$7,2)","v":"Fredag"},"","10:00:00","16:00:00","",{"$f":"IF(AND(E9=\"\",F9=\"\"),\"\",F9-E9)","v":"06:00:00"},"06:00:00",null,null,null,null,null,"00:00:00",{"$f":"IFERROR(IF(AND(L9=\"\",M9=\"\"),\"\",IF(INDIRECT(\"'\"&$B$2&\"'!e5\")=\"\",M9-L9,M9-L9-((+CONCATENATE(MID(INDIRECT(\"'\"&$B$2&\"'!e5\"),SEARCH(\"-\",INDIRECT(\"'\"&$B$2&\"'!e5\"),1)+1,LEN(INDIRECT(\"'\"&$B$2&\"'!e5\"))-SEARCH(\"-\",INDIRECT(\"'\"&$B$2&\"'!e5\"),1)),\":\",0)-0)-+CONCATENATE(LEFT(INDIRECT(\"'\"&$B$2&\"'!e5\"),SEARCH(\"-\",INDIRECT(\"'\"&$B$2&\"'!'Arbejdes timer'!e5\"),1)-1),\":\",0)-0))),\"\")","v":""},null,null,null,null,null,"00:00:00","",null,null,null,null,null,"00:00:00",null,null,null,null,null,null,"00:00:00"]
[null," ",null,null,null,null,null,{"$f":"SUM(H3:H9)","v":2.1666666666666665},{"$f":"SUM(I3:I9)","v":0.62499999999999989},null,null,null,null,null,{"$f":"SUM(O3:O9)","v":0.9375},{"$f":"SUM(P3:P9)","v":0.1875}]
{"$rows_left_out":36}
{"sheet":"Januar","index":1,"n_rows":37,"n_cols":13,"rows_kept":37,"cut":false,"hidden":false,"merged":[[1,4,1,8]]}
[null,1]
[null,4,null,"Helligdage","Vagtskema",null,null,null,null,"Nina","2014-12-31"]
["Uge",{"$f":"VLOOKUP(B1,T!C1:D12,2,0)","v":"Januar"},{"$f":"'Arbejdes timer'!C2","v":2019},null,"Jacob","Nina","René","Kirsten","Erik",null,null,null,"René"]
[{"$f":"IF(WEEKDAY(B4,2)=1,WEEKNUM(B4,2),\"\")","v":""},{"$f":"DATE(C3,B1,1)","v":"2014-12-31"},{"$f":"VLOOKUP(WEEKDAY(B4,11),T!$G$1:$H$7,2)","v":"Tirsdag"},{"$f":"HelligdagsNavn(B4,0,0)","v":"Nytårsdag"},null,"9-18","9-16:30","9-16","9-17"]
[{"$f":"IF(WEEKDAY(B5,2)=1,WEEKNUM(B5,2),\"\")","v":""},{"$f":"B4+1","v":"2015-01-01"},{"$f":"VLOOKUP(WEEKDAY(B5,11),T!$G$1:$H$7,2)","v":"Onsdag"},{"$f":"HelligdagsNavn(B5,0,0)","v":""},"9-18",null,"9-16:30","8-14","9-17"]
["",{"$f":"B5+1","v":"2015-01-02"},{"$f":"VLOOKUP(WEEKDAY(B6,11),T!$G$1:$H$7,2)","v":"Torsdag"},"","9-18",null,"9-16:30","8-14","9-17"]
["","2015-01-03",{"$f":"VLOOKUP(WEEKDAY(B7,11),T!$G$1:$H$7,2)","v":"Fredag"},"",null,"9-18","9-16:30","8-14","9-17"]
["","2015-01-04",{"$f":"VLOOKUP(WEEKDAY(B8,11),T!$G$1:$H$7,2)","v":"Lørdag"},"","9-18","9-18","9-16:30","8-14","9-17"]
["","2015-01-05",{"$f":"VLOOKUP(WEEKDAY(B9,11),T!$G$1:$H$7,2)","v":"Søndag"},"Helligtrekongersdag","9-15"]
[2,"2015-01-06",{"$f":"VLOOKUP(WEEKDAY(B10,11),T!$G$1:$H$7,2)","v":"Mandag"},"","10-14"]
{"$rows_left_out":28}
{"sheet":"Februar","index":2,"n_rows":34,"n_cols":10,"rows_kept":34,"cut":false,"hidden":false,"merged":[[1,4,1,8]]}
[null,2]
[null,4,null,"Helligdage","Vagtskema"]
["Uge",{"$f":"VLOOKUP(B1,T!C1:D12,2,0)","v":"Februar"},{"$f":"'Arbejdes timer'!C2","v":2019},null,"Jacob","Nina","René","Kirsten","Erik"]
[{"$f":"IF(WEEKDAY(B4,2)=1,WEEKNUM(B4,2),\"\")","v":""},{"$f":"DATE(C3,B1,1)","v":"2015-01-31"},{"$f":"VLOOKUP(WEEKDAY(B4,11),T!$G$1:$H$7,2)","v":"Fredag"},{"$f":"HelligdagsNavn(B4,0,0)","v":""},null,"9-18","9-16:30","9-16","9-17"]
[{"$f":"IF(WEEKDAY(B5,2)=1,WEEKNUM(B5,2),\"\")","v":""},{"$f":"B4+1","v":"2015-02-01"},{"$f":"VLOOKUP(WEEKDAY(B5,11),T!$G$1:$H$7,2)","v":"Lørdag"},{"$f":"HelligdagsNavn(B5,0,0)","v":"Maria Renselsesdag"},"9-18",null,"9-16:30","8-14","9-17"]
["",{"$f":"B5+1","v":"2015-02-02"},{"$f":"VLOOKUP(WEEKDAY(B6,11),T!$G$1:$H$7,2)","v":"Søndag"},"","9-18",null,"9-16:30","8-14","9-17"]
[6,"2015-02-03",{"$f":"VLOOKUP(WEEKDAY(B7,11),T!$G$1:$H$7,2)","v":"Mandag"},"",null,"9-18","9-16:30","8-14","9-17"]
["","2015-02-04",{"$f":"VLOOKUP(WEEKDAY(B8,11),T!$G$1:$H$7,2)","v":"Tirsdag"},"","9-18","9-18","9-16:30","8-14","9-17"]
["","2015-02-05",{"$f":"VLOOKUP(WEEKDAY(B9,11),T!$G$1:$H$7,2)","v":"Onsdag"},"","9-15"]
["","2015-02-06",{"$f":"VLOOKUP(WEEKDAY(B10,11),T!$G$1:$H$7,2)","v":"Torsdag"},"","10-14"]
{"$rows_left_out":25}
{"sheet":"Marts","index":3,"n_rows":35,"n_cols":9,"rows_kept":35,"cut":false,"hidden":false,"merged":[[1,4,1,8]]}
[null,3]
[null,4,null,"Helligdage","Vagtskema"]
["Uge",{"$f":"VLOOKUP(B1,T!C1:D12,2,0)","v":"Marts"},{"$f":"'Arbejdes timer'!C2","v":2019},null,"Jacob","Nina","René","Kirsten","Erik"]
[]
[{"$f":"IF(WEEKDAY(B5,2)=1,WEEKNUM(B5,2),\"\")","v":""},{"$f":"DATE(C3,B1,1)","v":"2015-02-28"},{"$f":"VLOOKUP(WEEKDAY(B5,11),T!$G$1:$H$7,2)","v":"Fredag"},{"$f":"HelligdagsNavn(B5,0,0)","v":""},null,"9-18","9-16:30","9-16","9-17"]
[{"$f":"IF(WEEKDAY(B6,2)=1,WEEKNUM(B6,2),\"\")","v":""},{"$f":"B5+1","v":"2015-03-01"},{"$f":"VLOOKUP(WEEKDAY(B6,11),T!$G$1:$H$7,2)","v":"Lørdag"},{"$f":"HelligdagsNavn(B6,0,0)","v":""},"9-18",null,"9-16:30","8-14","9-17"]
["",{"$f":"B6+1","v":"2015-03-02"},{"$f":"VLOOKUP(WEEKDAY(B7,11),T!$G$1:$H$7,2)","v":"Søndag"},"Fastelavn","9-18",null,"9-16:30","8-14","9-17"]
[10,"2015-03-03",{"$f":"VLOOKUP(WEEKDAY(B8,11),T!$G$1:$H$7,2)","v":"Mandag"},"",null,"9-18","9-16:30","8-14","9-17"]
["","2015-03-04",{"$f":"VLOOKUP(WEEKDAY(B9,11),T!$G$1:$H$7,2)","v":"Tirsdag"},"","9-18","9-18","9-16:30","8-14","9-17"]
["","2015-03-05",{"$f":"VLOOKUP(WEEKDAY(B10,11),T!$G$1:$H$7,2)","v":"Onsdag"},"","9-15"]
{"$rows_left_out":26}
{"sheet":"April","index":4,"n_rows":35,"n_cols":9,"rows_kept":35,"cut":false,"hidden":false,"merged":[[1,4,1,8]]}
[null,4]
[null,4,null,"Helligdage","Vagtskema"]
["Uge","APRIL",{"$f":"'Arbejdes timer'!C2","v":2019},null,"Jacob","Nina","René","Kirsten","Erik"]
[]
[{"$f":"IF(WEEKDAY(B5,2)=1,WEEKNUM(B5,2),\"\")","v":14},{"$f":"DATE(C3,B1,1)","v":"2015-03-31"},{"$f":"VLOOKUP(WEEKDAY(B5,11),T!$G$1:$H$7,2)","v":"Mandag"},{"$f":"HelligdagsNavn(B5,0,0)","v":""},null,"9-18","9-16:30","9-16","9-17"]
[{"$f":"IF(WEEKDAY(B6,2)=1,WEEKNUM(B6,2),\"\")","v":""},{"$f":"B5+1","v":"2015-04-01"},{"$f":"VLOOKUP(WEEKDAY(B6,11),T!$G$1:$H$7,2)","v":"Tirsdag"},{"$f":"HelligdagsNavn(B6,0,0)","v":""},"9-18",null,"9-16:30","8-14","9-17"]
["",{"$f":"B6+1","v":"2015-04-02"},{"$f":"VLOOKUP(WEEKDAY(B7,11),T!$G$1:$H$7,2)","v":"Onsdag"},"","9-18",null,"9-16:30","8-14","9-17"]
["","2015-04-03",{"$f":"VLOOKUP(WEEKDAY(B8,11),T!$G$1:$H$7,2)","v":"Torsdag"},"",null,"9-18","9-16:30","8-14","9-17"]
["","2015-04-04",{"$f":"VLOOKUP(WEEKDAY(B9,11),T!$G$1:$H$7,2)","v":"Fredag"},"","9-18","9-18","9-16:30","8-14","9-17"]
["","2015-04-05",{"$f":"VLOOKUP(WEEKDAY(B10,11),T!$G$1:$H$7,2)","v":"Lørdag"},"","9-15"]
{"$rows_left_out":26}
{"sheet":"MAJ","index":5,"n_rows":37,"n_cols":9,"rows_kept":37,"cut":false,"hidden":false,"merged":[[1,4,1,8]]}
[null,5]
[null,null," ","bemærkninger","Vagtskema"]
["Uge",{"$f":"VLOOKUP(B1,T!C1:D12,2,0)","v":"Maj"},{"$f":"'Arbejdes timer'!C2","v":2019},null,"Jacob","Nina","René","Kirsten","Erik"]
[null,null,null,{"$f":"EOMONTH(DATE(C3,B1,1),-1)","v":"2015-04-29"}]
[{"$f":"IF(WEEKDAY(B5,2)=1,WEEKNUM(B5,2),\"\")","v":""},{"$f":"DATE(C3,B1,1)","v":"2015-04-30"},{"$f":"VLOOKUP(WEEKDAY(B5,11),T!$G$1:$H$7,2)","v":"Onsdag"},{"$f":"HelligdagsNavn(B5,0,0)","v":""},"9-18",null,"9-16:30","8-14","9-17"]
[{"$f":"IF(WEEKDAY(B6,2)=1,WEEKNUM(B6,2),\"\")","v":""},{"$f":"B5+1","v":"2015-05-01"},{"$f":"VLOOKUP(WEEKDAY(B6,11),T!$G$1:$H$7,2)","v":"Torsdag"},{"$f":"HelligdagsNavn(B6,0,0)","v":""},null,"9-18","9-16:30","8-14","9-17"]
["",{"$f":"B6+1","v":"2015-05-02"},{"$f":"VLOOKUP(WEEKDAY(B7,11),T!$G$1:$H$7,2)","v":"Fredag"},"","9-18","9-18","9-16:30","8-14","9-17"]
["",{"$f":"B7+1","v":"2015-05-03"},{"$f":"VLOOKUP(WEEKDAY(B8,11),T!$G$1:$H$7,2)","v":"Lørdag"},"","9-15"]
["","2015-05-04",{"$f":"VLOOKUP(WEEKDAY(B9,11),T!$G$1:$H$7,2)","v":"Søndag"},"","10-14"]
[19,{"$f":"B9+1","v":"2015-05-05"},{"$f":"VLOOKUP(WEEKDAY(B10,11),T!$G$1:$H$7,2)","v":"Mandag"},"","9-18",null,"9-16:30","9-16","9-17"]
{"$rows_left_out":28}
{"sheet":"JUNI","index":6,"n_rows":35,"n_cols":9,"rows_kept":35,"cut":false,"hidden":false,"merged":[[1,4,1,8]]}
[null,6]
[null,null," ","Bemærkninger","Vagtskema"]
["Uge",{"$f":"VLOOKUP(B1,T!C1:D12,2,0)","v":"Juni"},{"$f":"'Arbejdes timer'!C2","v":2019},null,"Jacob","Nina","René","Kirsten","Erik"]
[null,null,null,{"$f":"EOMONTH(DATE(C3,B1,1),-1)","v":"2015-05-30"}]
[{"$f":"IF(WEEKDAY(B5,2)=1,WEEKNUM(B5,2),\"\")","v":""},{"$f":"DATE(C3,B1,1)","v":"2015-05-31"},{"$f":"VLOOKUP(WEEKDAY(B5,11),T!$G$1:$H$7,2)","v":"Lørdag"},{"$f":"HelligdagsNavn(B5,0,0)","v":""},"9-18",null,"9-16:30","8-14","9-17"]
[{"$f":"IF(WEEKDAY(B6,2)=1,WEEKNUM(B6,2),\"\")","v":""},{"$f":"B5+1","v":"2015-06-01"},{"$f":"VLOOKUP(WEEKDAY(B6,11),T!$G$1:$H$7,2)","v":"Søndag"},{"$f":"HelligdagsNavn(B6,0,0)","v":""},null,"9-18","9-16:30","8-14","9-17"]
[23,{"$f":"B6+1","v":"2015-06-02"},{"$f":"VLOOKUP(WEEKDAY(B7,11),T!$G$1:$H$7,2)","v":"Mandag"},"","9-18","9-18","9-16:30","8-14","9-17"]
["",{"$f":"B7+1","v":"2015-06-03"},{"$f":"VLOOKUP(WEEKDAY(B8,11),T!$G$1:$H$7,2)","v":"Tirsdag"},"","9-15"]
["","2015-06-04",{"$f":"VLOOKUP(WEEKDAY(B9,11),T!$G$1:$H$7,2)","v":"Onsdag"},"Grundlovsdag","10-14"]
["",{"$f":"B9+1","v":"2015-06-05"},{"$f":"VLOOKUP(WEEKDAY(B10,11),T!$G$1:$H$7,2)","v":"Torsdag"},"","9-18",null,"9-16:30","9-16","9-17"]
{"$rows_left_out":26}
{"sheet":"JULI","index":7,"n_rows":35,"n_cols":9,"rows_kept":35,"cut":false,"hidden":false,"merged":[[1,4,1,8]]}
[null,7]
[null,null," ","bemærkninger","Vagtskema"]
["Uge",{"$f":"VLOOKUP(B1,T!C1:D12,2,0)","v":"Juli"},{"$f":"'Arbejdes timer'!C2","v":2019},null,"Jacob","Nina","René","Kirsten","Erik"]
[null,null,null,{"$f":"EOMONTH(DATE(C3,B1,1),-1)","v":"2015-06-29"}]
[{"$f":"IF(WEEKDAY(B5,2)=1,WEEKNUM(B5,2),\"\")","v":27},{"$f":"DATE(C3,B1,1)","v":"2015-06-30"},{"$f":"VLOOKUP(WEEKDAY(B5,11),T!$G$1:$H$7,2)","v":"Mandag"},{"$f":"HelligdagsNavn(B5,0,0)","v":""},"9-18",null,"9-16:30","8-14","9-17"]
[{"$f":"IF(WEEKDAY(B6,2)=1,WEEKNUM(B6,2),\"\")","v":""},{"$f":"B5+1","v":"2015-07-01"},{"$f":"VLOOKUP(WEEKDAY(B6,11),T!$G$1:$H$7,2)","v":"Tirsdag"},{"$f":"HelligdagsNavn(B6,0,0)","v":"Maria Besøgelsesdag"},null,"9-18","9-16:30","8-14","9-17"]
["",{"$f":"B6+1","v":"2015-07-02"},{"$f":"VLOOKUP(WEEKDAY(B7,11),T!$G$1:$H$7,2)","v":"Onsdag"},"","9-18","9-18","9-16:30","8-14","9-17"]
["",{"$f":"B7+1","v":"2015-07-03"},{"$f":"VLOOKUP(WEEKDAY(B8,11),T!$G$1:$H$7,2)","v":"Torsdag"},"","9-15"]
["","2015-07-04",{"$f":"VLOOKUP(WEEKDAY(B9,11),T!$G$1:$H$7,2)","v":"Fredag"},"","10-14"]
["",{"$f":"B9+1","v":"2015-07-05"},{"$f":"VLOOKUP(WEEKDAY(B10,11),T!$G$1:$H$7,2)","v":"Lørdag"},"","9-18",null,"9-16:30","9-16","9-17"]
{"$rows_left_out":26}
{"sheet":"AUGUST","index":8,"n_rows":35,"n_cols":9,"rows_kept":35,"cut":false,"hidden":false,"merged":[[1,4,1,8]]}
[null,8]
[null,null," ","bemærkninger","Vagtskema"]
["Uge",{"$f":"VLOOKUP(B1,T!C1:D12,2,0)","v":"August"},{"$f":"'Arbejdes timer'!C2","v":2019},null,"Jacob","Nina","René","Kirsten","Erik"]
[null,null,null,{"$f":"EOMONTH(DATE(C3,B1,1),-1)","v":"2015-07-30"}]
[{"$f":"IF(WEEKDAY(B5,2)=1,WEEKNUM(B5,2),\"\")","v":""},{"$f":"DATE(C3,B1,1)","v":"2015-07-31"},{"$f":"VLOOKUP(WEEKDAY(B5,11),T!$G$1:$H$7,2)","v":"Torsdag"},{"$f":"HelligdagsNavn(B5,0,0)","v":""},"9-18",null,"9-16:30","8-14","9-17"]
[{"$f":"IF(WEEKDAY(B6,2)=1,WEEKNUM(B6,2),\"\")","v":""},{"$f":"B5+1","v":"2015-08-01"},{"$f":"VLOOKUP(WEEKDAY(B6,11),T!$G$1:$H$7,2)","v":"Fredag"},{"$f":"HelligdagsNavn(B6,0,0)","v":""},null,"9-18","9-16:30","8-14","9-17"]
["",{"$f":"B6+1","v":"2015-08-02"},{"$f":"VLOOKUP(WEEKDAY(B7,11),T!$G$1:$H$7,2)","v":"Lørdag"},"","9-18","9-18","9-16:30","8-14","9-17"]
["",{"$f":"B7+1","v":"2015-08-03"},{"$f":"VLOOKUP(WEEKDAY(B8,11),T!$G$1:$H$7,2)","v":"Søndag"},"","9-15"]
[32,"2015-08-04",{"$f":"VLOOKUP(WEEKDAY(B9,11),T!$G$1:$H$7,2)","v":"Mandag"},"","10-14"]
["",{"$f":"B9+1","v":"2015-08-05"},{"$f":"VLOOKUP(WEEKDAY(B10,11),T!$G$1:$H$7,2)","v":"Tirsdag"},"","9-18",null,"9-16:30","9-16","9-17"]
{"$rows_left_out":26}
{"sheet":"SEPTEMBER","index":9,"n_rows":35,"n_cols":9,"rows_kept":35,"cut":false,"hidden":false,"merged":[[1,4,1,8]]}
[null,9]
[null,null," ","bemærkninger","Vagtskema"]
["Uge",{"$f":"VLOOKUP(B1,T!C1:D12,2,0)","v":"September"},{"$f":"'Arbejdes timer'!C2","v":2019},null,"Jacob","Nina","René","Kirsten","Erik"]
[null,null,null,{"$f":"EOMONTH(DATE(C3,B1,1),-1)","v":"2015-08-30"}]
[{"$f":"IF(WEEKDAY(B5,2)=1,WEEKNUM(B5,2),\"\")","v":""},{"$f":"DATE(C3,B1,1)","v":"2015-08-31"},{"$f":"VLOOKUP(WEEKDAY(B5,11),T!$G$1:$H$7,2)","v":"Søndag"},{"$f":"HelligdagsNavn(B5,0,0)","v":""},"9-18",null,"9-16:30","8-14","9-17"]
[{"$f":"IF(WEEKDAY(B6,2)=1,WEEKNUM(B6,2),\"\")","v":36},{"$f":"B5+1","v":"2015-09-01"},{"$f":"VLOOKUP(WEEKDAY(B6,11),T!$G$1:$H$7,2)","v":"Mandag"},{"$f":"HelligdagsNavn(B6,0,0)","v":""},null,"9-18","9-16:30","8-14","9-17"]
["",{"$f":"B6+1","v":"2015-09-02"},{"$f":"VLOOKUP(WEEKDAY(B7,11),T!$G$1:$H$7,2)","v":"Tirsdag"},"","9-18","9-18","9-16:30","8-14","9-17"]
["",{"$f":"B7+1","v":"2015-09-03"},{"$f":"VLOOKUP(WEEKDAY(B8,11),T!$G$1:$H$7,2)","v":"Onsdag"},"","9-15"]
["","2015-09-04",{"$f":"VLOOKUP(WEEKDAY(B9,11),T!$G$1:$H$7,2)","v":"Torsdag"},"","10-14"]
["",{"$f":"B9+1","v":"2015-09-05"},{"$f":"VLOOKUP(WEEKDAY(B10,11),T!$G$1:$H$7,2)","v":"Fredag"},"","9-18",null,"9-16:30","9-16","9-17"]
{"$rows_left_out":26}
{"sheet":"OKTOBER","index":10,"n_rows":35,"n_cols":9,"rows_kept":35,"cut":false,"hidden":false,"merged":[[1,4,1,8]]}
[null,10]
[null,null," ","bemærkninger","Vagtskema"]
["Uge",{"$f":"VLOOKUP(B1,T!C1:D12,2,0)","v":"Oktober"},{"$f":"'Arbejdes timer'!C2","v":2019},null,"Jacob","Nina","René","Kirsten","Erik"]
[null,null,null,{"$f":"EOMONTH(DATE(C3,B1,1),-1)","v":"2015-09-29"}]
[{"$f":"IF(WEEKDAY(B5,2)=1,WEEKNUM(B5,2),\"\")","v":""},{"$f":"DATE(C3,B1,1)","v":"2015-09-30"},{"$f":"VLOOKUP(WEEKDAY(B5,11),T!$G$1:$H$7,2)","v":"Tirsdag"},{"$f":"HelligdagsNavn(B5,0,0)","v":""},"9-18",null,"9-16:30","8-14","9-17"]
[{"$f":"IF(WEEKDAY(B6,2)=1,WEEKNUM(B6,2),\"\")","v":""},{"$f":"B5+1","v":"2015-10-01"},{"$f":"VLOOKUP(WEEKDAY(B6,11),T!$G$1:$H$7,2)","v":"Onsdag"},{"$f":"HelligdagsNavn(B6,0,0)","v":""},null,"9-18","9-16:30","8-14","9-17"]
["",{"$f":"B6+1","v":"2015-10-02"},{"$f":"VLOOKUP(WEEKDAY(B7,11),T!$G$1:$H$7,2)","v":"Torsdag"},"","9-18","9-18","9-16:30","8-14","9-17"]
["",{"$f":"B7+1","v":"2015-10-03"},{"$f":"VLOOKUP(WEEKDAY(B8,11),T!$G$1:$H$7,2)","v":"Fredag"},"","9-15"]
["","2015-10-04",{"$f":"VLOOKUP(WEEKDAY(B9,11),T!$G$1:$H$7,2)","v":"Lørdag"},"","10-14"]
["",{"$f":"B9+1","v":"2015-10-05"},{"$f":"VLOOKUP(WEEKDAY(B10,11),T!$G$1:$H$7,2)","v":"Søndag"},"","9-18",null,"9-16:30","9-16","9-17"]
{"$rows_left_out":26}
{"sheet":"NOVEMBER","index":11,"n_rows":35,"n_cols":9,"rows_kept":35,"cut":false,"hidden":false,"merged":[[1,4,1,8]]}
[null,11]
[null,null," ","bemærkninger","Vagtskema"]
["Uge",{"$f":"VLOOKUP(B1,T!C1:D12,2,0)","v":"November"},{"$f":"'Arbejdes timer'!C2","v":2019},null,"Jacob","Nina","René","Kirsten","Erik"]
[null,null,null,{"$f":"EOMONTH(DATE(C3,B1,1),-1)","v":"2015-10-30"}]
[{"$f":"IF(WEEKDAY(B5,2)=1,WEEKNUM(B5,2),\"\")","v":""},{"$f":"DATE(C3,B1,1)","v":"2015-10-31"},{"$f":"VLOOKUP(WEEKDAY(B5,11),T!$G$1:$H$7,2)","v":"Fredag"},{"$f":"HelligdagsNavn(B5,0,0)","v":"AlleHelgensdag"},"9-18",null,"9-16:30","8-14","9-17"]
[{"$f":"IF(WEEKDAY(B6,2)=1,WEEKNUM(B6,2),\"\")","v":""},{"$f":"B5+1","v":"2015-11-01"},{"$f":"VLOOKUP(WEEKDAY(B6,11),T!$G$1:$H$7,2)","v":"Lørdag"},{"$f":"HelligdagsNavn(B6,0,0)","v":"AlleSjælesdag"},null,"9-18","9-16:30","8-14","9-17"]
["",{"$f":"B6+1","v":"2015-11-02"},{"$f":"VLOOKUP(WEEKDAY(B7,11),T!$G$1:$H$7,2)","v":"Søndag"},"","9-18","9-18","9-16:30","8-14","9-17"]
[45,{"$f":"B7+1","v":"2015-11-03"},{"$f":"VLOOKUP(WEEKDAY(B8,11),T!$G$1:$H$7,2)","v":"Mandag"},"","9-15"]
["","2015-11-04",{"$f":"VLOOKUP(WEEKDAY(B9,11),T!$G$1:$H$7,2)","v":"Tirsdag"},"","10-14"]
["",{"$f":"B9+1","v":"2015-11-05"},{"$f":"VLOOKUP(WEEKDAY(B10,11),T!$G$1:$H$7,2)","v":"Onsdag"},"","9-18",null,"9-16:30","9-16","9-17"]
{"$rows_left_out":26}
{"sheet":"DECEMBER","index":12,"n_rows":35,"n_cols":9,"rows_kept":35,"cut":false,"hidden":false,"merged":[[1,4,1,8]]}
[null,12]
[null,null," ","bemærkninger","Vagtskema"]
["Uge",{"$f":"VLOOKUP(B1,T!C1:D12,2,0)","v":"December"},{"$f":"'Arbejdes timer'!C2","v":2019},null,"Jacob","Nina","René","Kirsten","Erik"]
[null,null,null,{"$f":"EOMONTH(DATE(C3,B1,1),-1)","v":"2015-11-29"}]
[{"$f":"IF(WEEKDAY(B5,2)=1,WEEKNUM(B5,2),\"\")","v":""},{"$f":"DATE(C3,B1,1)","v":"2015-11-30"},{"$f":"VLOOKUP(WEEKDAY(B5,11),T!$G$1:$H$7,2)","v":"Søndag"},{"$f":"HelligdagsNavn(B5,0,0)","v":""},"9-18",null,"9-16:30","8-14","9-17"]
[{"$f":"IF(WEEKDAY(B6,2)=1,WEEKNUM(B6,2),\"\")","v":49},{"$f":"B5+1","v":"2015-12-01"},{"$f":"VLOOKUP(WEEKDAY(B6,11),T!$G$1:$H$7,2)","v":"Mandag"},{"$f":"HelligdagsNavn(B6,0,0)","v":""},null,"9-18","9-16:30","8-14","9-17"]
["",{"$f":"B6+1","v":"2015-12-02"},{"$f":"VLOOKUP(WEEKDAY(B7,11),T!$G$1:$H$7,2)","v":"Tirsdag"},"","9-18","9-18","9-16:30","8-14","9-17"]
["",{"$f":"B7+1","v":"2015-12-03"},{"$f":"VLOOKUP(WEEKDAY(B8,11),T!$G$1:$H$7,2)","v":"Onsdag"},"","9-15"]
["","2015-12-04",{"$f":"VLOOKUP(WEEKDAY(B9,11),T!$G$1:$H$7,2)","v":"Torsdag"},"","10-14"]
["",{"$f":"B9+1","v":"2015-12-05"},{"$f":"VLOOKUP(WEEKDAY(B10,11),T!$G$1:$H$7,2)","v":"Fredag"},"","9-18",null,"9-16:30","9-16","9-17"]
{"$rows_left_out":26}
{"sheet":"T","index":13,"n_rows":25,"n_cols":11,"rows_kept":25,"cut":false,"hidden":false,"merged":[]}
["Norm timer","07:24:00",1,"Januar",1,"November",1,"Mandag"]
[null,null,2,"Februar",2,null,2,"Tirsdag"]
[null,null,3,"Marts",3,null,3,"Onsdag"]
[null,null,4,"April",4,null,4,"Torsdag"]
[null,null,5,"Maj",5,null,5,"Fredag"]
[null,null,6,"Juni",6,null,6,"Lørdag"]
[null,null,7,"Juli",7,null,7,"Søndag"]
[null,null,8,"August",8]
[null,null,9,"September",9]
[null,null,10,"Oktober",10]
{"$rows_left_out":16}
{"sheet":"Ark1","index":14,"n_rows":12,"n_cols":4,"rows_kept":12,"cut":false,"hidden":false,"merged":[]}
[]
[null,"09:00:00","18:00:00",{"$f":"TEXT(B2,\"T:mm\")&\"-\"&TEXT(C2,\"t\")","v":"9:00-18"}]
[null,"09:00:00","16:30:00",{"$f":"TEXT(B3,\"T\")&\"-\"&TEXT(C3,\"t:mm\")","v":"9-16:30"}]
[]
[]
[null,"9-18"]
[null,"10-14"]
[null,"9-16:30"]
[]
[]
{"$rows_left_out":2}