{"text_format":"1","workbook":"xlsx","n_sheets":9,"sheets":["Januar","Februar","Marts","April","December","Januar (2)","T.","norm","helligdage"],"not_rendered":{"charts":0,"images":1,"macros":1,"external_links":1,"defined_names":7,"comments":0,"pivot_tables":0},"unopened":[],"bounds":{"document_bytes":16777216,"sheet_cells":100000,"rows_first":2000,"rows_last":500,"rows_between":2000,"halvings":0,"cell_chars":16384,"cell_head_chars":4096},"cells_cut":0,"cells_raw":0,"read":"whole","date_system":"1900"}

{"sheet":"Januar","index":0,"n_rows":41,"n_cols":14,"rows_kept":41,"cut":false,"hidden":false,"merged":[[1,1,2,1],[1,2,2,2],[1,4,2,4],[1,5,2,5],[1,6,2,6],[40,8,40,9],[39,4,39,5],[39,8,39,9],[38,7,38,8],[1,9,1,10],[1,7,2,7],[1,8,2,8],[3,0,9,0],[10,0,16,0],[17,0,23,0],[24,0,30,0],[31,0,37,0]]}
[]
[null,"Dag","Dato",null,"Tekst","Komme","Gå","Dagens\n tid","Pause","Effektiv\n arbejdstid"]
[null,null,null,null,null,null,null,null,null,"tt:mm","1/100"]
[null,{"$f":"WEEKDAY(C4)","v":"1900-01-02"},"2018-01-01",{"$f":"HelligdagsNavn(C4,0,0)","v":"Nytårsdag"},null,"07:00:00","15:30:00",{"$f":"IF(OR(F4=\"\",G4=\"\"),\"\",IF(G4<F4,G4+1-F4,G4-F4))","v":"08:30:00"},"00:31:00",{"$f":"IF(E4=\"ferie\",norm!$B$11/24,IF(OR(F4=\"\",G4=\"\"),\"\",H4-I4))","v":"07:59:00"},{"$f":"IFERROR(J4*24,\"\")","v":7.9833333333333343}]
[null,{"$f":"WEEKDAY(C5)","v":"1900-01-03"},{"$f":"C4+1","v":"2018-01-02"},{"$f":"HelligdagsNavn(C5,0,0)","v":""},"ferie",null,null,{"$f":"IF(OR(F5=\"\",G5=\"\"),\"\",IF(G5<F5,G5+1-F5,G5-F5))","v":""},null,{"$f":"IF(E5=\"ferie\",norm!$B$11/24,IF(OR(F5=\"\",G5=\"\"),\"\",H5-I5))","v":"07:24:00"},{"$f":"IFERROR(J5*24,\"\")","v":7.4}]
[null,"1900-01-04",{"$f":"C5+1","v":"2018-01-03"},"","afsp.",null,null,{"$f":"IF(OR(F6=\"\",G6=\"\"),\"\",IF(G6<F6,G6+1-F6,G6-F6))","v":""},null,{"$f":"IF(E6=\"ferie\",norm!$B$11/24,IF(OR(F6=\"\",G6=\"\"),\"\",H6-I6))","v":""},{"$f":"IFERROR(J6*24,\"\")","v":""}]
[null,"1900-01-05","2018-01-04","",null,"07:00:00","15:00:00",{"$f":"IF(OR(F7=\"\",G7=\"\"),\"\",IF(G7<F7,G7+1-F7,G7-F7))","v":"08:00:00"},null,{"$f":"IF(E7=\"ferie\",norm!$B$11/24,IF(OR(F7=\"\",G7=\"\"),\"\",H7-I7))","v":"08:00:00"},{"$f":"IFERROR(J7*24,\"\")","v":8}]
[null,"1900-01-06","2018-01-05","","ferie",null,null,{"$f":"IF(OR(F8=\"\",G8=\"\"),\"\",IF(G8<F8,G8+1-F8,G8-F8))","v":""},null,{"$f":"IF(E8=\"ferie\",norm!$B$11/24,IF(OR(F8=\"\",G8=\"\"),\"\",H8-I8))","v":"07:24:00"},{"$f":"IFERROR(J8*24,\"\")","v":7.4}]
[null,"1900-01-07","2018-01-06","",null,null,null,null,null,{"$f":"IF(E9=\"ferie\",norm!$B$11/24,IF(OR(F9=\"\",G9=\"\"),\"\",H9-I9))","v":""}]
[null,"1900-01-01","2018-01-07","",null,null,null,null,null,{"$f":"IF(E10=\"ferie\",norm!$B$11/24,IF(OR(F10=\"\",G10=\"\"),\"\",H10-I10))","v":""}]
{"$rows_left_out":32}
{"sheet":"Februar","index":1,"n_rows":41,"n_cols":24,"rows_kept":41,"cut":false,"hidden":false,"merged":[[39,7,39,8],[40,7,40,8],[38,7,38,8],[30,0,36,0],[2,0,8,0],[9,0,15,0],[16,0,22,0],[23,0,29,0],[37,7,37,8]]}
[]
[null,"Dag","Dato",null,"Tekst","Komme","Gå","Dagens\ntid","Pause","Effektiv\n arbejdstid",null,null,null,null,null,null,null,null,null,null,null,"Skudår","uge \nnorm","dags \nnorm"]
[null,{"$f":"WEEKDAY(C3)","v":"1900-01-05"},{"$f":"DATE(YEAR(Januar!$C$4),2,1)","v":"2018-02-01"},null,null,"07:00:00","15:30:00",{"$f":"IF(OR(F3=\"\",G3=\"\"),\"\",IF(G3<F3,G3+1-F3,G3-F3))","v":"08:30:00"},null,{"$f":"IF(E3=\"ferie\",$X$3/24,IF(OR(F3=\"\",G3=\"\"),\"\",H3-I3))","v":"08:30:00"},null,null,null,null,null,null,null,null,null,null,null,null,37,7.4]
[null,{"$f":"WEEKDAY(C4)","v":"1900-01-06"},{"$f":"C3+1","v":"2018-02-02"},null,"ferie",null,null,{"$f":"IF(OR(F4=\"\",G4=\"\"),\"\",IF(G4<F4,G4+1-F4,G4-F4))","v":""},null,"07:24:00"]
[null,"1900-01-07",{"$f":"C4+1","v":"2018-02-03"},null,"afsp.",null,null,{"$f":"IF(OR(F5=\"\",G5=\"\"),\"\",IF(G5<F5,G5+1-F5,G5-F5))","v":""},null,""]
[null,"1900-01-01","2018-02-04",null,null,"07:00:00","15:00:00",{"$f":"IF(OR(F6=\"\",G6=\"\"),\"\",IF(G6<F6,G6+1-F6,G6-F6))","v":"08:00:00"},null,"08:00:00"]
[null,"1900-01-02","2018-02-05",null,"ferie",null,null,{"$f":"IF(OR(F7=\"\",G7=\"\"),\"\",IF(G7<F7,G7+1-F7,G7-F7))","v":""},null,"07:24:00"]
[null,"1900-01-03","2018-02-06",null,null,null,null,null,null,""]
[null,"1900-01-04","2018-02-07",null,null,null,null,null,null,""]
[null,"1900-01-05","2018-02-08",null,null,"07:00:00","15:30:00",{"$f":"IF(OR(F10=\"\",G10=\"\"),\"\",IF(G10<F10,G10+1-F10,G10-F10))","v":"08:30:00"},null,"08:30:00"]
{"$rows_left_out":32}
{"sheet":"Marts","index":2,"n_rows":40,"n_cols":20,"rows_kept":40,"cut":false,"hidden":false,"merged":[[38,8,38,9],[39,8,39,9],[37,7,37,8],[2,0,8,0],[9,0,15,0],[16,0,22,0],[23,0,29,0],[30,0,36,0]]}
[null,null,null,null,null,null,null,null,null,null,null,null,null,"Kun for\ntest",null,null,"uge norm",37]
[null,null,null,null,"Tekst","Komme","Gå","Dagens tid","Pause","Eff. arbejdstid",null,"TT:MM","1/100","norm",null,null,"dags norm",7.4,null,"Flex konto"]
[null,{"$f":"WEEKDAY(C3)","v":"1900-01-05"},{"$f":"DATE(YEAR(Januar!$C$4),3,1)","v":"2018-03-01"},null,null,null,null,{"$f":"IF(OR(F3=\"\",G3=\"\"),\"\",IF(G3<F3,G3+1-F3,G3-F3))","v":""},"00:31:00",{"$f":"IF(E3=\"ferie\",$R$2/24,IF(OR(F3=\"\",G3=\"\"),\"\",H3-I3))","v":""},{"$f":"IFERROR(J3*24,\"\")","v":""},null,null,{"$f":"CHOOSE(WEEKDAY(C3,2),norm!B$1,norm!B$2,norm!B$3,norm!B$4,norm!B$5,norm!B$6,norm!B$7)","v":7.4},null,null,"Uge 1",{"$f":"M9-R1","v":-37}]
[null,{"$f":"WEEKDAY(C4)","v":"1900-01-06"},{"$f":"C3+1","v":"2018-03-02"},null,"ferie",null,null,{"$f":"IF(OR(F4=\"\",G4=\"\"),\"\",IF(G4<F4,G4+1-F4,G4-F4))","v":""},null,{"$f":"IF(E4=\"ferie\",$R$2/24,IF(OR(F4=\"\",G4=\"\"),\"\",H4-I4))","v":"07:24:00"},{"$f":"IFERROR(J4*24,\"\")","v":7.4},null,null,{"$f":"CHOOSE(WEEKDAY(C4,2),norm!B$1,norm!B$2,norm!B$3,norm!B$4,norm!B$5,norm!B$6,norm!B$7)","v":7.4},null,null,"Uge 2",{"$f":"M16-R1","v":-37},null,{"$f":"SUM(R3:R7)","v":-99.199999999999989}]
[null,"1900-01-07",{"$f":"C4+1","v":"2018-03-03"},null,"afsp.",null,null,{"$f":"IF(OR(F5=\"\",G5=\"\"),\"\",IF(G5<F5,G5+1-F5,G5-F5))","v":""},null,"",{"$f":"IFERROR(J5*24,\"\")","v":""},null,null,{"$f":"CHOOSE(WEEKDAY(C5,2),norm!B$1,norm!B$2,norm!B$3,norm!B$4,norm!B$5,norm!B$6,norm!B$7)","v":0},null,null,"Uge 3",{"$f":"M23-R1","v":-37}]
[null,"1900-01-01","2018-03-04",null,null,"07:00:00","15:00:00",{"$f":"IF(OR(F6=\"\",G6=\"\"),\"\",IF(G6<F6,G6+1-F6,G6-F6))","v":"08:00:00"},null,"08:00:00",{"$f":"IFERROR(J6*24,\"\")","v":8},null,null,{"$f":"CHOOSE(WEEKDAY(C6,2),norm!B$1,norm!B$2,norm!B$3,norm!B$4,norm!B$5,norm!B$6,norm!B$7)","v":0},null,null,"Uge 4",{"$f":"M30-R1","v":-37}]
[null,"1900-01-02","2018-03-05",null,"ferie",null,null,{"$f":"IF(OR(F7=\"\",G7=\"\"),\"\",IF(G7<F7,G7+1-F7,G7-F7))","v":""},null,"07:24:00",{"$f":"IFERROR(J7*24,\"\")","v":7.4},null,null,{"$f":"CHOOSE(WEEKDAY(C7,2),norm!B$1,norm!B$2,norm!B$3,norm!B$4,norm!B$5,norm!B$6,norm!B$7)","v":7.4},null,null,"Uge 5",{"$f":"K38-R1","v":48.800000000000011}]
[null,"1900-01-03","2018-03-06",null,null,null,null,null,null,"",null,null,null,{"$f":"CHOOSE(WEEKDAY(C8,2),norm!B$1,norm!B$2,norm!B$3,norm!B$4,norm!B$5,norm!B$6,norm!B$7)","v":7.4},null,null,null,null,null,{"$f":"K38-K39","v":-62.199999999999989}]
[null,"1900-01-04","2018-03-07",null,null,null,null,null,null,"",null,null,null,{"$f":"CHOOSE(WEEKDAY(C9,2),norm!B$1,norm!B$2,norm!B$3,norm!B$4,norm!B$5,norm!B$6,norm!B$7)","v":7.4}]
[null,"1900-01-05","2018-03-08",null,null,null,null,{"$f":"IF(OR(F10=\"\",G10=\"\"),\"\",IF(G10<F10,G10+1-F10,G10-F10))","v":""},"00:31:00","",{"$f":"IFERROR(J10*24,\"\")","v":""},null,null,{"$f":"CHOOSE(WEEKDAY(C10,2),norm!B$1,norm!B$2,norm!B$3,norm!B$4,norm!B$5,norm!B$6,norm!B$7)","v":7.4}]
{"$rows_left_out":31}
{"sheet":"April","index":3,"n_rows":40,"n_cols":20,"rows_kept":40,"cut":false,"hidden":false,"merged":[[30,0,36,0],[0,11,0,12],[2,0,8,0],[9,0,15,0],[16,0,22,0],[23,0,29,0]]}
[null,null,null,null,null,null,null,null,null,null,null,"Total timer\nmåned",null,"Kun for\ntest",null,null,"uge norm",37]
[null,"Ugedag","Dato","Dag","Tekst","Komme","Gå","Dagens tid","Pause","Effektiv arbejdstid",null,"TT:MM","1/100","norm",null,null,"dags norm",7.4,null,"Flex konto"]
[null,{"$f":"WEEKDAY(C3)","v":"1900-01-01"},{"$f":"DATE(YEAR(Januar!$C$4),4,1)","v":"2018-04-01"},{"$f":"HelligdagsNavn(C3,0,0)","v":"Påskedag"},null,null,null,{"$f":"IF(OR(F3=\"\",G3=\"\"),\"\",IF(G3<F3,G3+1-F3,G3-F3))","v":""},null,{"$f":"IF(E3=\"ferie\",$R$2/24,IF(OR(F3=\"\",G3=\"\"),\"\",H3-I3))","v":""},{"$f":"IFERROR(J3*24,\"\")","v":""},null,null,{"$f":"CHOOSE(WEEKDAY(C3,2),norm!B$1,norm!B$2,norm!B$3,norm!B$4,norm!B$5,norm!B$6,norm!B$7)","v":0},null,null,"Uge 1",{"$f":"M9-R1","v":-37}]
[null,{"$f":"WEEKDAY(C4)","v":"1900-01-02"},{"$f":"C3+1","v":"2018-04-02"},{"$f":"HelligdagsNavn(C4,0,0)","v":"2. Påskedag"},"ferie",null,null,{"$f":"IF(OR(F4=\"\",G4=\"\"),\"\",IF(G4<F4,G4+1-F4,G4-F4))","v":""},null,{"$f":"IF(E4=\"ferie\",$R$2/24,IF(OR(F4=\"\",G4=\"\"),\"\",H4-I4))","v":"07:24:00"},{"$f":"IFERROR(J4*24,\"\")","v":7.4},null,null,{"$f":"CHOOSE(WEEKDAY(C4,2),norm!B$1,norm!B$2,norm!B$3,norm!B$4,norm!B$5,norm!B$6,norm!B$7)","v":7.4},null,null,"Uge 2",{"$f":"M16-R1","v":-37},null,{"$f":"SUM(R3:R7)","v":-99.199999999999989}]
[null,"1900-01-03",{"$f":"C4+1","v":"2018-04-03"},"","afsp.",null,null,{"$f":"IF(OR(F5=\"\",G5=\"\"),\"\",IF(G5<F5,G5+1-F5,G5-F5))","v":""},null,"",{"$f":"IFERROR(J5*24,\"\")","v":""},null,null,{"$f":"CHOOSE(WEEKDAY(C5,2),norm!B$1,norm!B$2,norm!B$3,norm!B$4,norm!B$5,norm!B$6,norm!B$7)","v":7.4},null,null,"Uge 3",{"$f":"M23-R1","v":-37}]
[null,"1900-01-04","2018-04-04","",null,"07:00:00","15:00:00",{"$f":"IF(OR(F6=\"\",G6=\"\"),\"\",IF(G6<F6,G6+1-F6,G6-F6))","v":"08:00:00"},null,"08:00:00",{"$f":"IFERROR(J6*24,\"\")","v":8},null,null,{"$f":"CHOOSE(WEEKDAY(C6,2),norm!B$1,norm!B$2,norm!B$3,norm!B$4,norm!B$5,norm!B$6,norm!B$7)","v":7.4},null,null,"Uge 4",{"$f":"M30-R1","v":-37}]
[null,"1900-01-05","2018-04-05","","ferie",null,null,{"$f":"IF(OR(F7=\"\",G7=\"\"),\"\",IF(G7<F7,G7+1-F7,G7-F7))","v":""},null,"07:24:00",{"$f":"IFERROR(J7*24,\"\")","v":7.4},null,null,{"$f":"CHOOSE(WEEKDAY(C7,2),norm!B$1,norm!B$2,norm!B$3,norm!B$4,norm!B$5,norm!B$6,norm!B$7)","v":7.4},null,null,"Uge 5",{"$f":"M38-R1","v":48.800000000000011}]
[null,"1900-01-06","2018-04-06","",null,null,null,null,null,"",null,null,null,{"$f":"CHOOSE(WEEKDAY(C8,2),norm!B$1,norm!B$2,norm!B$3,norm!B$4,norm!B$5,norm!B$6,norm!B$7)","v":7.4},null,null,null,null,null,{"$f":"M38-M39","v":-54.799999999999983}]
[null,"1900-01-07","2018-04-07","",null,null,null,null,null,"",null,null,null,{"$f":"CHOOSE(WEEKDAY(C9,2),norm!B$1,norm!B$2,norm!B$3,norm!B$4,norm!B$5,norm!B$6,norm!B$7)","v":0}]
[null,"1900-01-01","2018-04-08","",null,null,null,{"$f":"IF(OR(F10=\"\",G10=\"\"),\"\",IF(G10<F10,G10+1-F10,G10-F10))","v":""},null,"",{"$f":"IFERROR(J10*24,\"\")","v":""},null,null,{"$f":"CHOOSE(WEEKDAY(C10,2),norm!B$1,norm!B$2,norm!B$3,norm!B$4,norm!B$5,norm!B$6,norm!B$7)","v":0}]
{"$rows_left_out":31}
{"sheet":"December","index":4,"n_rows":40,"n_cols":20,"rows_kept":40,"cut":false,"hidden":false,"merged":[[30,0,36,0],[0,11,0,12],[2,0,8,0],[9,0,15,0],[16,0,22,0],[23,0,29,0],[38,4,38,5],[0,9,0,10],[37,7,37,8],[38,8,38,9],[39,8,39,9]]}
[null,null,null,null,null,null,null,null,null,"Effektiv\narbejdstid",null,"Total timer\nmåned",null,"Kun for\ntest",null,null,"uge norm",37]
[null,"Ugedag","Dato","Dag","Tekst","Komme","Gå","Dagens tid","Pause","TT:MM","1/100",null,null,"norm",null,null,"dags norm",7.4,null,"Flex konto"]
[null,{"$f":"WEEKDAY(C3)","v":"1900-01-07"},{"$f":"DATE(YEAR(Januar!$C$4),12,1)","v":"2018-12-01"},{"$f":"HelligdagsNavn(C3,0,0)","v":""},null,null,null,{"$f":"IF(OR(F3=\"\",G3=\"\"),\"\",IF(G3<F3,G3+1-F3,G3-F3))","v":""},null,{"$f":"IF(E3=\"ferie\",$R$2/24,IF(OR(F3=\"\",G3=\"\"),\"\",H3-I3))","v":""},{"$f":"IFERROR(J3*24,\"\")","v":""},null,null,{"$f":"CHOOSE(WEEKDAY(C3,2),norm!B$1,norm!B$2,norm!B$3,norm!B$4,norm!B$5,norm!B$6,norm!B$7)","v":0},null,null,"Uge 1",{"$f":"M9-R1","v":-37}]
[null,{"$f":"WEEKDAY(C4)","v":"1900-01-01"},{"$f":"C3+1","v":"2018-12-02"},{"$f":"HelligdagsNavn(C4,0,0)","v":""},"ferie",null,null,{"$f":"IF(OR(F4=\"\",G4=\"\"),\"\",IF(G4<F4,G4+1-F4,G4-F4))","v":""},null,{"$f":"IF(E4=\"ferie\",$R$2/24,IF(OR(F4=\"\",G4=\"\"),\"\",H4-I4))","v":"07:24:00"},{"$f":"IFERROR(J4*24,\"\")","v":7.4},null,null,{"$f":"CHOOSE(WEEKDAY(C4,2),norm!B$1,norm!B$2,norm!B$3,norm!B$4,norm!B$5,norm!B$6,norm!B$7)","v":0},null,null,"Uge 2",{"$f":"M16-R1","v":-37},null,{"$f":"SUM(R3:R7)","v":-99.199999999999989}]
[null,"1900-01-02",{"$f":"C4+1","v":"2018-12-03"},"","afsp.",null,null,{"$f":"IF(OR(F5=\"\",G5=\"\"),\"\",IF(G5<F5,G5+1-F5,G5-F5))","v":""},null,"",{"$f":"IFERROR(J5*24,\"\")","v":""},null,null,{"$f":"CHOOSE(WEEKDAY(C5,2),norm!B$1,norm!B$2,norm!B$3,norm!B$4,norm!B$5,norm!B$6,norm!B$7)","v":7.4},null,null,"Uge 3",{"$f":"M23-R1","v":-37}]
[null,"1900-01-03","2018-12-04","",null,"07:00:00","15:00:00",{"$f":"IF(OR(F6=\"\",G6=\"\"),\"\",IF(G6<F6,G6+1-F6,G6-F6))","v":"08:00:00"},null,"08:00:00",{"$f":"IFERROR(J6*24,\"\")","v":8},null,null,{"$f":"CHOOSE(WEEKDAY(C6,2),norm!B$1,norm!B$2,norm!B$3,norm!B$4,norm!B$5,norm!B$6,norm!B$7)","v":7.4},null,null,"Uge 4",{"$f":"M30-R1","v":-37}]
[null,"1900-01-04","2018-12-05","","ferie",null,null,{"$f":"IF(OR(F7=\"\",G7=\"\"),\"\",IF(G7<F7,G7+1-F7,G7-F7))","v":""},null,"07:24:00",{"$f":"IFERROR(J7*24,\"\")","v":7.4},null,null,{"$f":"CHOOSE(WEEKDAY(C7,2),norm!B$1,norm!B$2,norm!B$3,norm!B$4,norm!B$5,norm!B$6,norm!B$7)","v":7.4},null,null,"Uge 5",{"$f":"K38-R1","v":48.800000000000011}]
[null,"1900-01-05","2018-12-06","",null,null,null,null,null,"",null,null,null,{"$f":"CHOOSE(WEEKDAY(C8,2),norm!B$1,norm!B$2,norm!B$3,norm!B$4,norm!B$5,norm!B$6,norm!B$7)","v":7.4},null,null,null,null,null,{"$f":"K38-K39","v":-54.799999999999983}]
[null,"1900-01-06","2018-12-07","",null,null,null,null,null,"",null,null,null,{"$f":"CHOOSE(WEEKDAY(C9,2),norm!B$1,norm!B$2,norm!B$3,norm!B$4,norm!B$5,norm!B$6,norm!B$7)","v":7.4}]
[null,"1900-01-07","2018-12-08","",null,null,null,{"$f":"IF(OR(F10=\"\",G10=\"\"),\"\",IF(G10<F10,G10+1-F10,G10-F10))","v":""},null,"",{"$f":"IFERROR(J10*24,\"\")","v":""},null,null,{"$f":"CHOOSE(WEEKDAY(C10,2),norm!B$1,norm!B$2,norm!B$3,norm!B$4,norm!B$5,norm!B$6,norm!B$7)","v":0}]
{"$rows_left_out":31}
{"sheet":"Januar (2)","index":5,"n_rows":40,"n_cols":20,"rows_kept":40,"cut":false,"hidden":false,"merged":[[30,0,36,0],[0,11,0,12],[2,0,8,0],[9,0,15,0],[16,0,22,0],[23,0,29,0]]}
[null,null,null,null,null,null,null,null,null,null,null,"Total timer uge",null,"Kun for\ntest",null,null,"uge norm",37]
[null,"Dag","Dato",null,"Tekst","Komme","Gå","Dagens\ntid","Pause","Effektiv\narbejdstid",null,"TT:MM","1/100","norm",null,null,"dags norm",7.4,null,"Flex konto"]
["Uge 1",{"$f":"WEEKDAY(C3)","v":"1900-01-02"},"2018-01-01",null,null,"07:00:00","15:30:00",{"$f":"IF(OR(F3=\"\",G3=\"\"),\"\",IF(G3<F3,G3+1-F3,G3-F3))","v":"08:30:00"},"00:31:00",{"$f":"IF(E3=\"ferie\",N3/24,IF(OR(F3=\"\",G3=\"\"),\"\",H3-I3))","v":"07:59:00"},{"$f":"IFERROR(J3*24,\"\")","v":7.9833333333333343},null,null,{"$f":"CHOOSE(WEEKDAY(C3,2),norm!B$1,norm!B$2,norm!B$3,norm!B$4,norm!B$5,norm!B$6,norm!B$7)","v":7.4},null,null,"Uge 1",{"$f":"M9-R1","v":-6.2166666666666686}]
[null,{"$f":"WEEKDAY(C4)","v":"1900-01-03"},{"$f":"C3+1","v":"2018-01-02"},null,"ferie",null,null,{"$f":"IF(OR(F4=\"\",G4=\"\"),\"\",IF(G4<F4,G4+1-F4,G4-F4))","v":""},null,"07:24:00",{"$f":"IFERROR(J4*24,\"\")","v":7.4},null,null,{"$f":"CHOOSE(WEEKDAY(C4,2),norm!B$1,norm!B$2,norm!B$3,norm!B$4,norm!B$5,norm!B$6,norm!B$7)","v":7.4},null,null,"Uge 2",{"$f":"M16-R1","v":-8.0166666666666657},null,{"$f":"SUM(R3:R7)","v":-38.283333333333331}]
[null,"1900-01-04",{"$f":"C4+1","v":"2018-01-03"},null,"afsp.",null,null,{"$f":"IF(OR(F5=\"\",G5=\"\"),\"\",IF(G5<F5,G5+1-F5,G5-F5))","v":""},null,"",{"$f":"IFERROR(J5*24,\"\")","v":""},null,null,{"$f":"CHOOSE(WEEKDAY(C5,2),norm!B$1,norm!B$2,norm!B$3,norm!B$4,norm!B$5,norm!B$6,norm!B$7)","v":7.4},null,null,"Uge 3",{"$f":"M23-R1","v":-8.0166666666666657}]
[null,"1900-01-05","2018-01-04",null,null,"07:00:00","15:00:00",{"$f":"IF(OR(F6=\"\",G6=\"\"),\"\",IF(G6<F6,G6+1-F6,G6-F6))","v":"08:00:00"},null,"08:00:00",{"$f":"IFERROR(J6*24,\"\")","v":8},null,null,{"$f":"CHOOSE(WEEKDAY(C6,2),norm!B$1,norm!B$2,norm!B$3,norm!B$4,norm!B$5,norm!B$6,norm!B$7)","v":7.4},null,null,"Uge 4",{"$f":"M30-R1","v":-8.0166666666666657}]
[null,"1900-01-06","2018-01-05",null,"ferie",null,null,{"$f":"IF(OR(F7=\"\",G7=\"\"),\"\",IF(G7<F7,G7+1-F7,G7-F7))","v":""},null,{"$f":"IF(E7=\"ferie\",N7/24,IF(OR(F7=\"\",G7=\"\"),\"\",H7-I7))","v":"07:24:00"},{"$f":"IFERROR(J7*24,\"\")","v":7.4},null,null,{"$f":"CHOOSE(WEEKDAY(C7,2),norm!B$1,norm!B$2,norm!B$3,norm!B$4,norm!B$5,norm!B$6,norm!B$7)","v":7.4},null,null,"Uge 5",{"$f":"M37-R1","v":-8.0166666666666657}]
[null,"1900-01-07","2018-01-06",null,null,null,null,null,null,{"$f":"IF(E8=\"ferie\",N8/24,IF(OR(F8=\"\",G8=\"\"),\"\",H8-I8))","v":""},null,null,null,{"$f":"CHOOSE(WEEKDAY(C8,2),norm!B$1,norm!B$2,norm!B$3,norm!B$4,norm!B$5,norm!B$6,norm!B$7)","v":0}]
[null,"1900-01-01","2018-01-07",null,null,null,null,null,null,"",null,{"$f":"SUM(J3:J7)","v":1.2826388888888889},{"$f":"L9*24","v":30.783333333333331},{"$f":"CHOOSE(WEEKDAY(C9,2),norm!B$1,norm!B$2,norm!B$3,norm!B$4,norm!B$5,norm!B$6,norm!B$7)","v":0}]
["Uge 2","1900-01-02","2018-01-08",null,null,"07:00:00","15:30:00",{"$f":"IF(OR(F10=\"\",G10=\"\"),\"\",IF(G10<F10,G10+1-F10,G10-F10))","v":"08:30:00"},"00:31:00",{"$f":"IF(OR(F10=\"\",G10=\"\"),\"\",H10-I10)","v":"07:59:00"},{"$f":"IFERROR(J10*24,\"\")","v":7.9833333333333343},null,null,{"$f":"CHOOSE(WEEKDAY(C10,2),norm!B$1,norm!B$2,norm!B$3,norm!B$4,norm!B$5,norm!B$6,norm!B$7)","v":7.4},null,null,null,{"$f":"M38-M39","v":-16.083333333333343}]
{"$rows_left_out":31}
{"sheet":"T.","index":6,"n_rows":7,"n_cols":3,"rows_kept":7,"cut":false,"hidden":false,"merged":[]}
[null,null,{"$f":"IF(C2=365,28,29)","v":28}]
["Salt og snerydning",null,{"$f":"364+DATE($C$3,3,1)-DATE($C$3,2,28)","v":365}]
[null,null,{"$f":"YEAR(Februar!C3)","v":2018}]
["Arrangementer","afsp."]
["Høstfest","ferie"]
["Dimissionsfest","syg"]
["juleklip"]

{"sheet":"norm","index":7,"n_rows":11,"n_cols":2,"rows_kept":11,"cut":false,"hidden":false,"merged":[]}
["mandag",7.4]
["tirsdag",7.4]
["onsdag",7.4]
["torsdag",7.4]
["fredag",7.4]
["lørdag",0]
["søndag",0]
[]
["Uge Norm",1.5416666666666667]
[]
{"$rows_left_out":2}
{"sheet":"helligdage","index":8,"n_rows":35,"n_cols":12,"rows_kept":35,"cut":false,"hidden":false,"merged":[]}
["Årstal",{"$f":"YEAR(Januar!C4)","v":2018},"Type",null,null,null,"X","Årstal",{"$f":"B1","v":2018}]
["Nytårsdag",{"$f":"DATE(B1,1,1)","v":"2018-01-01"},"Fast",null,null,null,"A","Rest",{"$f":"MOD(I1,19)","v":4}]
["Skærtorsdag",{"$f":"B5-3","v":"2018-03-29"},"Beregnet",null,null,null,"B","Heltal",{"$f":"INT(I1/100)","v":20}]
["Langfredag",{"$f":"B5-2","v":"2018-03-30"},"Beregnet",null,null,null,"C","Rest",{"$f":"MOD(I1,100)","v":18},{"$f":"MOD(I1,100)","v":18}]
["Påskedag",{"$f":"FLOOR(DAY(MINUTE(B1/38)/2+56)&\"/5/\"&B1,7)-34","v":"2018-04-01"},"Beregnet",null,null,null,"D","Heltal",{"$f":"INT(I3/4)","v":5}]
["2. påskedag",{"$f":"$B$5+1","v":"2018-04-02"},"Beregnet",null,null,null,"E","Rest",{"$f":"MOD(I3,4)","v":0}]
["Store Bededag",{"$f":"$B$5+26","v":"2018-04-27"},"Beregnet",null,null,null,"F","Heltal",{"$f":"INT((I3+8)/25)","v":1}]
["Kristi Himmelfart",{"$f":"$B$5+39","v":"2018-05-10"},"Beregnet",null,null,null,"G","Heltal",{"$f":"INT((I3-I7+1)/3)","v":6}]
["Pinsedag",{"$f":"$B$5+49","v":"2018-05-20"},"Beregnet",null,null,null,"H","Heltal",{"$f":"MOD(19*I2+I3-I5-I8+15,30)","v":10}]
["2. pinsedag",{"$f":"$B$5+50","v":"2018-05-21"},"Beregnet",null,null,null,"J","Heltal",{"$f":"INT(I4/4)","v":4}]
{"$rows_left_out":25}