{"text_format":"1","workbook":"xlsx","n_sheets":5,"sheets":["Juni2010 (2)","Hele Året","Data","Satser","Ark3"],"not_rendered":{"charts":0,"images":0,"macros":1,"external_links":0,"defined_names":2,"comments":0,"pivot_tables":0},"unopened":[],"bounds":{"document_bytes":16777216,"sheet_cells":100000,"rows_first":2000,"rows_last":500,"rows_between":2000,"halvings":0,"cell_chars":16384,"cell_head_chars":4096},"cells_cut":0,"cells_raw":0,"read":"whole","date_system":"1900"}

{"sheet":"Juni2010 (2)","index":0,"n_rows":45,"n_cols":26,"rows_kept":45,"cut":false,"hidden":true,"merged":[[43,0,43,3],[0,1,0,5],[39,0,39,3],[40,0,40,3],[41,0,41,3],[42,0,42,3],[2,1,2,2],[1,1,1,2]]}
["Løn","1 juni 2010 - 30 juni 2010",null,null,null,null,null,null,null,null,null,null,null,null,null,null,"Time beregning:"]
["Lønart",null,null,null,null,null,3025,3425,3426,3600,3602,3605,3610,9091,9092,null,"Betalt pause ved vagt over 5 timer",null,null,null,"00:25:00","minutter","00:00:00","06:00:00","18:00:00","14:00:00"]
["Dato","Dag",null,"Vagt","Start","Slut","Time SID","Overtid           1-3 time","Overtid            4 - time","Aftenstillæg","Nattillæg     00-06","Søndags tillæg","Delt tjenste"]
["2010-04-01",{"$f":"PROPER(TEXT(A4,\"ddd\"))","v":"To"},{"$f":"HelligdagsNavn(A4,0,0)","v":"Skærtorsdag"},111,{"$f":"IF($D4=\"\",\"\",IF(VLOOKUP($D4,#REF!,2)=0,\"\",VLOOKUP($D4,#REF!,2)))","v":{"$error":"#REF!"}},{"$f":"IF($D4=\"\",\"\",IF(VLOOKUP($D4,#REF!,3)=\"\",\"\",VLOOKUP($D4,#REF!,3)))","v":{"$error":"#REF!"}},{"$f":"IF($D4=\"\",\"\",VLOOKUP($D4,#REF!,13))","v":{"$error":"#REF!"}},null,null,{"$f":"IF(E4<>\"\",IF(WEEKDAY(A4,2)<>6,IF(E4>F4,(F4-MAX(E4,(18/24))+(E4>F4))-F4,IF(F4>Y$2,(F4-MAX(E4,(18/24))),\"\")),IF(E4>F4,(F4-MAX(E4,(14/24))+(E4>F4))-F4,IF(F4>Z$2,(F4-MAX(E4,(14/24))),\"\"))),\"\")","v":{"$error":"#REF!"}},{"$f":"IF(G4<>\"\",IF(S4<X$2,(X$2-S4),IF(V4<X$2,(V4-W$2),\"\")),\"\")","v":{"$error":"#REF!"}},{"$f":"IF(G4<>0,IF(WEEKDAY(A4,2)=7,G4,\"\"),\"\")","v":{"$error":"#REF!"}},{"$f":"IF($D4=\"\",\"\",IF(VLOOKUP($D4,#REF!,15)=\"\",\"\",VLOOKUP($D4,#REF!,15)))","v":{"$error":"#REF!"}},{"$f":"IF(SUM(H4:I4)=0,\"\",SUM(H4:I4))","v":""},null,null,{"$f":"IF(E4=\"\",\"\",HOUR(E4))","v":{"$error":"#REF!"}},{"$f":"IF(E4=\"\",\"\",MINUTE(E4))","v":{"$error":"#REF!"}},{"$f":"IF(E4=\"\",\"\",TIME(HOUR(E4),MINUTE(E4),0))","v":{"$error":"#REF!"}},{"$f":"IF(F4=\"\",\"\",HOUR(F4))","v":{"$error":"#REF!"}},{"$f":"IF(F4=\"\",\"\",MINUTE(F4))","v":{"$error":"#REF!"}},{"$f":"TIME(HOUR(F4),MINUTE(F4),0)","v":{"$error":"#REF!"}}]
["2010-04-02",{"$f":"PROPER(TEXT(A5,\"ddd\"))","v":"Fr"},{"$f":"HelligdagsNavn(A5,0,0)","v":"Langfredag"},134,{"$f":"IF($D5=\"\",\"\",IF(VLOOKUP($D5,#REF!,2)=0,\"\",VLOOKUP($D5,#REF!,2)))","v":{"$error":"#REF!"}},{"$f":"IF($D5=\"\",\"\",IF(VLOOKUP($D5,#REF!,3)=\"\",\"\",VLOOKUP($D5,#REF!,3)))","v":{"$error":"#REF!"}},{"$f":"IF($D5=\"\",\"\",VLOOKUP($D5,#REF!,13))","v":{"$error":"#REF!"}},null,null,{"$f":"IF(E5<>\"\",IF(WEEKDAY(A5,2)<>6,IF(E5>F5,(F5-MAX(E5,(18/24))+(E5>F5))-F5,IF(F5>Y$2,(F5-MAX(E5,(18/24))),\"\")),IF(E5>F5,(F5-MAX(E5,(14/24))+(E5>F5))-F5,IF(F5>Z$2,(F5-MAX(E5,(14/24))),\"\"))),\"\")","v":{"$error":"#REF!"}},{"$error":"#REF!"},{"$error":"#REF!"},{"$f":"IF($D5=\"\",\"\",IF(VLOOKUP($D5,#REF!,15)=\"\",\"\",VLOOKUP($D5,#REF!,15)))","v":{"$error":"#REF!"}},{"$f":"IF(SUM(H5:I5)=0,\"\",SUM(H5:I5))","v":""},null,null,{"$error":"#REF!"},{"$error":"#REF!"},{"$error":"#REF!"},{"$error":"#REF!"},{"$error":"#REF!"},{"$f":"TIME(HOUR(F5),MINUTE(F5),0)","v":{"$error":"#REF!"}}]
["2010-04-03",{"$f":"PROPER(TEXT(A6,\"ddd\"))","v":"Lø"},"",612,{"$f":"IF($D6=\"\",\"\",IF(VLOOKUP($D6,#REF!,2)=0,\"\",VLOOKUP($D6,#REF!,2)))","v":{"$error":"#REF!"}},{"$f":"IF($D6=\"\",\"\",IF(VLOOKUP($D6,#REF!,3)=\"\",\"\",VLOOKUP($D6,#REF!,3)))","v":{"$error":"#REF!"}},{"$f":"IF($D6=\"\",\"\",VLOOKUP($D6,#REF!,13))","v":{"$error":"#REF!"}},null,null,{"$f":"IF(E6<>\"\",IF(WEEKDAY(A6,2)<>6,IF(E6>F6,(F6-MAX(E6,(18/24))+(E6>F6))-F6,IF(F6>Y$2,(F6-MAX(E6,(18/24))),\"\")),IF(E6>F6,(F6-MAX(E6,(14/24))+(E6>F6))-F6,IF(F6>Z$2,(F6-MAX(E6,(14/24))),\"\"))),\"\")","v":{"$error":"#REF!"}},{"$error":"#REF!"},{"$error":"#REF!"},{"$f":"IF($D6=\"\",\"\",IF(VLOOKUP($D6,#REF!,15)=\"\",\"\",VLOOKUP($D6,#REF!,15)))","v":{"$error":"#REF!"}},"",null,null,{"$error":"#REF!"},{"$error":"#REF!"},{"$error":"#REF!"},{"$error":"#REF!"},{"$error":"#REF!"},{"$f":"TIME(HOUR(F6),MINUTE(F6),0)","v":{"$error":"#REF!"}}]
{"$rows_left_out":40}
{"sheet":"Hele Året","index":1,"n_rows":394,"n_cols":31,"rows_kept":394,"cut":false,"hidden":false,"merged":[[0,0,0,2],[13,20,13,21],[14,20,14,21],[15,20,15,21],[16,20,16,21],[7,20,7,21],[8,20,8,21],[371,20,371,21],[372,20,372,21],[9,20,9,21],[10,20,10,21],[11,20,11,21],[370,20,370,21],[12,20,12,21],[62,20,62,21],[25,20,25,21],[26,20,26,21],[27,20,27,21],[28,20,28,21],[29,20,29,21],[20,20,20,21],[21,20,21,21],[22,20,22,21],[19,20,19,21],[23,20,23,21],[382,0,382,2],[2,1,2,2],[4,1,4,2],[378,0,378,2],[379,0,379,2],[12,18,12,19],[13,18,13,19],[14,18,14,19],[19,18,19,19],[26,18,26,19],[15,18,15,19],[16,18,16,19],[17,18,17,19],[18,18,18,19],[20,18,20,19],[21,18,21,19],[7,18,7,19],[371,0,371,4],[372,0,372,4],[373,0,373,4],[8,18,8,19],[9,18,9,19],[10,18,10,19],[11,18,11,19],[380,18,380,19],[1,1,1,9],[2,18,2,19],[4,18,4,19],[5,18,5,19],[6,18,6,19],[1,19,1,20],[2,20,2,21],[4,20,4,21],[5,20,5,21],[6,20,6,21],[3,20,3,21],[3,18,3,19],[374,18,374,19],[31,18,31,19],[62,18,62,19],[371,18,371,19],[366,18,366,19],[369,18,369,19],[370,18,370,19],[30,20,30,21],[31,20,31,21],[17,20,17,21],[18,20,18,21],[372,18,372,19],[373,18,373,19],[29,18,29,19],[30,18,30,19],[22,18,22,19],[23,18,23,19],[24,18,24,19],[25,18,25,19],[28,18,28,19],[27,18,27,19],[33,18,33,19],[38,18,38,19],[43,18,43,19],[48,18,48,19],[53,18,53,19],[58,18,58,19],[64,18,64,19],[69,18,69,19],[74,18,74,19],[79,18,79,19],[84,18,84,19],[89,18,89,19],[94,18,94,19],[99,18,99,19],[24,20,24,21],[366,20,366,21],[369,20,369,21],[373,20,373,21],[374,0,374,4],[375,0,375,4],[380,20,380,21],[381,18,381,19],[381,20,381,21],[377,18,377,19],[377,20,377,21],[378,18,378,19],[378,20,378,21],[379,18,379,19],[379,20,379,21],[374,20,374,21],[376,20,376,21],[375,20,375,21],[376,18,376,19],[375,18,375,19],[380,0,380,2],[381,0,381,2],[32,18,32,19],[32,20,32,21],[33,20,33,21],[34,18,34,19],[34,20,34,21],[35,18,35,19],[35,20,35,21],[36,18,36,19],[36,20,36,21],[37,18,37,19],[37,20,37,21],[38,20,38,21],[39,18,39,19],[39,20,39,21],[40,18,40,19],[40,20,40,21],[41,18,41,19],[41,20,41,21],[42,18,42,19],[42,20,42,21],[43,20,43,21],[44,18,44,19],[44,20,44,21],[45,18,45,19],[45,20,45,21],[46,18,46,19],[46,20,46,21],[47,18,47,19],[47,20,47,21],[48,20,48,21],[49,18,49,19],[49,20,49,21],[50,18,50,19],[50,20,50,21],[51,18,51,19],[51,20,51,21],[52,18,52,19],[52,20,52,21],[53,20,53,21],[54,18,54,19],[54,20,54,21],[55,18,55,19],[55,20,55,21],[56,18,56,19],[56,20,56,21],[57,18,57,19],[57,20,57,21],[58,20,58,21],[59,18,59,19],[59,20,59,21],[60,18,60,19],[60,20,60,21],[61,18,61,19],[61,20,61,21],[63,18,63,19],[63,20,63,21],[64,20,64,21],[65,18,65,19],[65,20,65,21],[66,18,66,19],[66,20,66,21],[67,18,67,19],[67,20,67,21],[68,18,68,19],[68,20,68,21],[69,20,69,21],[70,18,70,19],[70,20,70,21],[71,18,71,19],[71,20,71,21],[72,18,72,19],[72,20,72,21],[73,18,73,19],[73,20,73,21],[74,20,74,21],[75,18,75,19],[75,20,75,21],[76,18,76,19],[76,20,76,21],[77,18,77,19],[77,20,77,21],[78,18,78,19],[78,20,78,21],[79,20,79,21],[80,18,80,19],[80,20,80,21],[81,18,81,19],[81,20,81,21],[82,18,82,19],[82,20,82,21],[83,18,83,19],[83,20,83,21],[84,20,84,21],[85,18,85,19],[85,20,85,21],[86,18,86,19],[86,20,86,21],[87,18,87,19],[87,20,87,21],[88,18,88,19],[88,20,88,21],[89,20,89,21],[90,18,90,19],[90,20,90,21],[91,18,91,19],[91,20,91,21],[92,18,92,19],[92,20,92,21],[93,18,93,19],[93,20,93,21],[94,20,94,21],[95,18,95,19],[95,20,95,21],[96,18,96,19],[96,20,96,21],[97,18,97,19],[97,20,97,21],[98,18,98,19],[98,20,98,21],[99,20,99,21],[100,18,100,19],[100,20,100,21],[101,18,101,19],[101,20,101,21],[102,18,102,19],[102,20,102,21],[103,18,103,19],[103,20,103,21],[104,18,104,19],[104,20,104,21],[105,18,105,19],[105,20,105,21],[106,18,106,19],[106,20,106,21],[107,18,107,19],[107,20,107,21],[108,18,108,19],[108,20,108,21],[109,18,109,19],[109,20,109,21],[110,18,110,19],[110,20,110,21],[111,18,111,19],[111,20,111,21],[112,18,112,19],[112,20,112,21],[113,18,113,19],[113,20,113,21],[114,18,114,19],[114,20,114,21],[115,18,115,19],[115,20,115,21],[116,18,116,19],[116,20,116,21],[117,18,117,19],[117,20,117,21],[118,18,118,19],[118,20,118,21],[119,18,119,19],[119,20,119,21],[120,18,120,19],[120,20,120,21],[121,18,121,19],[121,20,121,21],[122,18,122,19],[122,20,122,21],[123,18,123,19],[123,20,123,21],[124,18,124,19],[124,20,124,21],[125,18,125,19],[125,20,125,21],[126,18,126,19],[126,20,126,21],[127,18,127,19],[127,20,127,21],[128,18,128,19],[128,20,128,21],[129,18,129,19],[129,20,129,21],[130,18,130,19],[130,20,130,21],[131,18,131,19],[131,20,131,21],[132,18,132,19],[132,20,132,21],[133,18,133,19],[133,20,133,21],[134,18,134,19],[134,20,134,21],[135,18,135,19],[135,20,135,21],[136,18,136,19],[136,20,136,21],[137,18,137,19],[137,20,137,21],[138,18,138,19],[138,20,138,21],[139,18,139,19],[139,20,139,21],[140,18,140,19],[140,20,140,21],[141,18,141,19],[141,20,141,21],[142,18,142,19],[142,20,142,21],[143,18,143,19],[143,20,143,21],[144,18,144,19],[144,20,144,21],[145,18,145,19],[145,20,145,21],[146,18,146,19],[146,20,146,21],[147,18,147,19],[147,20,147,21],[148,18,148,19],[148,20,148,21],[149,18,149,19],[149,20,149,21],[150,18,150,19],[150,20,150,21],[151,18,151,19],[151,20,151,21],[152,18,152,19],[152,20,152,21],[153,18,153,19],[153,20,153,21],[154,18,154,19],[154,20,154,21],[155,18,155,19],[155,20,155,21],[156,18,156,19],[156,20,156,21],[157,18,157,19],[157,20,157,21],[158,18,158,19],[158,20,158,21],[159,18,159,19],[159,20,159,21],[160,18,160,19],[160,20,160,21],[161,18,161,19],[161,20,161,21],[162,18,162,19],[162,20,162,21],[163,18,163,19],[163,20,163,21],[164,18,164,19],[164,20,164,21],[165,18,165,19],[165,20,165,21],[166,18,166,19],[166,20,166,21],[167,18,167,19],[167,20,167,21],[168,18,168,19],[168,20,168,21],[169,18,169,19],[169,20,169,21],[170,18,170,19],[170,20,170,21],[171,18,171,19],[171,20,171,21],[172,18,172,19],[172,20,172,21],[173,18,173,19],[173,20,173,21],[174,18,174,19],[174,20,174,21],[175,18,175,19],[175,20,175,21],[176,18,176,19],[176,20,176,21],[177,18,177,19],[177,20,177,21],[178,18,178,19],[178,20,178,21],[179,18,179,19],[179,20,179,21],[180,18,180,19],[180,20,180,21],[181,18,181,19],[181,20,181,21],[182,18,182,19],[182,20,182,21],[183,18,183,19],[183,20,183,21],[184,18,184,19],[184,20,184,21],[185,18,185,19],[185,20,185,21],[186,18,186,19],[186,20,186,21],[187,18,187,19],[187,20,187,21],[188,18,188,19],[188,20,188,21],[189,18,189,19],[189,20,189,21],[190,18,190,19],[190,20,190,21],[191,18,191,19],[191,20,191,21],[192,18,192,19],[192,20,192,21],[193,18,193,19],[193,20,193,21],[194,18,194,19],[194,20,194,21],[195,18,195,19],[195,20,195,21],[196,18,196,19],[196,20,196,21],[197,18,197,19],[197,20,197,21],[198,18,198,19],[198,20,198,21],[199,18,199,19],[199,20,199,21],[200,18,200,19],[200,20,200,21],[201,18,201,19],[201,20,201,21],[202,18,202,19],[202,20,202,21],[203,18,203,19],[203,20,203,21],[204,18,204,19],[204,20,204,21],[205,18,205,19],[205,20,205,21],[206,18,206,19],[206,20,206,21],[207,18,207,19],[207,20,207,21],[208,18,208,19],[208,20,208,21],[209,18,209,19],[209,20,209,21],[210,18,210,19],[210,20,210,21],[211,18,211,19],[211,20,211,21],[212,18,212,19],[212,20,212,21],[213,18,213,19],[213,20,213,21],[214,18,214,19],[214,20,214,21],[215,18,215,19],[215,20,215,21],[216,18,216,19],[216,20,216,21],[217,18,217,19],[217,20,217,21],[218,18,218,19],[218,20,218,21],[219,18,219,19],[219,20,219,21],[220,18,220,19],[220,20,220,21],[221,18,221,19],[221,20,221,21],[222,18,222,19],[222,20,222,21],[223,18,223,19],[223,20,223,21],[224,18,224,19],[224,20,224,21],[225,18,225,19],[225,20,225,21],[226,18,226,19],[226,20,226,21],[227,18,227,19],[227,20,227,21],[228,18,228,19],[228,20,228,21],[229,18,229,19],[229,20,229,21],[230,18,230,19],[230,20,230,21],[231,18,231,19],[231,20,231,21],[232,18,232,19],[232,20,232,21],[233,18,233,19],[233,20,233,21],[234,18,234,19],[234,20,234,21],[235,18,235,19],[235,20,235,21],[236,18,236,19],[236,20,236,21],[237,18,237,19],[237,20,237,21],[238,18,238,19],[238,20,238,21],[239,18,239,19],[239,20,239,21],[240,18,240,19],[240,20,240,21],[241,18,241,19],[241,20,241,21],[242,18,242,19],[242,20,242,21],[243,18,243,19],[243,20,243,21],[244,18,244,19],[244,20,244,21],[245,18,245,19],[245,20,245,21],[246,18,246,19],[246,20,246,21],[247,18,247,19],[247,20,247,21],[248,18,248,19],[248,20,248,21],[249,18,249,19],[249,20,249,21],[250,18,250,19],[250,20,250,21],[251,18,251,19],[251,20,251,21],[252,18,252,19],[252,20,252,21],[253,18,253,19],[253,20,253,21],[254,18,254,19],[254,20,254,21],[255,18,255,19],[255,20,255,21],[256,18,256,19],[256,20,256,21],[257,18,257,19],[257,20,257,21],[258,18,258,19],[258,20,258,21],[259,18,259,19],[259,20,259,21],[260,18,260,19],[260,20,260,21],[261,18,261,19],[261,20,261,21],[262,18,262,19],[262,20,262,21],[263,18,263,19],[263,20,263,21],[264,18,264,19],[264,20,264,21],[265,18,265,19],[265,20,265,21],[266,18,266,19],[266,20,266,21],[267,18,267,19],[267,20,267,21],[268,18,268,19],[268,20,268,21],[269,18,269,19],[269,20,269,21],[270,18,270,19],[270,20,270,21],[271,18,271,19],[271,20,271,21],[272,18,272,19],[272,20,272,21],[273,18,273,19],[273,20,273,21],[274,18,274,19],[274,20,274,21],[275,18,275,19],[275,20,275,21],[276,18,276,19],[276,20,276,21],[277,18,277,19],[277,20,277,21],[278,18,278,19],[278,20,278,21],[279,18,279,19],[279,20,279,21],[280,18,280,19],[280,20,280,21],[281,18,281,19],[281,20,281,21],[282,18,282,19],[282,20,282,21],[283,18,283,19],[283,20,283,21],[284,18,284,19],[284,20,284,21],[285,18,285,19],[285,20,285,21],[286,18,286,19],[286,20,286,21],[287,18,287,19],[287,20,287,21],[288,18,288,19],[288,20,288,21],[289,18,289,19],[289,20,289,21],[290,18,290,19],[290,20,290,21],[291,18,291,19],[291,20,291,21],[292,18,292,19],[292,20,292,21],[293,18,293,19],[293,20,293,21],[294,18,294,19],[294,20,294,21],[295,18,295,19],[295,20,295,21],[296,18,296,19],[296,20,296,21],[297,18,297,19],[297,20,297,21],[298,18,298,19],[298,20,298,21],[299,18,299,19],[299,20,299,21],[300,18,300,19],[300,20,300,21],[301,18,301,19],[301,20,301,21],[302,18,302,19],[302,20,302,21],[303,18,303,19],[303,20,303,21],[304,18,304,19],[304,20,304,21],[305,18,305,19],[305,20,305,21],[306,18,306,19],[306,20,306,21],[307,18,307,19],[307,20,307,21],[308,18,308,19],[308,20,308,21],[309,18,309,19],[309,20,309,21],[310,18,310,19],[310,20,310,21],[311,18,311,19],[311,20,311,21],[312,18,312,19],[312,20,312,21],[313,18,313,19],[313,20,313,21],[314,18,314,19],[314,20,314,21],[315,18,315,19],[315,20,315,21],[316,18,316,19],[316,20,316,21],[317,18,317,19],[317,20,317,21],[318,18,318,19],[318,20,318,21],[319,18,319,19],[319,20,319,21],[320,18,320,19],[320,20,320,21],[321,18,321,19],[321,20,321,21],[322,18,322,19],[322,20,322,21],[323,18,323,19],[323,20,323,21],[324,18,324,19],[324,20,324,21],[325,18,325,19],[325,20,325,21],[326,18,326,19],[326,20,326,21],[327,18,327,19],[327,20,327,21],[328,18,328,19],[328,20,328,21],[329,18,329,19],[329,20,329,21],[330,18,330,19],[330,20,330,21],[331,18,331,19],[331,20,331,21],[332,18,332,19],[332,20,332,21],[333,18,333,19],[333,20,333,21],[334,18,334,19],[334,20,334,21],[335,18,335,19],[335,20,335,21],[336,18,336,19],[336,20,336,21],[337,18,337,19],[337,20,337,21],[338,18,338,19],[338,20,338,21],[339,18,339,19],[339,20,339,21],[340,18,340,19],[340,20,340,21],[341,18,341,19],[341,20,341,21],[342,18,342,19],[342,20,342,21],[343,18,343,19],[343,20,343,21],[344,18,344,19],[344,20,344,21],[345,18,345,19],[345,20,345,21],[346,18,346,19],[346,20,346,21],[347,18,347,19],[347,20,347,21],[348,18,348,19],[348,20,348,21],[356,20,356,21],[357,18,357,19],[357,20,357,21],[358,18,358,19],[358,20,358,21],[349,18,349,19],[349,20,349,21],[350,18,350,19],[350,20,350,21],[351,18,351,19],[351,20,351,21],[352,18,352,19],[352,20,352,21],[353,18,353,19],[353,20,353,21],[364,18,364,19],[364,20,364,21],[365,18,365,19],[365,20,365,21],[367,18,367,19],[368,18,368,19],[367,20,367,21],[368,20,368,21],[2,24,2,25],[359,18,359,19],[359,20,359,21],[360,18,360,19],[360,20,360,21],[361,18,361,19],[361,20,361,21],[362,18,362,19],[362,20,362,21],[363,18,363,19],[363,20,363,21],[354,18,354,19],[354,20,354,21],[355,18,355,19],[355,20,355,21],[356,18,356,19]]}
["Timeseddel med Gl. danske helligdage"]
["Løn",{"$f":"PROPER(TEXT(A6,\"dd mmmm åååå\")) & PROPER(TEXT(AE2,\"  -  dd mmmm åååå\"))","v":"01 Januar 2020  -  31 December 2020"},null,null,null,null,null,null,null,null,null,null,null,null,null,null,null,"Uge :",{"$f":"IF(A6=\"\",\"\",TRUNC((A6-WEEKDAY(A6,2)-DATE(YEAR(A6+4-WEEKDAY(A6,2)),1,-10))/7))","v":1},"-",null,{"$f":"IF(A27=\"\",\"\",TRUNC((A27-WEEKDAY(A27,2)-DATE(YEAR(A27+4-WEEKDAY(A27,2)),1,-10))/7))","v":4},null,"År: ",2020,null,null,null,null,null,{"$f":"IF(A367=\"\",A63,IF(A370=\"\",A367,IF(A371=\"\",A370,A371)))","v":"2020-12-31"}]
["Lønart",null,null,null,null,null,null,null,null,"7-15","7-15","15-23","15-23","15-23","23-00","23-00","23-00","00-07","00-07",null,"00-07",null,null,null,"vinterferie er i Uge nr.:"]
[null,null,null,null,null,null,null,null,null,"Lø-sø","Helligdage","Ma-fr","Lø-sø","Helligdage","Ma-to","fr-sø","helligdage","Man/lø-sø","ti-fr",null,"helligdage",null,null,"Fastelavn",{"$f":"Påskedag(Y2)-49","v":"2020-02-23"},{"$f":"IF(SUM(Y4)<2,\"\",1+INT((Y4-DATE(YEAR(Y4+4-WEEKDAY(Y4+6)),1,5)+WEEKDAY(DATE(YEAR(Y4+4-WEEKDAY(Y4+6)),1,3)))/7))+1","v":9}]
["Dato","Dag",null,"Start","Slut","Arb. Tid","Norm",null,null,"Dag\n07-15","Dag\n07-15","Aftenstillæg\nMan-Fre\n15-23","Aftenstillæg\nLør-Søn\n15-23","Aftenstillæg\nHeligdage\n15-23","Aftenstillæg\nMan-Tor\n23-24","Aftenstillæg\nFre-Søn\n23-24","Aftenstillæg\nHelligdage\n23-24","Nattillæg\nMan/Lø-Sø\n00-07","Nattillæg\nTir-Fre\n00-07",null,"Nattillæg\nHeligdage\n00-07"]
[{"$f":"DATE(Y2,1,1)","v":"2020-01-01"},{"$f":"PROPER(TEXT(A6,\"ddd\"))","v":"On"},{"$f":"HelligdagsNavn(A6,0,0)","v":"Nytårsdag"},"22:00:00","06:00:00",{"$f":"IF(D6=\"\",\"\",(E6-D6)+(D6>E6))","v":"08:00:00"},null,null,null,{"$f":"IF(OR(AND(C6<>\"\",D6>E6,WEEKDAY(A6,2)=5),AND(C6=\"\",WEEKDAY(A6,2)>5)),IF(D6=\"\",\"\",ColTime(Data!$J$3,Data!$L$3,D6,E6)),\"\")","v":""},{"$f":"IF(C6<>\"\",IF(D6=\"\",\"\",(IF(E6-MAX(D6,(7/24))+(E6<D6)<0,0,E6-MAX(D6,(7/24))+(E6<D6)))-(IF((E6-MAX(D6,(15/24))+(E6<D6))<0,0,(E6-MAX(D6,(15/24))+(E6<D6))))),\"\")","v":"00:00:00"},{"$f":"IF(AND(C6=\"\",WEEKDAY(A6,2)<6),IF(D6=\"\",\"\",(IF(E6-MAX(D6,(15/24))+(E6<D6)<0,0,E6-MAX(D6,(15/24))+(E6<D6)))-(IF((E6-MAX(D6,(23/24))+(E6<D6))<0,0,(E6-MAX(D6,(23/24))+(E6<D6))))),\"\")","v":""},{"$f":"IF(AND(C6=\"\",WEEKDAY(A6,2)>5),IF(D6=\"\",\"\",(IF(E6-MAX(D6,(15/24))+(E6<D6)<0,0,E6-MAX(D6,(15/24))+($E6<D6)))-(IF((E6-MAX(D6,(23/24))+(E6<D6))<0,0,(E6-MAX(D6,(23/24))+(E6<D6))))),\"\")","v":""},{"$f":"IF(C6<>\"\",IF(D6=\"\",\"\",(IF(E6-MAX(D6,(15/24))+(E6<D6)<0,0,E6-MAX(D6,(15/24))+(E6<D6)))-(IF((E6-MAX(D6,(23/24))+(E6<D6))<0,0,(E6-MAX(D6,(23/24))+(E6<D6))))),\"\")","v":"01:00:00"},{"$f":"IF(AND(C6=\"\",WEEKDAY(A6,2)<5),IF(D6=\"\",\"\",(IF(E6-MAX(D6,(23/24))+(E6<D6)<0,0,E6-MAX(D6,(23/24))+(E6<D6)))-(IF((E6-MAX(D6,(24/24))+(E6<D6))<0,0,(E6-MAX(D6,(24/24))+(E6<D6))))),\"\")","v":""},{"$f":"IF(AND(C6=\"\",WEEKDAY(A6,2)>4),IF(D6=\"\",\"\",(IF(E6-MAX(D6,(23/24))+(E6<D6)<0,0,E6-MAX(D6,(23/24))+(E6<D6)))-(IF((E6-MAX(D6,(24/24))+(E6<D6))<0,0,(E6-MAX(D6,(24/24))+(E6<D6))))),\"\")","v":""},{"$f":"IF(D6=\"\",\"\",IF(C6<>\"\",IF(D6=\"\",\"\",(IF(E6-MAX(D6,(23/24))+(E6<D6)<0,0,E6-MAX(D6,(23/24))+(E6<D6)))-(IF((E6-MAX(D6,(24/24))+(E6<D6))<0,0,(E6-MAX(D6,(24/24))+(E6<D6))))),0))","v":"01:00:00"},{"$f":"IF(OR(AND(C6=\"\",D6<E6,OR(WEEKDAY(A6,2)=1,WEEKDAY(A6,2)>=6)),AND(C6=\"\",D6>E6,OR(WEEKDAY(A6,2)>=5)),AND(C6<>\"\",D6>E6,WEEKDAY(A6,2)>=5)),ColTime(Data!$J$6,Data!$L$6,D6,E6),\"\")","v":""},{"$f":"IFERROR(IF(OR(AND(WEEKDAY(A6,2)>1,WEEKDAY(A6,2)<6,D6<E6,C6=\"\"),AND(C6=\"\",WEEKDAY(A6,2)=1,E6<D6),AND(C6<>\"\",D6<E6,WEEKDAY(A6,2)>1,WEEKDAY(A6,2)<4),AND(C6<>\"\",D6>E6,WEEKDAY(A6,2)=1)),ColTime(Data!$J$6,Data!$L$6,D6,E6),\"\"),\"\")","v":""},null,{"$f":"IF(F6=\"\",\"\",IF(AND(C6<>\"\",OR(D6<E6,AND(D6>E6,C7<>\"\"))),ColTime(Data!$J$6,Data!$L$6,D6,E6),\"\"))","v":""}]
{"$rows_left_out":389}
{"sheet":"Data","index":2,"n_rows":20,"n_cols":12,"rows_kept":20,"cut":false,"hidden":false,"merged":[]}
[]
[null,"Timeløn","Tillæg",null,"Start","Slut"]
["Normal løn",63.86,null,null,"06:00:00","18:00:00",null,"Dag tillæg","Fra kl.","07:00:00","Til kl.","15:00:00"]
["Hverdagstillæg",null,12.6,null,"18:00:00","06:00:00",null,"Aften tillæg","Fra kl.","15:00:00","Til kl.","23:00:00"]
["Lørdag",63.86,null,null,"00:00:00","14:59:00",null,"Nat tillæg 1","Fra kl.","23:00:00","Til kl.","00:00:00"]
["Lørdagstillæg",null,22.38,null,"15:00:00",1,null,"Nat tillæg 2","Fra kl.","00:00:00","Til kl.","07:00:00"]
{"$rows_left_out":15}
{"sheet":"Satser","index":3,"n_rows":23,"n_cols":4,"rows_kept":23,"cut":false,"hidden":false,"merged":[]}
[]
[]
["Timeløn",119.62]
["specielt tillæg",1.19]
["Chauffør tillæg",4.95]
[]
{"$rows_left_out":18}
{"sheet":"Ark3","index":4,"n_rows":0,"n_cols":0,"rows_kept":0,"cut":false,"hidden":false,"merged":[]}