{"text_format":"1","workbook":"xlsx","n_sheets":4,"sheets":["Januar-Februar-Marts","April-Maj-Juni","Juli-August-September","Oktober-November-December"],"not_rendered":{"charts":0,"images":0,"macros":1,"external_links":0,"defined_names":8,"comments":0,"pivot_tables":0},"unopened":[],"bounds":{"document_bytes":16777216,"sheet_cells":100000,"rows_first":2000,"rows_last":500,"rows_between":2000,"halvings":0,"cell_chars":16384,"cell_head_chars":4096},"cells_cut":0,"cells_raw":0,"read":"whole","date_system":"1900"}

{"sheet":"Januar-Februar-Marts","index":0,"n_rows":145,"n_cols":8,"rows_kept":145,"cut":false,"hidden":false,"merged":[[69,0,69,4],[77,0,77,3],[68,7,78,7],[78,0,78,4],[58,0,58,4],[66,0,66,3],[46,7,56,7],[56,0,56,4],[57,7,67,7],[67,0,67,4],[44,0,44,3],[35,7,45,7],[45,0,45,4],[47,0,47,4],[55,0,55,3],[25,0,25,4],[33,0,33,3],[24,7,34,7],[34,0,34,4],[36,0,36,4],[2,7,12,7],[0,0,0,3],[13,7,23,7],[23,0,23,4],[1,0,1,3],[3,0,3,4],[11,0,11,3],[12,0,12,4],[14,0,14,4],[22,0,22,3],[79,7,89,7],[80,0,80,4],[88,0,88,3],[89,0,89,4],[90,7,100,7],[91,0,91,4],[99,0,99,3],[100,0,100,4],[101,7,111,7],[102,0,102,4],[110,0,110,3],[111,0,111,4],[112,7,122,7],[113,0,113,4],[121,0,121,3],[122,0,122,4],[123,7,133,7],[124,0,124,4],[132,0,132,3],[133,0,133,4],[134,7,144,7],[135,0,135,4],[143,0,143,3],[144,0,144,4]]}
["Timer til afspadsering:",null,null,null,{"$f":"SUM(G:G)+E2","v":0}]
["Overført fra forrige år",null,null,null,0]
["Dato","Møde-gå",null,"Pause","Timer",null,null,{"$f":"IF(G13=\"\",\"Ugen er IKKE skrevet \",\"Ugen er skrevet\")","v":"Ugen er IKKE skrevet "}]
[null,null,null,null,null,{"$f":"COUNT(D5:D11)","v":2}]
["2012-01-02",null,null,null,{"$f":"SUM((C5-B5)-D5)","v":"00:00:00"}]
["2012-01-03",null,null,null,"00:00:00"]
["2012-01-04",null,null,null,"00:00:00"]
["2012-01-05",null,null,null,{"$f":"SUM((C8-B8)-D8)","v":"00:00:00"}]
["2012-01-06",null,null,null,"00:00:00"]
["2012-01-07","00:00:00","00:00:00","00:00:00","00:00:00"]
["2012-01-08","00:00:00","00:00:00","00:00:00","00:00:00"]
["Timer på ugen:",null,null,null,{"$f":"SUM(E5:E11)*24","v":0}]
["Timer til afspadsering:",null,null,null,null,null,{"$f":"IF(F4=7,E12-37,\"\")","v":""}]
["Dato","Møde-gå",null,"Pause","Timer",null,null,{"$f":"IF(G24=\"\",\"Ugen er IKKE skrevet \",\"Ugen er skrevet\")","v":"Ugen er IKKE skrevet "}]
[null,null,null,null,null,{"$f":"COUNT(D16:D22)","v":2}]
["2012-01-09",null,null,null,{"$f":"SUM((C16-B16)-D16)","v":"00:00:00"}]
["2012-01-10",null,null,null,"00:00:00"]
["2012-01-11",null,null,null,"00:00:00"]
["2012-01-12",null,null,null,"00:00:00"]
["2012-01-13",null,null,null,"00:00:00"]
["2012-01-14","00:00:00","00:00:00","00:00:00","00:00:00"]
["2012-01-15","00:00:00","00:00:00","00:00:00","00:00:00"]
["Timer på ugen:",null,null,null,{"$f":"SUM(E16:E22)*24","v":0}]
["Timer til afspadsering:",null,null,null,null,null,{"$f":"IF(F15=7,E23-37,\"\")","v":""}]
["Dato","Møde-gå",null,"Pause","Timer",null,null,{"$f":"IF(G35=\"\",\"Ugen er IKKE skrevet \",\"Ugen er skrevet\")","v":"Ugen er IKKE skrevet "}]
[null,null,null,null,null,{"$f":"COUNT(D27:D33)","v":2}]
["2012-01-16",null,null,null,{"$f":"SUM((C27-B27)-D27)","v":"00:00:00"}]
["2012-01-17",null,null,null,"00:00:00"]
["2012-01-18",null,null,null,"00:00:00"]
["2012-01-19",null,null,null,"00:00:00"]
["2012-01-20",null,null,null,"00:00:00"]
["2012-01-21","00:00:00","00:00:00","00:00:00","00:00:00"]
["2012-01-22","00:00:00","00:00:00","00:00:00","00:00:00"]
["Timer på ugen:",null,null,null,{"$f":"SUM(E27:E33)*24","v":0}]
["Timer til afspadsering:",null,null,null,null,null,{"$f":"IF(F26=7,E34-37,\"\")","v":""}]
["Dato","Møde-gå",null,"Pause","Timer",null,null,{"$f":"IF(G46=\"\",\"Ugen er IKKE skrevet \",\"Ugen er skrevet\")","v":"Ugen er IKKE skrevet "}]
[null,null,null,null,null,{"$f":"COUNT(D38:D44)","v":2}]
["2012-01-23",null,null,null,{"$f":"SUM((C38-B38)-D38)","v":"00:00:00"}]
["2012-01-24",null,null,null,"00:00:00"]
["2012-01-25",null,null,null,"00:00:00"]
["2012-01-26",null,null,null,"00:00:00"]
["2012-01-27",null,null,null,"00:00:00"]
["2012-01-28","00:00:00","00:00:00","00:00:00","00:00:00"]
["2012-01-29","00:00:00","00:00:00","00:00:00","00:00:00"]
["Timer på ugen:",null,null,null,{"$f":"SUM(E38:E44)*24","v":0}]
["Timer til afspadsering:",null,null,null,null,null,{"$f":"IF(F37=7,E45-37,\"\")","v":""}]
["Dato","Møde-gå",null,"Pause","Timer",null,null,{"$f":"IF(G57=\"\",\"Ugen er IKKE skrevet \",\"Ugen er skrevet\")","v":"Ugen er IKKE skrevet "}]
[null,null,null,null,null,{"$f":"COUNT(D49:D55)","v":2}]
["2012-01-30",null,null,null,{"$f":"SUM((C49-B49)-D49)","v":"00:00:00"}]
["2012-01-31",null,null,null,"00:00:00"]
["2012-02-01",null,null,null,"00:00:00"]
["2012-02-02",null,null,null,"00:00:00"]
["2012-02-03",null,null,null,"00:00:00"]
["2012-02-04","00:00:00","00:00:00","00:00:00","00:00:00"]
["2012-02-05","00:00:00","00:00:00","00:00:00","00:00:00"]
["Timer på ugen:",null,null,null,{"$f":"SUM(E49:E55)*24","v":0}]
["Timer til afspadsering:",null,null,null,null,null,{"$f":"IF(F48=7,E56-37,\"\")","v":""}]
["Dato","Møde-gå",null,"Pause","Timer",null,null,{"$f":"IF(G68=\"\",\"Ugen er IKKE skrevet \",\"Ugen er skrevet\")","v":"Ugen er IKKE skrevet "}]
[null,null,null,null,null,{"$f":"COUNT(D60:D66)","v":2}]
["2012-02-06",null,null,null,{"$f":"SUM((C60-B60)-D60)","v":"00:00:00"}]
["2012-02-07",null,null,null,"00:00:00"]
["2012-02-08",null,null,null,"00:00:00"]
["2012-02-09",null,null,null,"00:00:00"]
["2012-02-10",null,null,null,"00:00:00"]
["2012-02-11","00:00:00","00:00:00","00:00:00","00:00:00"]
["2012-02-12","00:00:00","00:00:00","00:00:00","00:00:00"]
["Timer på ugen:",null,null,null,{"$f":"SUM(E60:E66)*24","v":0}]
["Timer til afspadsering:",null,null,null,null,null,{"$f":"IF(F59=7,E67-37,\"\")","v":""}]
["Dato","Møde-gå",null,"Pause","Timer",null,null,{"$f":"IF(G79=\"\",\"Ugen er IKKE skrevet \",\"Ugen er skrevet\")","v":"Ugen er IKKE skrevet "}]
[null,null,null,null,null,{"$f":"COUNT(D71:D77)","v":2}]
["2012-02-13",null,null,null,{"$f":"SUM((C71-B71)-D71)","v":"00:00:00"}]
["2012-02-14",null,null,null,"00:00:00"]
["2012-02-15",null,null,null,"00:00:00"]
["2012-02-16",null,null,null,"00:00:00"]
["2012-02-17",null,null,null,"00:00:00"]
["2012-02-18","00:00:00","00:00:00","00:00:00","00:00:00"]
["2012-02-19","00:00:00","00:00:00","00:00:00","00:00:00"]
["Timer på ugen:",null,null,null,{"$f":"SUM(E71:E77)*24","v":0}]
["Timer til afspadsering:",null,null,null,null,null,{"$f":"IF(F70=7,E78-37,\"\")","v":""}]
["Dato","Møde-gå",null,"Pause","Timer",null,null,{"$f":"IF(G90=\"\",\"Ugen er IKKE skrevet \",\"Ugen er skrevet\")","v":"Ugen er IKKE skrevet "}]
[null,null,null,null,null,{"$f":"COUNT(D82:D88)","v":2}]
["2012-02-20",null,null,null,{"$f":"SUM((C82-B82)-D82)","v":"00:00:00"}]
["2012-02-21",null,null,null,"00:00:00"]
["2012-02-22",null,null,null,"00:00:00"]
["2012-02-23",null,null,null,"00:00:00"]
["2012-02-24",null,null,null,"00:00:00"]
["2012-02-25","00:00:00","00:00:00","00:00:00","00:00:00"]
["2012-02-26","00:00:00","00:00:00","00:00:00","00:00:00"]
["Timer på ugen:",null,null,null,{"$f":"SUM(E82:E88)*24","v":0}]
["Timer til afspadsering:",null,null,null,null,null,{"$f":"IF(F81=7,E89-37,\"\")","v":""}]
["Dato","Møde-gå",null,"Pause","Timer",null,null,{"$f":"IF(G101=\"\",\"Ugen er IKKE skrevet \",\"Ugen er skrevet\")","v":"Ugen er IKKE skrevet "}]
[null,null,null,null,null,{"$f":"COUNT(D93:D99)","v":2}]
["2012-02-27",null,null,null,{"$f":"SUM((C93-B93)-D93)","v":"00:00:00"}]
["2012-02-28",null,null,null,"00:00:00"]
["2012-02-29",null,null,null,"00:00:00"]
["2012-03-01",null,null,null,"00:00:00"]
["2012-03-02",null,null,null,"00:00:00"]
["2012-03-03","00:00:00","00:00:00","00:00:00","00:00:00"]
["2012-03-04","00:00:00","00:00:00","00:00:00","00:00:00"]
["Timer på ugen:",null,null,null,{"$f":"SUM(E93:E99)*24","v":0}]
["Timer til afspadsering:",null,null,null,null,null,{"$f":"IF(F92=7,E100-37,\"\")","v":""}]
["Dato","Møde-gå",null,"Pause","Timer",null,null,{"$f":"IF(G112=\"\",\"Ugen er IKKE skrevet \",\"Ugen er skrevet\")","v":"Ugen er IKKE skrevet "}]
[null,null,null,null,null,{"$f":"COUNT(D104:D110)","v":2}]
["2012-03-05",null,null,null,{"$f":"SUM((C104-B104)-D104)","v":"00:00:00"}]
["2012-03-06",null,null,null,"00:00:00"]
["2012-03-07",null,null,null,"00:00:00"]
["2012-03-08",null,null,null,"00:00:00"]
["2012-03-09",null,null,null,"00:00:00"]
["2012-03-10","00:00:00","00:00:00","00:00:00","00:00:00"]
["2012-03-11","00:00:00","00:00:00","00:00:00","00:00:00"]
["Timer på ugen:",null,null,null,{"$f":"SUM(E104:E110)*24","v":0}]
["Timer til afspadsering:",null,null,null,null,null,{"$f":"IF(F103=7,E111-37,\"\")","v":""}]
["Dato","Møde-gå",null,"Pause","Timer",null,null,{"$f":"IF(G123=\"\",\"Ugen er IKKE skrevet \",\"Ugen er skrevet\")","v":"Ugen er IKKE skrevet "}]
[null,null,null,null,null,{"$f":"COUNT(D115:D121)","v":2}]
["2012-03-12",null,null,null,{"$f":"SUM((C115-B115)-D115)","v":"00:00:00"}]
["2012-03-13",null,null,null,"00:00:00"]
["2012-03-14",null,null,null,"00:00:00"]
["2012-03-15",null,null,null,"00:00:00"]
["2012-03-16",null,null,null,"00:00:00"]
["2012-03-17","00:00:00","00:00:00","00:00:00","00:00:00"]
["2012-03-18","00:00:00","00:00:00","00:00:00","00:00:00"]
["Timer på ugen:",null,null,null,{"$f":"SUM(E115:E121)*24","v":0}]
["Timer til afspadsering:",null,null,null,null,null,{"$f":"IF(F114=7,E122-37,\"\")","v":""}]
["Dato","Møde-gå",null,"Pause","Timer",null,null,{"$f":"IF(G134=\"\",\"Ugen er IKKE skrevet \",\"Ugen er skrevet\")","v":"Ugen er IKKE skrevet "}]
[null,null,null,null,null,{"$f":"COUNT(D126:D132)","v":2}]
["2012-03-19",null,null,null,{"$f":"SUM((C126-B126)-D126)","v":"00:00:00"}]
["2012-03-20",null,null,null,"00:00:00"]
["2012-03-21",null,null,null,"00:00:00"]
["2012-03-22",null,null,null,"00:00:00"]
["2012-03-23",null,null,null,"00:00:00"]
["2012-03-24","00:00:00","00:00:00","00:00:00","00:00:00"]
["2012-03-25","00:00:00","00:00:00","00:00:00","00:00:00"]
["Timer på ugen:",null,null,null,{"$f":"SUM(E126:E132)*24","v":0}]
["Timer til afspadsering:",null,null,null,null,null,{"$f":"IF(F125=7,E133-37,\"\")","v":""}]
["Dato","Møde-gå",null,"Pause","Timer",null,null,{"$f":"IF(G145=\"\",\"Ugen er IKKE skrevet \",\"Ugen er skrevet\")","v":"Ugen er IKKE skrevet "}]
[null,null,null,null,null,{"$f":"COUNT(D137:D143)","v":2}]
["2012-03-26",null,null,null,{"$f":"SUM((C137-B137)-D137)","v":"00:00:00"}]
["2012-03-27",null,null,null,"00:00:00"]
["2012-03-28",null,null,null,"00:00:00"]
["2012-03-29",null,null,null,"00:00:00"]
["2012-03-30",null,null,null,"00:00:00"]
["2012-03-31","00:00:00","00:00:00","00:00:00","00:00:00"]
["2012-04-01","00:00:00","00:00:00","00:00:00","00:00:00"]
["Timer på ugen:",null,null,null,{"$f":"SUM(E137:E143)*24","v":0}]
["Timer til afspadsering:",null,null,null,null,null,{"$f":"IF(F136=7,E144-37,\"\")","v":""}]

{"sheet":"April-Maj-Juni","index":1,"n_rows":145,"n_cols":8,"rows_kept":145,"cut":false,"hidden":false,"merged":[[0,0,0,3],[1,0,1,3],[112,7,122,7],[113,0,113,4],[121,0,121,3],[122,0,122,4],[2,7,12,7],[3,0,3,4],[11,0,11,3],[12,0,12,4],[24,7,34,7],[25,0,25,4],[33,0,33,3],[34,0,34,4],[35,7,45,7],[36,0,36,4],[123,7,133,7],[124,0,124,4],[132,0,132,3],[133,0,133,4],[134,7,144,7],[135,0,135,4],[143,0,143,3],[144,0,144,4],[44,0,44,3],[45,0,45,4],[46,7,56,7],[47,0,47,4],[55,0,55,3],[56,0,56,4],[79,7,89,7],[80,0,80,4],[88,0,88,3],[89,0,89,4],[13,7,23,7],[14,0,14,4],[22,0,22,3],[23,0,23,4],[68,7,78,7],[69,0,69,4],[77,0,77,3],[57,7,67,7],[58,0,58,4],[66,0,66,3],[67,0,67,4],[78,0,78,4],[114,1,114,2],[90,7,100,7],[91,0,91,4],[99,0,99,3],[100,0,100,4],[101,7,111,7],[102,0,102,4],[110,0,110,3],[111,0,111,4]]}
["Timer til afspadsering:",null,null,null,{"$f":"SUM(G:G)+E2","v":16.749999999999993}]
["Overført fra forrige måned",null,null,null,{"$f":"('Januar-Februar-Marts'!E1)","v":0}]
["Dato","Møde-gå",null,"Pause","Timer",null,null,{"$f":"IF(G13=\"\",\"Ugen er IKKE skrevet \",\"Ugen er skrevet\")","v":"Ugen er IKKE skrevet "}]
[null,null,null,null,null,{"$f":"COUNT(D5:D11)","v":2}]
["2012-04-02",null,null,null,{"$f":"SUM((C5-B5)-D5)","v":"00:00:00"}]
["2012-04-03",null,null,null,"00:00:00"]
["2012-04-04",null,null,null,"00:00:00"]
["2012-04-05",null,null,null,"00:00:00"]
["2012-04-06",null,null,null,"00:00:00"]
["2012-04-07","00:00:00","00:00:00","00:00:00","00:00:00"]
["2012-04-08","00:00:00","00:00:00","00:00:00","00:00:00"]
["Timer på ugen:",null,null,null,{"$f":"SUM(E5:E11)*24","v":0}]
["Timer til afspadsering:",null,null,null,null,null,{"$f":"IF(F4=7,E12-37,\"\")","v":""}]
["Dato","Møde-gå",null,"Pause","Timer",null,null,{"$f":"IF(G24=\"\",\"Ugen er IKKE skrevet \",\"Ugen er skrevet\")","v":"Ugen er IKKE skrevet "}]
[null,null,null,null,null,{"$f":"COUNT(D16:D22)","v":2}]
["2012-04-09",null,null,null,{"$f":"SUM((C16-B16)-D16)","v":"00:00:00"}]
["2012-04-10",null,null,null,"00:00:00"]
["2012-04-11",null,null,null,"00:00:00"]
["2012-04-12",null,null,null,"00:00:00"]
["2012-04-13",null,null,null,"00:00:00"]
["2012-04-14","00:00:00","00:00:00","00:00:00","00:00:00"]
["2012-04-15","00:00:00","00:00:00","00:00:00","00:00:00"]
["Timer på ugen:",null,null,null,{"$f":"SUM(E16:E22)*24","v":0}]
["Timer til afspadsering:",null,null,null,null,null,{"$f":"IF(F15=7,E23-37,\"\")","v":""}]
["Dato","Møde-gå",null,"Pause","Timer",null,null,"Ugen er IKKE skrevet "]
[null,null,null,null,null,{"$f":"COUNT(D27:D33)","v":2}]
["2012-04-16",null,null,null,{"$f":"SUM((C27-B27)-D27)","v":"00:00:00"}]
["2012-04-17",null,null,null,"00:00:00"]
["2012-04-18",null,null,null,"00:00:00"]
["2012-04-19",null,null,null,"00:00:00"]
["2012-04-20",null,null,null,"00:00:00"]
["2012-04-21","00:00:00","00:00:00","00:00:00","00:00:00"]
["2012-04-22","00:00:00","00:00:00","00:00:00","00:00:00"]
["Timer på ugen:",null,null,null,{"$f":"SUM(E27:E33)*24","v":0}]
["Timer til afspadsering:",null,null,null,null,null,{"$f":"IF(F26=7,E34-37,\"\")","v":""}]
["Dato","Møde-gå",null,"Pause","Timer",null,null,"Ugen er IKKE skrevet "]
[null,null,null,null,null,{"$f":"COUNT(D38:D44)","v":2}]
["2012-04-23",null,null,null,{"$f":"SUM((C38-B38)-D38)","v":"00:00:00"}]
["2012-04-24",null,null,null,"00:00:00"]
["2012-04-25",null,null,null,"00:00:00"]
["2012-04-26",null,null,null,"00:00:00"]
["2012-04-27",null,null,null,"00:00:00"]
["2012-04-28","00:00:00","00:00:00","00:00:00","00:00:00"]
["2012-04-29","00:00:00","00:00:00","00:00:00","00:00:00"]
["Timer på ugen:",null,null,null,{"$f":"SUM(E38:E44)*24","v":0}]
["Timer til afspadsering:",null,null,null,null,null,{"$f":"IF(F37=7,E45-37,\"\")","v":""}]
["Dato","Møde-gå",null,"Pause","Timer",null,null,"Ugen er IKKE skrevet "]
[null,null,null,null,null,{"$f":"COUNT(D49:D55)","v":2}]
["2012-04-30",null,null,null,{"$f":"SUM((C49-B49)-D49)","v":"00:00:00"}]
["2012-05-01",null,null,null,"00:00:00"]
["2012-05-02",null,null,null,"00:00:00"]
["2012-05-03",null,null,null,"00:00:00"]
["2012-05-04",null,null,null,"00:00:00"]
["2012-05-05","00:00:00","00:00:00","00:00:00","00:00:00"]
["2012-05-06","00:00:00","00:00:00","00:00:00","00:00:00"]
["Timer på ugen:",null,null,null,{"$f":"SUM(E49:E55)*24","v":0}]
["Timer til afspadsering:",null,null,null,null,null,{"$f":"IF(F48=7,E56-37,\"\")","v":""}]
["Dato","Møde-gå",null,"Pause","Timer",null,null,"Ugen er IKKE skrevet "]
[null,null,null,null,null,{"$f":"COUNT(D60:D66)","v":2}]
["2012-05-07",null,null,null,{"$f":"SUM((C60-B60)-D60)","v":"00:00:00"}]
["2012-05-08",null,null,null,"00:00:00"]
["2012-05-09",null,null,null,"00:00:00"]
["2012-05-10",null,null,null,"00:00:00"]
["2012-05-11",null,null,null,"00:00:00"]
["2012-05-12","00:00:00","00:00:00","00:00:00","00:00:00"]
["2012-05-13","00:00:00","00:00:00","00:00:00","00:00:00"]
["Timer på ugen:",null,null,null,{"$f":"SUM(E60:E66)*24","v":0}]
["Timer til afspadsering:",null,null,null,null,null,{"$f":"IF(F59=7,E67-37,\"\")","v":""}]
["Dato","Møde-gå",null,"Pause","Timer",null,null,"Ugen er IKKE skrevet "]
[null,null,null,null,null,{"$f":"COUNT(D71:D77)","v":2}]
["2012-05-14",null,null,null,{"$f":"SUM((C71-B71)-D71)","v":"00:00:00"}]
["2012-05-15",null,null,null,"00:00:00"]
["2012-05-16",null,null,null,"00:00:00"]
["2012-05-17",null,null,null,"00:00:00"]
["2012-05-18",null,null,null,"00:00:00"]
["2012-05-19","00:00:00","00:00:00","00:00:00","00:00:00"]
["2012-05-20","00:00:00","00:00:00","00:00:00","00:00:00"]
["Timer på ugen:",null,null,null,{"$f":"SUM(E71:E77)*24","v":0}]
["Timer til afspadsering:",null,null,null,null,null,{"$f":"IF(F70=7,E78-37,\"\")","v":""}]
["Dato","Møde-gå",null,"Pause","Timer",null,null,{"$f":"IF(G90=\"\",\"Ugen er IKKE skrevet \",\"Ugen er skrevet\")","v":"Ugen er IKKE skrevet "}]
[null,null,null,null,null,{"$f":"COUNT(D82:D88)","v":2}]
["2012-05-21",null,null,null,{"$f":"SUM((C82-B82)-D82)","v":"00:00:00"}]
["2012-05-22",null,null,null,"00:00:00"]
["2012-05-23",null,null,null,"00:00:00"]
["2012-05-24",null,null,null,"00:00:00"]
["2012-05-25",null,null,null,"00:00:00"]
["2012-05-26","00:00:00","00:00:00","00:00:00","00:00:00"]
["2012-05-27","00:00:00","00:00:00","00:00:00","00:00:00"]
["Timer på ugen:",null,null,null,{"$f":"SUM(E82:E88)*24","v":0}]
["Timer til afspadsering:",null,null,null,null,null,{"$f":"IF(F81=7,E89-37,\"\")","v":""}]
["Dato","Møde-gå",null,"Pause","Timer",null,null,"Ugen er IKKE skrevet "]
[null,null,null,null,null,{"$f":"COUNT(D93:D99)","v":2}]
["2012-05-28",null,null,null,{"$f":"SUM((C93-B93)-D93)","v":"00:00:00"}]
["2012-05-29",null,null,null,"00:00:00"]
["2012-05-30",null,null,null,"00:00:00"]
["2012-05-31",null,null,null,"00:00:00"]
["2012-06-01",null,null,null,"00:00:00"]
["2012-06-02","00:00:00","00:00:00","00:00:00","00:00:00"]
["2012-06-03","00:00:00","00:00:00","00:00:00","00:00:00"]
["Timer på ugen:",null,null,null,{"$f":"SUM(E93:E99)*24","v":0}]
["Timer til afspadsering:",null,null,null,null,null,{"$f":"IF(F92=7,E100-37,\"\")","v":""}]
["Dato","Møde-gå",null,"Pause","Timer",null,null,"Ugen er IKKE skrevet "]
[null,null,null,null,null,{"$f":"COUNT(D104:D110)","v":2}]
["2012-06-04",null,null,null,{"$f":"SUM((C104-B104)-D104)","v":"00:00:00"}]
["2012-06-05",null,null,null,"00:00:00"]
["2012-06-06",null,null,null,"00:00:00"]
["2012-06-07",null,null,null,"00:00:00"]
["2012-06-08",null,null,null,"00:00:00"]
["2012-06-09","00:00:00","00:00:00","00:00:00","00:00:00"]
["2012-06-10","00:00:00","00:00:00","00:00:00","00:00:00"]
["Timer på ugen:",null,null,null,{"$f":"SUM(E104:E110)*24","v":0}]
["Timer til afspadsering:",null,null,null,null,null,{"$f":"IF(F103=7,E111-37,\"\")","v":""}]
["Dato","Møde-gå",null,"Pause","Timer",null,null,{"$f":"IF(G123=\"\",\"Ugen er IKKE skrevet \",\"Ugen er skrevet\")","v":"Ugen er skrevet"}]
["Uge 24",null,null,null,null,{"$f":"COUNT(D115:D121)","v":7}]
["2012-06-11","Ikke startet",null,"00:00:00","07:30:00"]
["2012-06-12","07:00:00","15:15:00","00:00:00",{"$f":"SUM((C116-B116)-D116)","v":"08:15:00"}]
["2012-06-13","07:00:00","16:15:00","00:30:00","08:45:00"]
["2012-06-14","06:45:00","16:15:00","00:30:00","09:00:00"]
["2012-06-15","06:45:00","15:45:00","00:30:00","08:30:00"]
["2012-06-16","00:00:00","00:00:00","00:00:00","00:00:00"]
["2012-06-17","00:00:00","00:00:00","00:00:00","00:00:00"]
["Timer på ugen:",null,null,null,{"$f":"SUM(E115:E121)*24","v":42.000000000000007}]
["Timer til afspadsering:",null,null,null,null,null,{"$f":"IF(F114=7,E122-37,\"\")","v":5.0000000000000071}]
["Dato","Møde-gå",null,"Pause","Timer",null,null,"Ugen er skrevet"]
["Uge 25",null,null,null,null,{"$f":"COUNT(D126:D132)","v":7}]
["2012-06-18","07:00:00","16:30:00","00:00:00",{"$f":"SUM((C126-B126)-D126)","v":"09:30:00"}]
["2012-06-19","07:00:00","15:00:00","00:30:00","07:30:00"]
["2012-06-20","07:00:00","15:00:00","00:30:00","07:30:00"]
["2012-06-21","06:00:00","16:15:00","00:00:00","10:15:00"]
["2012-06-22","06:45:00","15:15:00","00:00:00","08:30:00"]
["2012-06-23","00:00:00","00:00:00","00:00:00","00:00:00"]
["2012-06-24","00:00:00","00:00:00","00:00:00","00:00:00"]
["Timer på ugen:",null,null,null,{"$f":"SUM(E126:E132)*24","v":43.249999999999993}]
["Timer til afspadsering:",null,null,null,null,null,{"$f":"IF(F125=7,E133-37,\"\")","v":6.2499999999999929}]
["Dato","Møde-gå",null,"Pause","Timer",null,null,"Ugen er skrevet"]
["Uge 26",null,null,null,null,{"$f":"COUNT(D137:D143)","v":7}]
["2012-06-25","07:00:00","13:45:00","00:00:00",{"$f":"SUM((C137-B137)-D137)","v":"06:45:00"}]
["2012-06-26","07:00:00","16:15:00","00:30:00","08:45:00"]
["2012-06-27","06:00:00","17:00:00","00:00:00","11:00:00"]
["2012-06-28","06:00:00","16:00:00","00:30:00","09:30:00"]
["2012-06-29","07:00:00","14:00:00","00:30:00","06:30:00"]
["2012-06-30","00:00:00","00:00:00","00:00:00","00:00:00"]
["2012-07-01","00:00:00","00:00:00","00:00:00","00:00:00"]
["Timer på ugen:",null,null,null,{"$f":"SUM(E137:E143)*24","v":42.499999999999993}]
["Timer til afspadsering:",null,null,null,null,null,{"$f":"IF(F136=7,E144-37,\"\")","v":5.4999999999999929}]

{"sheet":"Juli-August-September","index":2,"n_rows":146,"n_cols":8,"rows_kept":146,"cut":false,"hidden":false,"merged":[[2,7,12,7],[3,0,3,4],[11,0,11,3],[12,0,12,4],[0,0,0,3],[1,0,1,3],[40,1,40,2],[52,1,52,2],[37,1,37,2],[38,1,38,2],[41,1,41,2],[48,1,48,2],[49,1,49,2],[50,1,50,2],[44,0,44,3],[45,0,45,4],[46,7,56,7],[47,0,47,4],[55,0,55,3],[56,0,56,4],[57,7,68,7],[58,0,58,4],[67,0,67,3],[68,0,68,4],[51,1,51,2],[69,7,79,7],[70,0,70,4],[78,0,78,3],[79,0,79,4],[80,7,90,7],[81,0,81,4],[89,0,89,3],[90,0,90,4],[91,7,101,7],[92,0,92,4],[100,0,100,3],[101,0,101,4],[102,7,112,7],[103,0,103,4],[111,0,111,3],[112,0,112,4],[113,7,123,7],[114,0,114,4],[122,0,122,3],[123,0,123,4],[144,0,144,3],[145,0,145,4],[124,7,134,7],[125,0,125,4],[133,0,133,3],[134,0,134,4],[135,7,145,7],[136,0,136,4],[35,7,45,7],[36,0,36,4],[13,7,23,7],[14,0,14,4],[22,0,22,3],[23,0,23,4],[24,7,34,7],[25,0,25,4],[26,1,26,2],[27,1,27,2],[28,1,28,2],[29,1,29,2],[30,1,30,2],[33,0,33,3],[34,0,34,4],[39,1,39,2]]}
["Timer til afspadsering:",null,null,null,{"$f":"SUM(G:G)+E2","v":20.749999999999993}]
["Overført fra forrige måned",null,null,null,{"$f":"('April-Maj-Juni'!E1)","v":16.749999999999993}]
["Dato","Møde-gå",null,"Pause","Timer",null,null,{"$f":"IF(G13=\"\",\"Ugen er IKKE skrevet \",\"Ugen er skrevet\")","v":"Ugen er skrevet"}]
["Uge 27",null,null,null,null,{"$f":"COUNT(D5:D11)","v":7}]
["2012-07-02","06:00:00","14:45:00","00:00:00",{"$f":"SUM((C5-B5)-D5)","v":"08:45:00"}]
["2012-07-03","07:00:00","16:15:00","00:00:00","09:15:00"]
["2012-07-04","06:00:00","16:15:00","00:00:00","10:15:00"]
["2012-07-05","07:00:00","16:30:00","00:00:00","09:30:00"]
["2012-07-06","09:30:00","15:15:00","00:00:00","05:45:00"]
["2012-07-07","00:00:00","00:00:00","00:00:00","00:00:00"]
["2012-07-08","00:00:00","00:00:00","00:00:00","00:00:00"]
["Timer på ugen:",null,null,null,{"$f":"SUM(E5:E11)*24","v":43.5}]
["Timer til afspadsering:",null,null,null,null,null,{"$f":"IF(F4=7,E12-37,\"\")","v":6.5}]
["Dato","Møde-gå",null,"Pause","Timer",null,null,{"$f":"IF(G24=\"\",\"Ugen er IKKE skrevet \",\"Ugen er skrevet\")","v":"Ugen er skrevet"}]
["Uge 28",null,null,null,null,{"$f":"COUNT(D16:D22)","v":7}]
["2012-07-09","06:00:00","17:00:00","00:00:00",{"$f":"SUM((C16-B16)-D16)","v":"11:00:00"}]
["2012-07-10","06:00:00","16:15:00","00:00:00","10:15:00"]
["2012-07-11","07:00:00","16:15:00","00:30:00","08:45:00"]
["2012-07-12","06:00:00","16:45:00","00:00:00","10:45:00"]
["2012-07-13","06:00:00","15:45:00","00:00:00","09:45:00"]
["2012-07-14","00:00:00","00:00:00","00:00:00","00:00:00"]
["2012-07-15","00:00:00","00:00:00","00:00:00","00:00:00"]
["Timer på ugen:",null,null,null,{"$f":"SUM(E16:E22)*24","v":50.5}]
["Timer til afspadsering:",null,null,null,null,null,{"$f":"IF(F15=7,E23-37,\"\")","v":13.5}]
["Dato","Møde-gå",null,"Pause","Timer",null,null,"Ugen er skrevet"]
["Uge 29",null,null,null,null,{"$f":"COUNT(D27:D33)","v":7}]
["2012-07-16","Afspadsering",null,"00:00:00","00:00:00"]
["2012-07-17","Afspadsering",null,"00:00:00","00:00:00"]
["2012-07-18","Afspadsering",null,"00:00:00","00:00:00"]
["2012-07-19","Afspadsering",null,"00:00:00","00:00:00"]
["2012-07-20","Afspadsering",null,"00:00:00","00:00:00"]
["2012-07-21","00:00:00","00:00:00","00:00:00",{"$f":"SUM((C32-B32)-D32)","v":"00:00:00"}]
["2012-07-22","00:00:00","00:00:00","00:00:00","00:00:00"]
["Timer på ugen:",null,null,null,{"$f":"SUM(E27:E33)*24","v":0}]
["Timer til afspadsering:",null,null,null,null,null,{"$f":"IF(F26=7,E34-37,\"\")","v":-37}]
["Dato","Møde-gå",null,"Pause","Timer",null,null,"Ugen er IKKE skrevet "]
["Uge 30",null,null,null,null,{"$f":"COUNT(D38:D44)","v":2}]
["2012-07-23","Ferie"]
["2012-07-24","Ferie"]
["2012-07-25","Ferie"]
["2012-07-26","Ferie"]
["2012-07-27","Ferie"]
["2012-07-28","00:00:00","00:00:00","00:00:00",{"$f":"SUM((C43-B43)-D43)","v":"00:00:00"}]
["2012-07-29","00:00:00","00:00:00","00:00:00","00:00:00"]
["Timer på ugen:",null,null,null,{"$f":"SUM(E38:E44)*24","v":0}]
["Timer til afspadsering:",null,null,null,null,null,{"$f":"IF(F37=7,E45-37,\"\")","v":""}]
["Dato","Møde-gå",null,"Pause","Timer",null,null,"Ugen er IKKE skrevet "]
["Uge 31",null,null,null,null,{"$f":"COUNT(D49:D55)","v":2}]
["2012-07-30","Ferie"]
["2012-07-31","Ferie"]
["2012-08-01","Ferie"]
["2012-08-02","Ferie"]
["2012-08-03","Ferie"]
["2012-08-04","00:00:00","00:00:00","00:00:00",{"$f":"SUM((C54-B54)-D54)","v":"00:00:00"}]
["2012-08-05","00:00:00","00:00:00","00:00:00","00:00:00"]
["Timer på ugen:",null,null,null,{"$f":"SUM(E49:E55)*24","v":0}]
["Timer til afspadsering:",null,null,null,null,null,{"$f":"IF(F48=7,E56-37,\"\")","v":""}]
["Dato","Møde-gå",null,"Pause","Timer",null,null,{"$f":"IF(G69=\"\",\"Ugen er IKKE skrevet \",\"Ugen er skrevet\")","v":"Ugen er skrevet"}]
["Uge 32",null,null,null,null,{"$f":"COUNT(D60:D67)","v":8}]
["2012-08-06","06:15:00","16:45:00","00:30:00",{"$f":"SUM((C60-B60)-D60)","v":"10:00:00"}]
["2012-08-07","05:15:00","17:45:00","00:30:00","12:00:00"]
["2012-08-08","06:15:00","16:15:00","00:00:00","10:00:00"]
["2012-08-09","06:30:00","17:45:00","00:00:00","11:15:00"]
["2012-08-09","19:00:00","20:30:00","00:00:00","01:30:00"]
["2012-08-10","06:00:00","19:00:00","00:00:00","13:00:00"]
["2012-08-11","00:00:00","00:00:00","00:00:00","00:00:00"]
["2012-08-12","00:00:00","00:00:00","00:00:00","00:00:00"]
["Timer på ugen:",null,null,null,{"$f":"SUM(E60:E67)*24","v":57.75}]
["Timer til afspadsering:",null,null,null,null,null,{"$f":"SUM(E68-37)","v":20.75}]
["Dato","Møde-gå",null,"Pause","Timer",null,null,"Ugen er skrevet"]
["Uge 33",null,null,null,null,{"$f":"COUNT(D72:D78)","v":7}]
["2012-08-13","06:00:00","16:15:00","00:00:00",{"$f":"SUM((C72-B72)-D72)","v":"10:15:00"}]
["2012-08-14","FRI",null,"00:00:00","00:00:00"]
["2012-08-15","07:00:00","16:15:00","00:00:00","09:15:00"]
["2012-08-16","06:00:00","15:45:00","00:00:00","09:45:00"]
["2012-08-17","06:00:00","13:45:00","00:00:00","07:45:00"]
["2012-08-18","00:00:00","00:00:00","00:00:00","00:00:00"]
["2012-08-19","00:00:00","00:00:00","00:00:00","00:00:00"]
["Timer på ugen:",null,null,null,{"$f":"SUM(E72:E78)*24","v":37}]
["Timer til afspadsering:",null,null,null,null,null,{"$f":"IF(F71=7,E79-37,\"\")","v":0}]
["Dato","Møde-gå",null,"Pause","Timer",null,null,{"$f":"IF(G91=\"\",\"Ugen er IKKE skrevet \",\"Ugen er skrevet\")","v":"Ugen er skrevet"}]
["Uge 34",null,null,null,null,{"$f":"COUNT(D83:D89)","v":7}]
["2012-08-20","FRI",null,"00:00:00","00:00:00"]
["2012-08-21","07:00:00","16:15:00","00:00:00",{"$f":"SUM((C84-B84)-D84)","v":"09:15:00"}]
["2012-08-22","08:00:00","16:00:00","00:30:00","07:30:00"]
["2012-08-23","08:00:00","16:00:00","00:00:00","08:00:00"]
["2012-08-24","06:00:00","14:30:00","00:30:00","08:00:00"]
["2012-08-25","00:00:00","00:00:00","00:00:00","00:00:00"]
["2012-08-26","00:00:00","00:00:00","00:00:00","00:00:00"]
["Timer på ugen:",null,null,null,{"$f":"SUM(E83:E89)*24","v":32.75}]
["Timer til afspadsering:",null,null,null,null,null,{"$f":"IF(F82=7,E90-37,\"\")","v":-4.25}]
["Dato","Møde-gå",null,"Pause","Timer",null,null,"Ugen er skrevet"]
["Uge 35",null,null,null,null,{"$f":"COUNT(D94:D100)","v":7}]
["2012-08-27","08:00:00","16:00:00","00:00:00",{"$f":"SUM((C94-B94)-D94)","v":"08:00:00"}]
["2012-08-28","06:00:00","15:00:00","00:00:00","09:00:00"]
["2012-08-29","06:00:00","16:00:00","00:30:00","09:30:00"]
["2012-08-30","06:00:00","15:00:00","00:30:00","08:30:00"]
["2012-08-31","06:00:00","14:15:00","00:00:00","08:15:00"]
["2012-09-01","00:00:00","00:00:00","00:00:00","00:00:00"]
["2012-09-02","00:00:00","00:00:00","00:00:00","00:00:00"]
["Timer på ugen:",null,null,null,{"$f":"SUM(E94:E100)*24","v":43.25}]
["Timer til afspadsering:",null,null,null,null,null,{"$f":"IF(F93=7,E101-37,\"\")","v":6.25}]
["Dato","Møde-gå",null,"Pause","Timer",null,null,"Ugen er skrevet"]
["Uge 36",null,null,null,null,{"$f":"COUNT(D105:D111)","v":7}]
["2012-09-03","06:00:00","16:00:00","00:30:00",{"$f":"SUM((C105-B105)-D105)","v":"09:30:00"}]
["2012-09-04","06:00:00","14:00:00","00:00:00","08:00:00"]
["2012-09-05","06:00:00","16:00:00","00:00:00","10:00:00"]
["2012-09-06","FRI",null,"00:00:00","00:00:00"]
["2012-09-07","06:00:00","15:30:00","00:30:00","09:00:00"]
["2012-09-08","00:00:00","00:00:00","00:00:00","00:00:00"]
["2012-09-09","00:00:00","00:00:00","00:00:00","00:00:00"]
["Timer på ugen:",null,null,null,{"$f":"SUM(E105:E111)*24","v":36.5}]
["Timer til afspadsering:",null,null,null,null,null,{"$f":"IF(F104=7,E112-37,\"\")","v":-0.5}]
["Dato","Møde-gå",null,"Pause","Timer",null,null,"Ugen er skrevet"]
["Uge 37",null,null,null,null,{"$f":"COUNT(D116:D122)","v":7}]
["2012-09-10","FRI",null,"00:00:00","00:00:00"]
["2012-09-11","06:00:00","14:00:00","00:00:00",{"$f":"SUM(C117-B117-D117)","v":"08:00:00"}]
["2012-09-12","06:00:00","16:00:00","00:30:00",{"$f":"SUM(C118-B118-D118)","v":"09:30:00"}]
["2012-09-13","06:00:00","16:00:00","00:30:00","09:30:00"]
["2012-09-14","06:00:00","15:00:00","00:30:00","08:30:00"]
["2012-09-15","00:00:00","00:00:00","00:00:00","00:00:00"]
["2012-09-16","00:00:00","00:00:00","00:00:00","00:00:00"]
["Timer på ugen:",null,null,null,{"$f":"SUM(E116:E122)*24","v":35.5}]
["Timer til afspadsering:",null,null,null,null,null,{"$f":"IF(F115=7,E123-37,\"\")","v":-1.5}]
["Dato","Møde-gå",null,"Pause","Timer",null,null,"Ugen er skrevet"]
["Uge 38",null,null,null,null,{"$f":"COUNT(D127:D133)","v":7}]
["2012-09-17","FRI",null,"00:00:00","00:00:00"]
["2012-09-18","Syg",null,"00:00:00","07:30:00"]
["2012-09-19","06:00:00","16:00:00","00:00:00",{"$f":"SUM((C129-B129)-D129)","v":"10:00:00"}]
["2012-09-20","06:00:00","16:00:00","00:00:00","10:00:00"]
["2012-09-21","FRI","00:00:00","00:00:00","00:00:00"]
["2012-09-22","00:00:00","00:00:00","00:00:00",{"$f":"SUM((C132-B132)-D132)","v":"00:00:00"}]
["2012-09-23","00:00:00","00:00:00","00:00:00","00:00:00"]
["Timer på ugen:",null,null,null,{"$f":"SUM(E127:E133)*24","v":27.5}]
["Timer til afspadsering:",null,null,null,null,null,{"$f":"IF(F126=7,E134-37,\"\")","v":-9.5}]
["Dato","Møde-gå",null,"Pause","Timer",null,null,{"$f":"IF(G146=\"\",\"Ugen er IKKE skrevet \",\"Ugen er skrevet\")","v":"Ugen er skrevet"}]
["Uge 39",null,null,null,null,{"$f":"COUNT(D138:D144)","v":7}]
["2012-09-24","06:00:00","16:00:00","00:30:00",{"$f":"SUM((C138-B138)-D138)","v":"09:30:00"}]
["2012-09-25","06:00:00","14:15:00","00:00:00","08:15:00"]
["2012-09-26","06:15:00","16:15:00","00:30:00","09:30:00"]
["2012-09-27","06:15:00","16:00:00","00:30:00","09:15:00"]
["2012-09-28","06:00:00","16:15:00","00:00:00","10:15:00"]
["2012-09-29","00:00:00","00:00:00","00:00:00","00:00:00"]
["2012-09-30","00:00:00","00:00:00","00:00:00","00:00:00"]
["Timer på ugen:",null,null,null,{"$f":"SUM(E138:E144)*24","v":46.75}]
["Timer til afspadsering:",null,null,null,null,null,{"$f":"IF(F137=7,E145-37,\"\")","v":9.75}]

{"sheet":"Oktober-November-December","index":3,"n_rows":145,"n_cols":8,"rows_kept":145,"cut":false,"hidden":false,"merged":[[2,7,12,7],[3,0,3,4],[11,0,11,3],[12,0,12,4],[0,0,0,3],[1,0,1,3],[35,7,45,7],[36,0,36,4],[44,0,44,3],[45,0,45,4],[46,7,56,7],[47,0,47,4],[55,0,55,3],[56,0,56,4],[57,7,67,7],[58,0,58,4],[66,0,66,3],[67,0,67,4],[68,7,78,7],[69,0,69,4],[77,0,77,3],[78,0,78,4],[13,7,23,7],[14,0,14,4],[22,0,22,3],[23,0,23,4],[123,7,133,7],[124,0,124,4],[132,0,132,3],[133,0,133,4],[101,7,111,7],[102,0,102,4],[110,0,110,3],[111,0,111,4],[112,7,122,7],[113,0,113,4],[121,0,121,3],[122,0,122,4],[24,7,34,7],[25,0,25,4],[33,0,33,3],[34,0,34,4],[134,7,144,7],[135,0,135,4],[143,0,143,3],[144,0,144,4],[79,7,89,7],[80,0,80,4],[88,0,88,3],[89,0,89,4],[90,7,100,7],[91,0,91,4],[99,0,99,3],[100,0,100,4]]}
["Timer til afspadsering:",null,null,null,{"$f":"SUM(G:G)+E2","v":48.499999999999993}]
["Overført fra forrige måned",null,null,null,{"$f":"('Juli-August-September'!E1)","v":20.749999999999993}]
["Dato","Møde-gå",null,"Pause","Timer",null,null,{"$f":"IF(G13=\"\",\"Ugen er IKKE skrevet \",\"Ugen er skrevet\")","v":"Ugen er skrevet"}]
["Uge 40",null,null,null,null,{"$f":"COUNT(D5:D11)","v":7}]
["2012-10-01","06:00:00","15:00:00","00:30:00",{"$f":"SUM((C5-B5)-D5)","v":"08:30:00"}]
["2012-10-02","FRI",null,"00:00:00","00:00:00"]
["2012-10-03","09:15:00","16:00:00","00:00:00","06:45:00"]
["2012-10-04","06:00:00","16:00:00","00:30:00","09:30:00"]
["2012-10-05","06:00:00","15:00:00","00:00:00","09:00:00"]
["2012-10-06","00:00:00","00:00:00","00:00:00","00:00:00"]
["2012-10-07","00:00:00","00:00:00","00:00:00","00:00:00"]
["Timer på ugen:",null,null,null,{"$f":"SUM(E5:E11)*24","v":33.75}]
["Timer til afspadsering:",null,null,null,null,null,{"$f":"IF(F4=7,E12-37,\"\")","v":-3.25}]
["Dato","Møde-gå",null,"Pause","Timer",null,null,{"$f":"IF(G24=\"\",\"Ugen er IKKE skrevet \",\"Ugen er skrevet\")","v":"Ugen er skrevet"}]
["Uge 41",null,null,null,null,{"$f":"COUNT(D16:D22)","v":7}]
["2012-10-08","06:00:00","16:00:00","00:00:00",{"$f":"SUM((C16-B16)-D16)","v":"10:00:00"}]
["2012-10-09","06:00:00","14:15:00","00:30:00","07:45:00"]
["2012-10-10","09:00:00","16:00:00","00:30:00","06:30:00"]
["2012-10-11","06:00:00","15:45:00","00:30:00","09:15:00"]
["2012-10-12","06:00:00","15:00:00","00:30:00","08:30:00"]
["2012-10-13","00:00:00","00:00:00","00:00:00","00:00:00"]
["2012-10-14","00:00:00","00:00:00","00:00:00","00:00:00"]
["Timer på ugen:",null,null,null,{"$f":"SUM(E16:E22)*24","v":42}]
["Timer til afspadsering:",null,null,null,null,null,{"$f":"IF(F15=7,E23-37,\"\")","v":5}]
["Dato","Møde-gå",null,"Pause","Timer",null,null,"Ugen er skrevet"]
["Uge 42",null,null,null,null,{"$f":"COUNT(D27:D33)","v":7}]
["2012-10-15","06:00:00","16:15:00","00:30:00",{"$f":"SUM((C27-B27)-D27)","v":"09:45:00"}]
["2012-10-16","06:00:00","17:15:00","00:00:00","11:15:00"]
["2012-10-17","06:00:00","16:30:00","00:00:00","10:30:00"]
["2012-10-18","06:00:00","16:15:00","00:00:00","10:15:00"]
["2012-10-19","06:00:00","15:15:00","00:30:00","08:45:00"]
["2012-10-20","00:00:00","00:00:00","00:00:00","00:00:00"]
["2012-10-21","00:00:00","00:00:00","00:00:00","00:00:00"]
["Timer på ugen:",null,null,null,{"$f":"SUM(E27:E33)*24","v":50.500000000000007}]
["Timer til afspadsering:",null,null,null,null,null,{"$f":"IF(F26=7,E34-37,\"\")","v":13.500000000000007}]
["Dato","Møde-gå",null,"Pause","Timer",null,null,"Ugen er skrevet"]
["Uge 43",null,null,null,null,{"$f":"COUNT(D38:D44)","v":7}]
["2012-10-22","06:00:00","16:00:00","00:00:00",{"$f":"SUM((C38-B38)-D38)","v":"10:00:00"}]
["2012-10-23","06:00:00","16:00:00","00:30:00","09:30:00"]
["2012-10-24","FRI",null,"00:00:00","00:00:00"]
["2012-10-25","07:30:00","16:00:00","00:30:00","08:00:00"]
["2012-10-26","06:15:00","12:30:00","00:00:00","06:15:00"]
["2012-10-27","00:00:00","00:00:00","00:00:00","00:00:00"]
["2012-10-28","00:00:00","00:00:00","00:00:00","00:00:00"]
["Timer på ugen:",null,null,null,{"$f":"SUM(E38:E44)*24","v":33.75}]
["Timer til afspadsering:",null,null,null,null,null,{"$f":"IF(F37=7,E45-37,\"\")","v":-3.25}]
["Dato","Møde-gå",null,"Pause","Timer",null,null,"Ugen er skrevet"]
["Uge 44",null,null,null,null,{"$f":"COUNT(D49:D55)","v":7}]
["2012-10-29","07:15:00","15:00:00","00:00:00",{"$f":"SUM((C49-B49)-D49)","v":"07:45:00"}]
["2012-10-30","06:00:00","14:30:00","00:30:00","08:00:00"]
["2012-10-31","07:00:00","16:00:00","00:00:00","09:00:00"]
["2012-11-01","06:00:00","16:00:00","00:30:00","09:30:00"]
["2012-11-02","06:00:00","15:00:00","00:30:00","08:30:00"]
["2012-11-03","00:00:00","00:00:00","00:00:00","00:00:00"]
["2012-11-04","00:00:00","00:00:00","00:00:00","00:00:00"]
["Timer på ugen:",null,null,null,{"$f":"SUM(E49:E55)*24","v":42.75}]
["Timer til afspadsering:",null,null,null,null,null,{"$f":"IF(F48=7,E56-37,\"\")","v":5.75}]
["Dato","Møde-gå",null,"Pause","Timer",null,null,"Ugen er skrevet"]
["Uge 45",null,null,null,null,{"$f":"COUNT(D60:D66)","v":7}]
["2012-11-05","07:15:00","15:00:00","00:00:00",{"$f":"SUM((C60-B60)-D60)","v":"07:45:00"}]
["2012-11-06","06:00:00","14:30:00","03:00:00","05:30:00"]
["2012-11-07","FRI",null,"00:00:00","00:00:00"]
["2012-11-08","06:00:00","16:00:00","00:30:00","09:30:00"]
["2012-11-09","06:00:00","15:15:00","00:30:00","08:45:00"]
["2012-11-10","00:00:00","00:00:00","00:00:00","00:00:00"]
["2012-11-11","00:00:00","00:00:00","00:00:00","00:00:00"]
["Timer på ugen:",null,null,null,{"$f":"SUM(E60:E66)*24","v":31.499999999999993}]
["Timer til afspadsering:",null,null,null,null,null,{"$f":"IF(F59=7,E67-37,\"\")","v":-5.5000000000000071}]
["Dato","Møde-gå",null,"Pause","Timer",null,null,"Ugen er skrevet"]
["Uge 46",null,null,null,null,{"$f":"COUNT(D71:D77)","v":7}]
["2012-11-12","06:00:00","15:00:00","00:30:00",{"$f":"SUM((C71-B71)-D71)","v":"08:30:00"}]
["2012-11-13","Syg",null,"00:00:00","07:30:00"]
["2012-11-14","06:00:00","16:00:00","00:30:00","09:30:00"]
["2012-11-15","06:00:00","14:30:00","00:30:00","08:00:00"]
["2012-11-16","06:00:00","15:00:00","00:30:00","08:30:00"]
["2012-11-17","00:00:00","00:00:00","00:00:00","00:00:00"]
["2012-11-18","00:00:00","00:00:00","00:00:00","00:00:00"]
["Timer på ugen:",null,null,null,{"$f":"SUM(E71:E77)*24","v":42}]
["Timer til afspadsering:",null,null,null,null,null,{"$f":"IF(F70=7,E78-37,\"\")","v":5}]
["Dato","Møde-gå",null,"Pause","Timer",null,null,{"$f":"IF(G90=\"\",\"Ugen er IKKE skrevet \",\"Ugen er skrevet\")","v":"Ugen er skrevet"}]
["Uge 47",null,null,null,null,{"$f":"COUNT(D82:D88)","v":7}]
["2012-11-19","07:30:00","16:00:00","00:30:00",{"$f":"SUM((C82-B82)-D82)","v":"08:00:00"}]
["2012-11-20","08:15:00","15:00:00","00:30:00","06:15:00"]
["2012-11-21","06:00:00","16:15:00","00:30:00","09:45:00"]
["2012-11-22","06:00:00","16:00:00","00:30:00","09:30:00"]
["2012-11-23","06:00:00","15:00:00","00:30:00","08:30:00"]
["2012-11-24","00:00:00","00:00:00","00:00:00","00:00:00"]
["2012-11-25","00:00:00","00:00:00","00:00:00","00:00:00"]
["Timer på ugen:",null,null,null,{"$f":"SUM(E82:E88)*24","v":42}]
["Timer til afspadsering:",null,null,null,null,null,{"$f":"IF(F81=7,E89-37,\"\")","v":5}]
["Dato","Møde-gå",null,"Pause","Timer",null,null,{"$f":"IF(G101=\"\",\"Ugen er IKKE skrevet \",\"Ugen er skrevet\")","v":"Ugen er skrevet"}]
["Uge 48",null,null,null,null,{"$f":"COUNT(D93:D99)","v":7}]
["2012-11-26","06:00:00","16:00:00","00:30:00",{"$f":"SUM((C93-B93)-D93)","v":"09:30:00"}]
["2012-11-27","Syg",null,"00:00:00","07:30:00"]
["2012-11-28","Syg",null,"00:00:00","07:30:00"]
["2012-11-29","06:00:00","16:00:00","00:30:00","09:30:00"]
["2012-11-30","06:00:00","15:00:00","00:30:00","08:30:00"]
["2012-12-01","00:00:00","00:00:00","00:00:00","00:00:00"]
["2012-12-02","00:00:00","00:00:00","00:00:00","00:00:00"]
["Timer på ugen:",null,null,null,{"$f":"SUM(E93:E99)*24","v":42.5}]
["Timer til afspadsering:",null,null,null,null,null,{"$f":"IF(F92=7,E100-37,\"\")","v":5.5}]
["Dato","Møde-gå",null,"Pause","Timer",null,null,{"$f":"IF(G112=\"\",\"Ugen er IKKE skrevet \",\"Ugen er skrevet\")","v":"Ugen er IKKE skrevet "}]
["Uge 49",null,null,null,null,{"$f":"COUNT(D104:D110)","v":6}]
["2012-12-03","06:00:00","16:15:00","00:30:00",{"$f":"SUM((C104-B104)-D104)","v":"09:45:00"}]
["2012-12-04","07:30:00","16:00:00","00:30:00","08:00:00"]
["2012-12-05","06:30:00","17:15:00","00:30:00","10:15:00"]
["2012-12-06","06:15:00","13:00:00","00:30:00","06:15:00"]
["2012-12-07","06:00:00","13:30:00",null,"07:30:00"]
["2012-12-08","00:00:00","00:00:00","00:00:00","00:00:00"]
["2012-12-09","00:00:00","00:00:00","00:00:00","00:00:00"]
["Timer på ugen:",null,null,null,{"$f":"SUM(E104:E110)*24","v":41.75}]
["Timer til afspadsering:",null,null,null,null,null,{"$f":"IF(F103=7,E111-37,\"\")","v":""}]
["Dato","Møde-gå",null,"Pause","Timer",null,null,"Ugen er IKKE skrevet "]
["Uge 50",null,null,null,null,{"$f":"COUNT(D115:D121)","v":2}]
["2012-12-10",null,null,null,{"$f":"SUM((C115-B115)-D115)","v":"00:00:00"}]
["2012-12-11",null,null,null,"00:00:00"]
["2012-12-12",null,null,null,"00:00:00"]
["2012-12-13",null,null,null,"00:00:00"]
["2012-12-14",null,null,null,"00:00:00"]
["2012-12-15","00:00:00","00:00:00","00:00:00","00:00:00"]
["2012-12-16","00:00:00","00:00:00","00:00:00","00:00:00"]
["Timer på ugen:",null,null,null,{"$f":"SUM(E115:E121)*24","v":0}]
["Timer til afspadsering:",null,null,null,null,null,{"$f":"IF(F114=7,E122-37,\"\")","v":""}]
["Dato","Møde-gå",null,"Pause","Timer",null,null,{"$f":"IF(G134=\"\",\"Ugen er IKKE skrevet \",\"Ugen er skrevet\")","v":"Ugen er IKKE skrevet "}]
["Uge 51",null,null,null,null,{"$f":"COUNT(D126:D132)","v":2}]
["2012-12-17",null,null,null,{"$f":"SUM((C126-B126)-D126)","v":"00:00:00"}]
["2012-12-18",null,null,null,"00:00:00"]
["2012-12-19",null,null,null,"00:00:00"]
["2012-12-20",null,null,null,"00:00:00"]
["2012-12-21",null,null,null,"00:00:00"]
["2012-12-22","00:00:00","00:00:00","00:00:00","00:00:00"]
["2012-12-23","00:00:00","00:00:00","00:00:00","00:00:00"]
["Timer på ugen:",null,null,null,{"$f":"SUM(E126:E132)*24","v":0}]
["Timer til afspadsering:",null,null,null,null,null,{"$f":"IF(F125=7,E133-37,\"\")","v":""}]
["Dato","Møde-gå",null,"Pause","Timer",null,null,{"$f":"IF(G145=\"\",\"Ugen er IKKE skrevet \",\"Ugen er skrevet\")","v":"Ugen er IKKE skrevet "}]
["Uge 52",null,null,null,null,{"$f":"COUNT(D137:D143)","v":2}]
["2012-12-24",null,null,null,{"$f":"SUM((C137-B137)-D137)","v":"00:00:00"}]
["2012-12-25",null,null,null,"00:00:00"]
["2012-12-26",null,null,null,"00:00:00"]
["2012-12-27",null,null,null,"00:00:00"]
["2012-12-28",null,null,null,"00:00:00"]
["2012-12-29","00:00:00","00:00:00","00:00:00","00:00:00"]
["2012-12-30","00:00:00","00:00:00","00:00:00","00:00:00"]
["Timer på ugen:",null,null,null,{"$f":"SUM(E137:E143)*24","v":0}]
["Timer til afspadsering:",null,null,null,null,null,{"$f":"IF(F136=7,E144-37,\"\")","v":""}]